Opened 11 years ago

Closed 11 years ago

Last modified 11 years ago

#9134 closed defect (duplicate)

sage-4.4.3.alpha3: os x ppc 10.4 -- error building pynac

Reported by: was Owned by: GeorgSWeber
Priority: blocker Milestone: sage-duplicate/invalid/wontfix
Component: build Keywords:
Cc: Merged in:
Authors: Reviewers:
Report Upstream: N/A Work issues:
Branch: Commit:
Dependencies: Stopgaps:

Status badges


libtool: link: g++ -dynamiclib  -o .libs/libpynac-0.2.0.dylib  .libs/py_funcs.o .libs/add.o .libs/archive.o .libs/basic.o .libs/clifford.o .libs/color.o .libs/constant.o .libs/ex.o .libs/expair.o .libs/expairseq.o .libs/exprseq.o .libs/fail.o .libs/fderivative.o .libs/function.o .libs/idx.o .libs/indexed.o .libs/inifcns.o .libs/inifcns_trans.o .libs/inifcns_gamma.o .libs/inifcns_nstdsums.o .libs/integral.o .libs/lst.o .libs/matrix.o .libs/mul.o .libs/ncmul.o .libs/normal.o .libs/numeric.o .libs/operators.o .libs/power.o .libs/registrar.o .libs/relational.o .libs/remember.o .libs/pseries.o .libs/print.o .libs/symbol.o .libs/symmetry.o .libs/tensor.o .libs/utils.o .libs/wildcard.o   -L/home/wstein/screen/varro/sage-4.4.3.alpha3/local/lib/python2.6/config -lpython2.6 -ldl    -install_name  /home/wstein/screen/varro/sage-4.4.3.alpha3/local/lib/libpynac-0.2.0.dylib -compatibility_version 1 -current_version 1.0 -Wl,-single_module
ld: Undefined symbols:
/usr/libexec/gcc/powerpc-apple-darwin8/4.0.1/libtool: internal link edit command failed
make[4]: *** [] Error 1
make[3]: *** [all-recursive] Error 1
make[2]: *** [all] Error 2   
Error building pynac.

Change History (3)

comment:1 Changed 11 years ago by GeorgSWeber

Duplicate to #9135 (where a more informative error message is pasted), please close one of the two, preferably this one here.

comment:2 Changed 11 years ago by was

  • Resolution set to duplicate
  • Status changed from new to closed

comment:3 Changed 11 years ago by mvngu

  • Milestone changed from sage-4.4.3 to sage-duplicate/invalid/wontfix
Note: See TracTickets for help on using tickets.