Opened 12 years ago

Closed 12 years ago

Last modified 12 years ago

#6970 closed defect (duplicate)

port R spkg to os x 10.6

Reported by: was Owned by: tbd
Priority: blocker Milestone: sage-duplicate/invalid/wontfix
Component: build Keywords:
Cc: Merged in:
Authors: Reviewers:
Report Upstream: Work issues:
Branch: Commit:
Dependencies: Stopgaps:

Status badges

Description


Change History (3)

comment:1 Changed 12 years ago by was

The error message is:

...
stration.o relop.o rlocale.o saveload.o scan.o seq.o serialize.o size.o sort.o source.o split.o sprintf.o startup.o subassign.o subscript.o subset.o summary.o sysutils.o unique.o util.o version.o vfonts.o xxxpr.o   `ls ../appl/*.o ../nmath/*.o ../unix/*.o  2>/dev/null|grep -v /ext-`  -L/Users/wstein/sage/build/64bit/sage-4.1.2.alpha1/local/lib/gcc/i686-apple-darwin8/4.2.3/x86_64 -L/Users/wstein/sage/build/64bit/sage-4.1.2.alpha1/local/lib/gcc/i686-apple-darwin8/4.2.3 -L/Users/wstein/sage/build/64bit/sage-4.1.2.alpha1/local/lib/gcc -L/usr/local/lib -lgfortran -lgcc_s.10.4  ../extra/zlib/libz.a ../extra/bzip2/libbz2.a ../extra/pcre/libpcre.a  ../extra/intl/libintl.a -liconv  -Wl,-framework -Wl,CoreFoundation -lreadline  -lm
ld: symbol dyld_stub_binding_helper not defined (usually in crt1.o/dylib1.o/bundle1.o)
collect2: ld returned 1 exit status
make[5]: *** [libR.dylib] Error 1
make[4]: *** [R] Error 2
make[3]: *** [R] Error 1
make[2]: *** [R] Error 1
Error building R.

comment:2 Changed 12 years ago by was

  • Resolution set to duplicate
  • Status changed from new to closed

#6972 fixes everything so R works with 10.6

comment:3 Changed 12 years ago by mvngu

  • Milestone changed from sage-4.1.2 to sage-duplicate/invalid/wontfix
Note: See TracTickets for help on using tickets.