Opened 14 years ago

Closed 12 years ago

#1936 closed defect (wontfix)

r-2.6.1.p13: spkg-check fails on OSX 10.5, Linux

Reported by: mabshoff Owned by: mabshoff
Priority: major Milestone: sage-duplicate/invalid/wontfix
Component: spkg-check Keywords:
Cc: Merged in:
Authors: Reviewers:
Report Upstream: N/A Work issues:
Branch: Commit:
Dependencies: Stopgaps:

Status badges

Description

On bsd the following happens:

     missing link(s):  methods methods
  zScript                           text    html    latex   example
  zpackages                         text    html    latex   example
  zutils                            text    html    latex
  Signals                           text    html    latex
make[5]: *** [test-Examples-Base] Error 2
make[4]: *** [test-Examples] Error 2
make[3]: *** [test-all-basics] Error 1
make[2]: *** [check] Error 2
*************************************
Error testing package ** r-2.6.1.p11 **
*************************************

Cheers,

Michael

Change History (3)

comment:1 Changed 14 years ago by mabshoff

  • Component changed from packages to sage-check

comment:2 Changed 14 years ago by mabshoff

  • Summary changed from r-2.6.1.p11: sage-check fails on OSX 10.5 to r-2.6.1.p13: spkg-check fails on OSX 10.5, Linux

The exact same issue happens on sage.math.

Cheers,

Michael

comment:3 Changed 12 years ago by mvngu

  • Milestone changed from sage-4.3.2 to sage-duplicate/invalid/wontfix
  • Report Upstream set to N/A
  • Resolution set to wontfix
  • Status changed from new to closed

As of Sage 4.3.2 (see #6532), the R spkg has been upgraded to version 2.10.1. I'm closing this ticket as wontfix. If the testsuite of R 2.10.1 fails, one needs to open a ticket for that.

Note: See TracTickets for help on using tickets.