Changes between Initial Version and Version 4 of Ticket #15268


Ignore:
Timestamp:
10/10/13 12:20:04 (8 years ago)
Author:
jpflori
Comment:

Disabling ada by passing --without-ada solves this, but it fails when building the wide version of ncurses (enabled by #15080):

/infres/post/flori/sage-5.12+infres1/local/bin/g++ -I../c++ -I../include -I../../c++ -DHAVE_CONFIG_H   -D__EXTENSIONS__ -D_XOPEN_SOURCE_EXTENDED -D_FILE_OFFSET_BITS=64  -DNDEBUG -I. -I../include -I../../c++/../include -I/infres/post/flori/sage-5.12+infres1/local/include  -fPIC -c ../../c++/demo.cc -o ../obj_s/demo.o
In file included from /infres/post/flori/sage-5.12+infres1/local/lib/gcc/sparc-sun-solaris2.10/4.7.3/include-fixed/iso/stdlib_iso.h:39:0,
                 from /usr/include/stdlib.h:18,
                 from ../../c++/internal.h:53,
                 from ../../c++/cursesm.cc:34:
/infres/post/flori/sage-5.12+infres1/local/lib/gcc/sparc-sun-solaris2.10/4.7.3/include-fixed/sys/feature_tests.h:341:2: error: #error "Compiler or options invalid for pre-UNIX 03 X/Open applications  and pre-2001 POSIX applications"
In file included from /infres/post/flori/sage-5.12+infres1/local/lib/gcc/sparc-sun-solaris2.10/4.7.3/include-fixed/iso/stdlib_iso.h:39:0,
                 from /usr/include/stdlib.h:18,
                 from ../../c++/internal.h:53,
                 from ../../c++/cursesw.cc:42:
/infres/post/flori/sage-5.12+infres1/local/lib/gcc/sparc-sun-solaris2.10/4.7.3/include-fixed/sys/feature_tests.h:341:2: error: #error "Compiler or options invalid for pre-UNIX 03 X/Open applications  and pre-2001 POSIX applications"
In file included from /infres/post/flori/sage-5.12+infres1/local/lib/gcc/sparc-sun-solaris2.10/4.7.3/include-fixed/iso/stdlib_iso.h:39:0,
                 from /usr/include/stdlib.h:18,
                 from ../../c++/internal.h:53,
                 from ../../c++/cursesp.cc:34:
/infres/post/flori/sage-5.12+infres1/local/lib/gcc/sparc-sun-solaris2.10/4.7.3/include-fixed/sys/feature_tests.h:341:2: error: #error "Compiler or options invalid for pre-UNIX 03 X/Open applications  and pre-2001 POSIX applications"
In file included from /infres/post/flori/sage-5.12+infres1/local/lib/gcc/sparc-sun-solaris2.10/4.7.3/include-fixed/iso/stdlib_iso.h:39:0,
                 from /usr/include/stdlib.h:18,
                 from ../../c++/internal.h:53,
                 from ../../c++/cursespad.cc:34:
/infres/post/flori/sage-5.12+infres1/local/lib/gcc/sparc-sun-solaris2.10/4.7.3/include-fixed/sys/feature_tests.h:341:2: error: #error "Compiler or options invalid for pre-UNIX 03 X/Open applications  and pre-2001 POSIX applications"
In file included from /infres/post/flori/sage-5.12+infres1/local/lib/gcc/sparc-sun-solaris2.10/4.7.3/include-fixed/iso/stdlib_iso.h:39:0,
                 from /usr/include/stdlib.h:18,
                 from ../../c++/internal.h:53,
                 from ../../c++/cursesf.cc:34:
/infres/post/flori/sage-5.12+infres1/local/lib/gcc/sparc-sun-solaris2.10/4.7.3/include-fixed/sys/feature_tests.h:341:2: error: #error "Compiler or options invalid for pre-UNIX 03 X/Open applications  and pre-2001 POSIX applications"
In file included from /infres/post/flori/sage-5.12+infres1/local/lib/gcc/sparc-sun-solaris2.10/4.7.3/include-fixed/iso/stdlib_iso.h:39:0,
                 from /usr/include/stdlib.h:18,
                 from ../../c++/internal.h:53,
                 from ../../c++/cursesapp.cc:35:
/infres/post/flori/sage-5.12+infres1/local/lib/gcc/sparc-sun-solaris2.10/4.7.3/include-fixed/sys/feature_tests.h:341:2: error: #error "Compiler or options invalid for pre-UNIX 03 X/Open applications  and pre-2001 POSIX applications"
In file included from /infres/post/flori/sage-5.12+infres1/local/lib/gcc/sparc-sun-solaris2.10/4.7.3/include-fixed/iso/stdlib_iso.h:39:0,
                 from /usr/include/stdlib.h:18,
                 from ../../c++/internal.h:53,
                 from ../../c++/demo.cc:41:
/infres/post/flori/sage-5.12+infres1/local/lib/gcc/sparc-sun-solaris2.10/4.7.3/include-fixed/sys/feature_tests.h:341:2: error: #error "Compiler or options invalid for pre-UNIX 03 X/Open applications  and pre-2001 POSIX applications"
In file included from /infres/post/flori/sage-5.12+infres1/local/lib/gcc/sparc-sun-solaris2.10/4.7.3/include-fixed/iso/stdlib_iso.h:39:0,
                 from /usr/include/stdlib.h:18,
                 from ../../c++/internal.h:53,
                 from ../../c++/cursesmain.cc:34:
/infres/post/flori/sage-5.12+infres1/local/lib/gcc/sparc-sun-solaris2.10/4.7.3/include-fixed/sys/feature_tests.h:341:2: error: #error "Compiler or options invalid for pre-UNIX 03 X/Open applications  and pre-2001 POSIX applications"
In file included from /infres/post/flori/sage-5.12+infres1/local/lib/gcc/sparc-sun-solaris2.10/4.7.3/include-fixed/iso/stdlib_iso.h:39:0,
                 from /usr/include/stdlib.h:18,
                 from ../../c++/internal.h:53,
                 from ../../c++/cursslk.cc:34:
/infres/post/flori/sage-5.12+infres1/local/lib/gcc/sparc-sun-solaris2.10/4.7.3/include-fixed/sys/feature_tests.h:341:2: error: #error "Compiler or options invalid for pre-UNIX 03 X/Open applications  and pre-2001 POSIX applications"
make[1]: *** [../obj_s/cursesp.o] Error 1
make[1]: *** Waiting for unfinished jobs....
make[1]: *** [../obj_s/cursesmain.o] Error 1
make[1]: *** [../obj_s/cursslk.o] Error 1
make: *** [all] Error 2
Error building ncurses (wide).

Maybe this Solaris install is ill configured.

Legend:

Unmodified
Added
Removed
Modified
  • Ticket #15268 – Description

    initial v4  
    1 I get the following errors:
     1I get the following errors on a system Solaris/SPARC (SunOS whocares 5.10 Generic_139555-08 sun4v sparc SUNW,T5140):
    22{{{
    33gnatmake -P../../../Ada95/src/library.gpr -XBUILD_DIR=`cd ..;pwd` -XSOURCE_DIR=`cd ..;pwd` -XSOURCE_DIR2=`cd ../../../Ada95/src;pwd` -XLIB_NAME=AdaCurses -XSONAME=libAdaCurses.so.1 -XLIB_KIND=static
     
    2525Error building ncurses (narrow).
    2626}}}
    27 
    2827(#15080 does not help.)