Opened 15 years ago

Closed 12 years ago

#1438 closed defect (fixed)

GNUTLS fails to build on RHEL 4 (texinfo related)

Reported by: mabshoff Owned by: mabshoff
Priority: major Milestone: sage-duplicate/invalid/wontfix
Component: packages: standard Keywords:
Cc: Merged in:
Authors: Reviewers:
Report Upstream: N/A Work issues:
Branch: Commit:
Dependencies: Stopgaps:

Status badges

Description

The issue was reported by Bromskloss:

if (/bin/sh /misc/hacks/vol/sage/sage-2.8.15/spkg/build/gnutls-1.6.3/src/missing --run makeinfo --version) >/dev/null 2>&1; then \
  for f in gnutls.info gnutls.info-[0-9] gnutls.info-[0-9][0-9] gnutls.i[0-9] gnutls.i[0-9][0-9]; do \
    if test -f $f; then mv $f $backupdir; restore=mv; else :; fi; \
  done; \
else :; fi && \
cd "$am__cwd"; \
if /bin/sh /misc/hacks/vol/sage/sage-2.8.15/spkg/build/gnutls-1.6.3/src/missing --run makeinfo -I ../doc  -I . \
 -o gnutls.info gnutls.texi; \
then \
  rc=0; \
  cd .; \
else \
  rc=$?; \
  cd . && \
  $restore $backupdir/* `echo "./gnutls.info" | sed 's|[^/]*$||'`; \
fi; \
rm -rf $backupdir; exit $rc
/afs/kth.se/misc/hacks/sys/vol/i386_linux6/sage/sage-2.8.15/spkg/build/gnutls-1.6.3/src/doc//signatures.texi:14: Unknown command `euro'.
/afs/kth.se/misc/hacks/sys/vol/i386_linux6/sage/sage-2.8.15/spkg/build/gnutls-1.6.3/src/doc//signatures.texi:14: Misplaced {.
/afs/kth.se/misc/hacks/sys/vol/i386_linux6/sage/sage-2.8.15/spkg/build/gnutls-1.6.3/src/doc//signatures.texi:14: Misplaced }.
/afs/kth.se/misc/hacks/sys/vol/i386_linux6/sage/sage-2.8.15/spkg/build/gnutls-1.6.3/src/doc//signatures.texi:15: Unknown command `euro'.
/afs/kth.se/misc/hacks/sys/vol/i386_linux6/sage/sage-2.8.15/spkg/build/gnutls-1.6.3/src/doc//signatures.texi:15: Misplaced {.
/afs/kth.se/misc/hacks/sys/vol/i386_linux6/sage/sage-2.8.15/spkg/build/gnutls-1.6.3/src/doc//signatures.texi:15: Misplaced }.
/afs/kth.se/misc/hacks/sys/vol/i386_linux6/sage/sage-2.8.15/spkg/build/gnutls-1.6.3/src/doc//pgp-api.texi:174: warning: unlikely character [ in @var.
/afs/kth.se/misc/hacks/sys/vol/i386_linux6/sage/sage-2.8.15/spkg/build/gnutls-1.6.3/src/doc//pgp-api.texi:174: warning: unlikely character ] in @var.
/afs/kth.se/misc/hacks/sys/vol/i386_linux6/sage/sage-2.8.15/spkg/build/gnutls-1.6.3/src/doc//pgp-api.texi:347: warning: unlikely character [ in @var.
/afs/kth.se/misc/hacks/sys/vol/i386_linux6/sage/sage-2.8.15/spkg/build/gnutls-1.6.3/src/doc//pgp-api.texi:347: warning: unlikely character ] in @var.
makeinfo: Removing output file `gnutls.info' due to errors; use --force to preserve.
make[5]: *** [gnutls.info] Error 1
make[5]: Leaving directory `/afs/kth.se/misc/hacks/sys/vol/i386_linux6/sage/sage-2.8.15/spkg/build/gnutls-1.6.3/src/doc'
make[4]: *** [all-recursive] Error 1
make[4]: Leaving directory `/afs/kth.se/misc/hacks/sys/vol/i386_linux6/sage/sage-2.8.15/spkg/build/gnutls-1.6.3/src/doc'
make[3]: *** [all-recursive] Error 1
make[3]: Leaving directory `/afs/kth.se/misc/hacks/sys/vol/i386_linux6/sage/sage-2.8.15/spkg/build/gnutls-1.6.3/src'
make[2]: *** [all] Error 2
make[2]: Leaving directory `/afs/kth.se/misc/hacks/sys/vol/i386_linux6/sage/sage-2.8.15/spkg/build/gnutls-1.6.3/src'

The problem seems to be an outdated texinfo. A solution might be to disable building the texinfo documentation.

Cheers,

Michael

Change History (1)

comment:1 Changed 12 years ago by rlm

  • Milestone changed from sage-4.5 to sage-duplicate/invalid/wontfix
  • Report Upstream set to N/A
  • Resolution set to fixed
  • Status changed from new to closed
Note: See TracTickets for help on using tickets.