Changes between Initial Version and Version 6 of Ticket #12901


Ignore:
Timestamp:
Apr 2, 2015, 2:55:00 PM (8 years ago)
Author:
Jeroen Demeyer
Comment:

Legend:

Unmodified
Added
Removed
Modified
  • Ticket #12901

    • Property Milestone changed from sage-5.11 to sage-6.4
  • Ticket #12901 – Description

    initial v6  
    22
    33{{{
    4 wstein@sage:sage-5.0.beta15-boxen-x86_64-Linux$ ./sage -t --optional devel/sage/sage/coding/linear_code.py sage -t --optional "devel/sage/sage/coding/linear_code.py" 
     4~/Installations/sage-git» sage -tp --optional=sage,gap_packages src/sage/coding
     5Running doctests with ID 2014-07-16-19-21-12-c6433e4f.
     6Sorting sources by runtime so that slower doctests are run first....
     7Doctesting 17 files using 2 threads.
     8sage -t src/sage/coding/linear_code.py
    59**********************************************************************
    6 File "/scratch/wstein/ref/sage-5.0.beta15-boxen-x86_64-Linux/devel/sage/sage/coding/linear_code.py", line 1992:
    7     sage: C.permutation_automorphism_group(algorithm="gap")  # requires optional GAP package Guava
     10File "src/sage/coding/linear_code.py", line 1416, in sage.coding.linear_code.LinearCode.decode
     11Failed example:
     12    C.decode(v, algorithm="guava")  # optional - gap_packages (Guava package)
    813Exception raised:
    914    Traceback (most recent call last):
    10       File "/scratch/wstein/ref/sage-5.0.beta15-boxen-x86_64-Linux/local/bin/ncadoctest.py", line 1231, in run_one_test
    11         self.run_one_example(test, example, filename, compileflags)
    12       File "/scratch/wstein/ref/sage-5.0.beta15-boxen-x86_64-Linux/local/bin/sagedoctest.py", line 38, in run_one_example
    13         OrigDocTestRunner.run_one_example(self, test, example, filename, compileflags)
    14       File "/scratch/wstein/ref/sage-5.0.beta15-boxen-x86_64-Linux/local/bin/ncadoctest.py", line 1172, in run_one_example
    15         compileflags, 1) in test.globs
    16       File "<doctest __main__.example_49[21]>", line 1, in <module>
    17         C.permutation_automorphism_group(algorithm="gap")  # requires optional GAP package Guava###line 1992:
    18     sage: C.permutation_automorphism_group(algorithm="gap")  # requires optional GAP package Guava
    19       File "/scratch/wstein/ref/sage-5.0.beta15-boxen-x86_64-Linux/local/lib/python/site-packages/sage/misc/decorators.py", line 687, in wrapper
    20         return func(*args, **kwds)
    21       File "/scratch/wstein/ref/sage-5.0.beta15-boxen-x86_64-Linux/local/lib/python/site-packages/sage/coding/linear_code.py", line 2033, in permutation_automorphism_group
    22         A = gap("MatrixAutomorphisms(matCwt)")
    23       File "/scratch/wstein/ref/sage-5.0.beta15-boxen-x86_64-Linux/local/lib/python/site-packages/sage/interfaces/interface.py", line 198, in __call__
    24         return cls(self, x, name=name)
    25       File "/scratch/wstein/ref/sage-5.0.beta15-boxen-x86_64-Linux/local/lib/python/site-packages/sage/interfaces/expect.py", line 1331, in __init__
    26         raise TypeError, x
    27     TypeError: Gap produced error output
    28     Error, no 1st choice method found for `MatrixAutomorphisms' on 1 arguments
    29 
    30        executing $sage24:=MatrixAutomorphisms(matCwt);;
     15      File "/home/punarbasu/Installations/sage-git/local/lib/python2.7/site-packages/sage/doctest/forker.py", line 480, in _run
     16        self.execute(example, compiled, test.globs)
     17      File "/home/punarbasu/Installations/sage-git/local/lib/python2.7/site-packages/sage/doctest/forker.py", line 839, in execute
     18        exec compiled in globs
     19      File "<doctest sage.coding.linear_code.LinearCode.decode[20]>", line 1, in <module>
     20        C.decode(v, algorithm="guava")  # optional - gap_packages (Guava package)
     21      File "/home/punarbasu/Installations/sage-git/local/lib/python2.7/site-packages/sage/coding/linear_code.py", line 1440, in decode
     22        result = gap.Decodeword(code, right_word)
     23      File "/home/punarbasu/Installations/sage-git/local/lib/python2.7/site-packages/sage/interfaces/interface.py", line 563, in __call__
     24        return self._parent.function_call(self._name, list(args), kwds)
     25      File "/home/punarbasu/Installations/sage-git/local/lib/python2.7/site-packages/sage/interfaces/gap.py", line 898, in function_call
     26        ['%s=%s'%(key,value.name()) for key, value in kwds.items()])))
     27      File "/home/punarbasu/Installations/sage-git/local/lib/python2.7/site-packages/sage/interfaces/gap.py", line 570, in eval
     28        result = Expect.eval(self, input_line, **kwds)
     29      File "/home/punarbasu/Installations/sage-git/local/lib/python2.7/site-packages/sage/interfaces/expect.py", line 1229, in eval
     30        for L in code.split('\n') if L != ''])
     31      File "/home/punarbasu/Installations/sage-git/local/lib/python2.7/site-packages/sage/interfaces/gap.py", line 771, in _eval_line
     32        raise RuntimeError(message)
     33    RuntimeError: Gap produced error output
     34    Error, List Element: <list>[2] must have an assigned value
     35       executing Decodeword($sage5,$sage27);
    3136**********************************************************************
    32 File "/scratch/wstein/ref/sage-5.0.beta15-boxen-x86_64-Linux/devel/sage/sage/coding/linear_code.py", line 1995:
    33     sage: C.permutation_automorphism_group(algorithm="gap")  # requires optional GAP package Guava
     37File "src/sage/coding/linear_code.py", line 2304, in sage.coding.linear_code.LinearCode.permutation_automorphism_group
     38Failed example:
     39    C.permutation_automorphism_group(algorithm="gap")  # optional - gap_packages (Guava package)
    3440Exception raised:
    3541    Traceback (most recent call last):
    36       File "/scratch/wstein/ref/sage-5.0.beta15-boxen-x86_64-Linux/local/bin/ncadoctest.py", line 1231, in run_one_test
    37         self.run_one_example(test, example, filename, compileflags)
    38       File "/scratch/wstein/ref/sage-5.0.beta15-boxen-x86_64-Linux/local/bin/sagedoctest.py", line 38, in run_one_example
    39         OrigDocTestRunner.run_one_example(self, test, example, filename, compileflags)
    40       File "/scratch/wstein/ref/sage-5.0.beta15-boxen-x86_64-Linux/local/bin/ncadoctest.py", line 1172, in run_one_example
    41         compileflags, 1) in test.globs
    42       File "<doctest __main__.example_49[23]>", line 1, in <module>
    43         C.permutation_automorphism_group(algorithm="gap")  # requires optional GAP package Guava###line 1995:
    44     sage: C.permutation_automorphism_group(algorithm="gap")  # requires optional GAP package Guava
    45       File "/scratch/wstein/ref/sage-5.0.beta15-boxen-x86_64-Linux/local/lib/python/site-packages/sage/misc/decorators.py", line 687, in wrapper
    46         return func(*args, **kwds)
    47       File "/scratch/wstein/ref/sage-5.0.beta15-boxen-x86_64-Linux/local/lib/python/site-packages/sage/coding/linear_code.py", line 2033, in permutation_automorphism_group
     42      File "/home/punarbasu/Installations/sage-git/local/lib/python2.7/site-packages/sage/doctest/forker.py", line 480, in _run
     43        self.execute(example, compiled, test.globs)
     44      File "/home/punarbasu/Installations/sage-git/local/lib/python2.7/site-packages/sage/doctest/forker.py", line 839, in execute
     45        exec compiled in globs
     46      File "<doctest sage.coding.linear_code.LinearCode.permutation_automorphism_group[21]>", line 1, in <module>
     47        C.permutation_automorphism_group(algorithm="gap")  # optional - gap_packages (Guava package)
     48      File "/home/punarbasu/Installations/sage-git/local/lib/python2.7/site-packages/sage/coding/linear_code.py", line 2345, in permutation_automorphism_group
    4849        A = gap("MatrixAutomorphisms(matCwt)")
    49       File "/scratch/wstein/ref/sage-5.0.beta15-boxen-x86_64-Linux/local/lib/python/site-packages/sage/interfaces/interface.py", line 198, in __call__
     50      File "/home/punarbasu/Installations/sage-git/local/lib/python2.7/site-packages/sage/interfaces/interface.py", line 199, in __call__
    5051        return cls(self, x, name=name)
    51       File "/scratch/wstein/ref/sage-5.0.beta15-boxen-x86_64-Linux/local/lib/python/site-packages/sage/interfaces/expect.py", line 1331, in __init__
    52         raise TypeError, x
     52      File "/home/punarbasu/Installations/sage-git/local/lib/python2.7/site-packages/sage/interfaces/expect.py", line 1312, in __init__
     53        self._name = parent._create(value, name=name)
     54      File "/home/punarbasu/Installations/sage-git/local/lib/python2.7/site-packages/sage/interfaces/interface.py", line 389, in _create
     55        self.set(name, value)
     56      File "/home/punarbasu/Installations/sage-git/local/lib/python2.7/site-packages/sage/interfaces/gap.py", line 1305, in set
     57        out = self._eval_line(cmd, allow_use_file=True)
     58      File "/home/punarbasu/Installations/sage-git/local/lib/python2.7/site-packages/sage/interfaces/gap.py", line 771, in _eval_line
     59        raise RuntimeError(message)
    5360    TypeError: Gap produced error output
     61    Error, no method found! For debugging hints type ?Recovery from NoMethodFound
    5462    Error, no 1st choice method found for `MatrixAutomorphisms' on 1 arguments
    55 
    5663       executing $sage26:=MatrixAutomorphisms(matCwt);;
    5764**********************************************************************
    58 1 items had failures:
    59    2 of  25 in __main__.example_49
    60 ***Test Failed*** 2 failures.
    61 For whitespace errors, see the file /home/wstein/.sage//tmp/linear_code_4858.py
    62          [14.8 s]
    63  
    64 ----------------------------------------------------------------------
    65 The following tests failed:
    66 
    67 
    68         sage -t --optional "devel/sage/sage/coding/linear_code.py"
    69 Total time for all tests: 14.9 seconds
     65File "src/sage/coding/linear_code.py", line 2306, in sage.coding.linear_code.LinearCode.permutation_automorphism_group
     66Failed example:
     67    C.permutation_automorphism_group(algorithm="gap")  # optional - gap_packages (Guava package)
     68Exception raised:
     69    Traceback (most recent call last):
     70      File "/home/punarbasu/Installations/sage-git/local/lib/python2.7/site-packages/sage/doctest/forker.py", line 480, in _run
     71        self.execute(example, compiled, test.globs)
     72      File "/home/punarbasu/Installations/sage-git/local/lib/python2.7/site-packages/sage/doctest/forker.py", line 839, in execute
     73        exec compiled in globs
     74      File "<doctest sage.coding.linear_code.LinearCode.permutation_automorphism_group[23]>", line 1, in <module>
     75        C.permutation_automorphism_group(algorithm="gap")  # optional - gap_packages (Guava package)
     76      File "/home/punarbasu/Installations/sage-git/local/lib/python2.7/site-packages/sage/coding/linear_code.py", line 2345, in permutation_automorphism_group
     77        A = gap("MatrixAutomorphisms(matCwt)")
     78      File "/home/punarbasu/Installations/sage-git/local/lib/python2.7/site-packages/sage/interfaces/interface.py", line 199, in __call__
     79        return cls(self, x, name=name)
     80      File "/home/punarbasu/Installations/sage-git/local/lib/python2.7/site-packages/sage/interfaces/expect.py", line 1312, in __init__
     81        self._name = parent._create(value, name=name)
     82      File "/home/punarbasu/Installations/sage-git/local/lib/python2.7/site-packages/sage/interfaces/interface.py", line 389, in _create
     83        self.set(name, value)
     84      File "/home/punarbasu/Installations/sage-git/local/lib/python2.7/site-packages/sage/interfaces/gap.py", line 1305, in set
     85        out = self._eval_line(cmd, allow_use_file=True)
     86      File "/home/punarbasu/Installations/sage-git/local/lib/python2.7/site-packages/sage/interfaces/gap.py", line 771, in _eval_line
     87        raise RuntimeError(message)
     88    TypeError: Gap produced error output
     89    Error, no method found! For debugging hints type ?Recovery from NoMethodFound
     90    Error, no 1st choice method found for `MatrixAutomorphisms' on 1 arguments
     91       executing $sage11:=MatrixAutomorphisms(matCwt);;
     92**********************************************************************
     932 items had failures:
     94   1 of  23 in sage.coding.linear_code.LinearCode.decode
     95   2 of  25 in sage.coding.linear_code.LinearCode.permutation_automorphism_group
     96    [398 tests, 3 failures, 36.46 s]
    7097}}}