Opened 8 years ago

Last modified 2 years ago

#11713 new defect

experimental package chomp-20100213.p2.spkg fails to build on IA64 machines

Reported by: mariah Owned by: tbd
Priority: major Milestone: sage-6.4
Component: packages: experimental Keywords:
Cc: jhpalmieri Merged in:
Authors: Reviewers:
Report Upstream: N/A Work issues:
Branch: Commit:
Dependencies: Stopgaps:

Description

The experimental package chomp-20100213.p2.spkg fails to build on IA64 machines such as skynet cleo and iras

Installing chomp-20100213.p2.spkg on sage-4.7.1 with gcc-4.6.1 gives

./sage -i ../optional/chomp-20100213.p2.spkg
Installing ../optional/chomp-20100213.p2.spkg
Calling sage-spkg on ../optional/chomp-20100213.p2.spkg
Warning: Attempted to overwrite SAGE_ROOT environment variable
chomp-20100213.p2
Machine:
Linux cleo 2.6.18-128.1.1.el5 #1 SMP Mon Jan 26 13:57:09 EST 2009 ia64 ia64 ia64
 GNU/Linux

stuff deleted

g++  -O2 -ansi -pedantic -Wall -I../include  -o ../obj/capd-bitSet/EuclBitSet_UL
_lowDim.o -c \
        ../src/capd-bitSet/EuclBitSet_UL_lowDim.cpp
In file included from ../include/capd/rounding/DoubleRounding.h:20:0,
                 from ../include/capd/interval/DoubleInterval.h:30,
                 from ../include/capd/repSet/RepSet.h:55,
                 from ../include/capd/bitSet/EuclBitSetT.h:26,
                 from ../include/capd/bitSet/EuclBitSetT.hpp:19,
                 from ../src/capd-bitSet/EuclBitSet_UL_lowDim.cpp:19:
../include/capd/capd/archSetting.h:81:2: error: #error Couldnt determine the pro
cessor architecture. Set it manually in archSetting.h
make[2]: *** [../obj/capd-bitSet/EuclBitSet_UL_lowDim.o] Error 1
make[2]: Leaving directory `/home/mariah/sage/sage-4.7.1-ia64-Linux-rhel-work-ch
omp/spkg/build/chomp-20100213.p2/src/make'
make[1]: *** [capd-bitSet] Error 2
make[1]: Leaving directory `/home/mariah/sage/sage-4.7.1-ia64-Linux-rhel-work-ch
omp/spkg/build/chomp-20100213.p2/src/make'
make: *** [CHomP] Error 2
Error building CHomP

Change History (7)

comment:1 Changed 7 years ago by mariah

See also #12998.

comment:2 Changed 7 years ago by jhpalmieri

  • Cc jhpalmieri added

comment:3 Changed 6 years ago by jdemeyer

  • Milestone changed from sage-5.11 to sage-5.12

comment:4 Changed 6 years ago by vbraun_spam

  • Milestone changed from sage-6.1 to sage-6.2

comment:5 Changed 5 years ago by vbraun_spam

  • Milestone changed from sage-6.2 to sage-6.3

comment:6 Changed 5 years ago by vbraun_spam

  • Milestone changed from sage-6.3 to sage-6.4

comment:7 Changed 2 years ago by mderickx

  • Component changed from packages: optional to packages: experimental
Note: See TracTickets for help on using tickets.