Ticket #9958: Doctest_failures_Sage-4.7.2.alpha2_Linux_x86_SSE3-individual_tests_rerun.log

File Doctest_failures_Sage-4.7.2.alpha2_Linux_x86_SSE3-individual_tests_rerun.log, 11.5 KB (added by leif, 10 years ago)

Pentium4 Prescott (SSE3 / PNI, 32-bit), GCC 4.5.1, native code, -mfpmath=sse, Ubuntu 9.04 x86

Line 
1sage -t -long "devel/sage/sage/libs/cremona/newforms.pyx"   
2**********************************************************************
3File "/media/H-1TB-P6-linux2/Sage/sage-4.7.2.alpha2-gcc-4.5.1/devel/sage/sage/libs/cremona/newforms.pyx", line 53:
4    sage: ECModularSymbol(E)
5Expected:
6    Traceback (most recent call last):                     
7    ...                                                   
8    OverflowError: long int too large to convert to int   
9Got:
10    Traceback (most recent call last):
11      File "/home/leif/Sage/sage-4.7.2.alpha2-gcc-4.5.1/local/bin/ncadoctest.py", line 1231, in run_one_test
12        self.run_one_example(test, example, filename, compileflags)
13      File "/home/leif/Sage/sage-4.7.2.alpha2-gcc-4.5.1/local/bin/sagedoctest.py", line 38, in run_one_example
14        OrigDocTestRunner.run_one_example(self, test, example, filename, compileflags)
15      File "/home/leif/Sage/sage-4.7.2.alpha2-gcc-4.5.1/local/bin/ncadoctest.py", line 1172, in run_one_example
16        compileflags, 1) in test.globs
17      File "<doctest __main__.example_1[11]>", line 1, in <module>
18        ECModularSymbol(E)###line 53:
19    sage: ECModularSymbol(E)
20      File "newforms.pyx", line 69, in sage.libs.cremona.newforms.ECModularSymbol.__init__ (sage/libs/cremona/newforms.cpp:1820)
21    OverflowError: Python int too large to convert to C long
22**********************************************************************
231 items had failures:
24   1 of  13 in __main__.example_1
25***Test Failed*** 1 failures.
26For whitespace errors, see the file /home/leif/.sage//tmp/.doctest_newforms.py
27         [5.3 s]
28 
29----------------------------------------------------------------------
30The following tests failed:
31
32
33        sage -t -long "devel/sage/sage/libs/cremona/newforms.pyx"
34Total time for all tests: 5.3 seconds
35sage -t -long "devel/sage/sage/functions/transcendental.py"
36**********************************************************************
37File "/media/H-1TB-P6-linux2/Sage/sage-4.7.2.alpha2-gcc-4.5.1/devel/sage/sage/functions/transcendental.py", line 83:
38    sage: w = exponential_integral_1(2,4); w
39Expected:
40    [0.04890051070806112, 0.0037793524098489067, 0.00036008245216265873, 3.7665622843924751e-05]
41Got:
42    [0.04890051070806112, 0.0037793524098489067, 0.00036008245216265873, 3.766562284392475e-05]
43**********************************************************************
441 items had failures:
45   1 of   5 in __main__.example_1
46***Test Failed*** 1 failures.
47For whitespace errors, see the file /home/leif/.sage//tmp/.doctest_transcendental.py
48         [10.5 s]
49 
50----------------------------------------------------------------------
51The following tests failed:
52
53
54        sage -t -long "devel/sage/sage/functions/transcendental.py"
55Total time for all tests: 10.5 seconds
56sage -t -long "devel/sage/sage/misc/randstate.pyx"         
57**********************************************************************
58File "/media/H-1TB-P6-linux2/Sage/sage-4.7.2.alpha2-gcc-4.5.1/devel/sage/sage/misc/randstate.pyx", line 61:
59    sage: rtest()
60Expected:
61    (978, 0.184109262667515, -3*x^2 - 1/12, (4,5), [ 0, 1, 1, 0, 0 ], 1161603091, 60359, 0.83350776541997362) 
62Got:
63    (978, 0.184109262667515, -3*x^2 - 1/12, (4,5), [ 0, 1, 1, 0, 0 ], 1161603091, 60359, 0.8335077654199736)
64**********************************************************************
651 items had failures:
66   1 of  63 in __main__.example_0
67***Test Failed*** 1 failures.
68For whitespace errors, see the file /home/leif/.sage//tmp/.doctest_randstate.py
69         [30.1 s]
70 
71----------------------------------------------------------------------
72The following tests failed:
73
74
75        sage -t -long "devel/sage/sage/misc/randstate.pyx"
76Total time for all tests: 30.1 seconds
77sage -t -long "devel/sage/sage/combinat/words/suffix_trees.py"
78**********************************************************************
79File "/media/H-1TB-P6-linux2/Sage/sage-4.7.2.alpha2-gcc-4.5.1/devel/sage/sage/combinat/words/suffix_trees.py", line 1327:
80    sage: t.trie_type_dict() == dict([[(0, W("a")), 4], [(0, W("b")), 3], [(3, W("a")), 2], [(4, W("b")), 5], [(5, W("a")), 1]])
81Expected:
82    True
83Got:
84    False
85**********************************************************************
861 items had failures:
87   1 of   7 in __main__.example_39
88***Test Failed*** 1 failures.
89For whitespace errors, see the file /home/leif/.sage//tmp/.doctest_suffix_trees.py
90         [10.7 s]
91 
92----------------------------------------------------------------------
93The following tests failed:
94
95
96        sage -t -long "devel/sage/sage/combinat/words/suffix_trees.py"
97Total time for all tests: 10.8 seconds
98sage -t -long "devel/sage/sage/combinat/words/nfactor_enumerable_word.py"
99**********************************************************************
100File "/media/H-1TB-P6-linux2/Sage/sage-4.7.2.alpha2-gcc-4.5.1/devel/sage/sage/combinat/words/nfactor_enumerable_word.py", line 20:
101    sage: it.next()
102Expected:
103    word: 6456
104Got:
105    word: 4564
106**********************************************************************
107File "/media/H-1TB-P6-linux2/Sage/sage-4.7.2.alpha2-gcc-4.5.1/devel/sage/sage/combinat/words/nfactor_enumerable_word.py", line 22:
108    sage: it.next()
109Expected:
110    word: 5645
111Got:
112    word: 6456
113**********************************************************************
114File "/media/H-1TB-P6-linux2/Sage/sage-4.7.2.alpha2-gcc-4.5.1/devel/sage/sage/combinat/words/nfactor_enumerable_word.py", line 24:
115    sage: it.next()
116Expected:
117    word: 4564
118Got:
119    word: 5645
120**********************************************************************
1211 items had failures:
122   3 of  17 in __main__.example_0
123***Test Failed*** 3 failures.
124For whitespace errors, see the file /home/leif/.sage//tmp/.doctest_nfactor_enumerable_word.py
125         [12.0 s]
126 
127----------------------------------------------------------------------
128The following tests failed:
129
130
131        sage -t -long "devel/sage/sage/combinat/words/nfactor_enumerable_word.py"
132Total time for all tests: 12.0 seconds
133sage -t -long "devel/sage/sage/rings/morphism.pyx"         
134Segmentation fault
135
136         [7.5 s]
137 
138----------------------------------------------------------------------
139The following tests failed:
140
141
142        sage -t -long "devel/sage/sage/rings/morphism.pyx"
143Total time for all tests: 7.6 seconds
144sage -t -long "devel/sage/sage/rings/real_mpfr.pyx"         
145**********************************************************************
146File "/media/H-1TB-P6-linux2/Sage/sage-4.7.2.alpha2-gcc-4.5.1/devel/sage/sage/rings/real_mpfr.pyx", line 190:
147    sage: R = RealField(2147483648)
148Expected:
149    Traceback (most recent call last):
150    ...
151    OverflowError: ... too large to convert to int
152Got:
153    Traceback (most recent call last):
154      File "/home/leif/Sage/sage-4.7.2.alpha2-gcc-4.5.1/local/bin/ncadoctest.py", line 1231, in run_one_test
155        self.run_one_example(test, example, filename, compileflags)
156      File "/home/leif/Sage/sage-4.7.2.alpha2-gcc-4.5.1/local/bin/sagedoctest.py", line 38, in run_one_example
157        OrigDocTestRunner.run_one_example(self, test, example, filename, compileflags)
158      File "/home/leif/Sage/sage-4.7.2.alpha2-gcc-4.5.1/local/bin/ncadoctest.py", line 1172, in run_one_example
159        compileflags, 1) in test.globs
160      File "<doctest __main__.example_2[4]>", line 1, in <module>
161        R = RealField(Integer(2147483648))###line 190:
162    sage: R = RealField(2147483648)
163      File "real_mpfr.pyx", line 212, in sage.rings.real_mpfr.RealField (sage/rings/real_mpfr.c:3665)
164    OverflowError: Python int too large to convert to C long
165**********************************************************************
1661 items had failures:
167   1 of   6 in __main__.example_2
168***Test Failed*** 1 failures.
169For whitespace errors, see the file /home/leif/.sage//tmp/.doctest_real_mpfr.py
170         [18.7 s]
171 
172----------------------------------------------------------------------
173The following tests failed:
174
175
176        sage -t -long "devel/sage/sage/rings/real_mpfr.pyx"
177Total time for all tests: 18.7 seconds
178sage -t -long "devel/sage/sage/rings/homset.py"             
179Segmentation fault
180
181         [4.8 s]
182 
183----------------------------------------------------------------------
184The following tests failed:
185
186
187        sage -t -long "devel/sage/sage/rings/homset.py"
188Total time for all tests: 4.8 seconds
189sage -t -long "devel/sage/sage/stats/intlist.pyx"           
190**********************************************************************
191File "/media/H-1TB-P6-linux2/Sage/sage-4.7.2.alpha2-gcc-4.5.1/devel/sage/sage/stats/intlist.pyx", line 73:
192    sage: stats.IntList([1, 3, 2^32])
193Expected:
194    Traceback (most recent call last):
195    ...
196    OverflowError: ... too large to convert to int
197Got:
198    Traceback (most recent call last):
199      File "/home/leif/Sage/sage-4.7.2.alpha2-gcc-4.5.1/local/bin/ncadoctest.py", line 1231, in run_one_test
200        self.run_one_example(test, example, filename, compileflags)
201      File "/home/leif/Sage/sage-4.7.2.alpha2-gcc-4.5.1/local/bin/sagedoctest.py", line 38, in run_one_example
202        OrigDocTestRunner.run_one_example(self, test, example, filename, compileflags)
203      File "/home/leif/Sage/sage-4.7.2.alpha2-gcc-4.5.1/local/bin/ncadoctest.py", line 1172, in run_one_example
204        compileflags, 1) in test.globs
205      File "<doctest __main__.example_3[4]>", line 1, in <module>
206        stats.IntList([Integer(1), Integer(3), Integer(2)**Integer(32)])###line 73:
207    sage: stats.IntList([1, 3, 2^32])
208      File "intlist.pyx", line 112, in sage.stats.intlist.IntList.__init__ (sage/stats/intlist.c:975)
209    OverflowError: Python int too large to convert to C long
210**********************************************************************
2111 items had failures:
212   1 of   9 in __main__.example_3
213***Test Failed*** 1 failures.
214For whitespace errors, see the file /home/leif/.sage//tmp/.doctest_intlist.py
215         [8.0 s]
216 
217----------------------------------------------------------------------
218The following tests failed:
219
220
221        sage -t -long "devel/sage/sage/stats/intlist.pyx"
222Total time for all tests: 8.0 seconds
223sage -t -long "devel/sage/sage/schemes/generic/scheme.py"   
224/home/leif/Sage/sage-4.7.2.alpha2-gcc-4.5.1/local/lib/libcsage.so(print_backtrace+0x3b)[0xb72ed2db]
225/home/leif/Sage/sage-4.7.2.alpha2-gcc-4.5.1/local/lib/libcsage.so(sigdie+0x17)[0xb72ed31b]
226/home/leif/Sage/sage-4.7.2.alpha2-gcc-4.5.1/local/lib/libcsage.so(sage_signal_handler+0x21b)[0xb72ece92]
227[0xb77ca400]
228
229------------------------------------------------------------------------
230Unhandled SIGSEGV: A segmentation fault occurred in Sage.
231This probably occurred because a *compiled* component of Sage has a bug
232in it and is not properly wrapped with sig_on(), sig_off(). You might
233want to run Sage under gdb with 'sage -gdb' to debug this.
234Sage will now terminate.
235------------------------------------------------------------------------
236Segmentation fault
237
238         [4.8 s]
239 
240----------------------------------------------------------------------
241The following tests failed:
242
243
244        sage -t -long "devel/sage/sage/schemes/generic/scheme.py"
245Total time for all tests: 4.8 seconds
246sage -t -long "devel/sage/sage/geometry/polyhedra.py"       
247**********************************************************************
248File "/media/H-1TB-P6-linux2/Sage/sage-4.7.2.alpha2-gcc-4.5.1/devel/sage/sage/geometry/polyhedra.py", line 4948:
249    sage: ppoints[0]
250Expected:
251    (-1.92296268638e-15, -1.92296268638e-15)
252Got:
253    (0.0, 0.0)
254**********************************************************************
2551 items had failures:
256   1 of   8 in __main__.example_171
257***Test Failed*** 1 failures.
258For whitespace errors, see the file /home/leif/.sage//tmp/.doctest_polyhedra.py
259         [163.8 s]
260 
261----------------------------------------------------------------------
262The following tests failed:
263
264
265        sage -t -long "devel/sage/sage/geometry/polyhedra.py"
266Total time for all tests: 163.8 seconds