Ticket #9722: log_without_fltk-devel

File log_without_fltk-devel, 13.7 KB (added by ggrafendorfer, 11 years ago)
Line 
1martherd@veblen% rpm -qa | grep fltk                 
2fltk-1.1.10-1.fc13.x86_64
3martherd@veblen% cd Do
4Documents/ Download/ 
5martherd@veblen% cd Download/pa
6pari-2.3.5.tar.gz  pari-2.3.5/       
7martherd@veblen% cd Download/pari-2.3.5
8martherd@veblen% pwd
9/hg/u/martherd/Download/pari-2.3.5
10martherd@veblen% ./Configure
11Configuring pari-2.3.5 (STABLE)
12Checking echo to see how to suppress newlines...
13...using -n.
14Looking for some tools first ...
15...ld is /usr/bin/ld
16...zcat is /bin/zcat
17...gzip is /usr/bin/gzip
18...ranlib is /usr/bin/ranlib
19...perl is /usr/bin/perl
20...emacs is /usr/bin/emacs
21Looking for the compilers ...
22...cc is /usr/bin/cc
23...gcc is /usr/bin/gcc
24GNU compiler version 4.4.4 20100630 (Red Hat 4.4.4-10) (GCC)
25Given the previous choices, sizeof(long) is 8 chars.
26The internal word representation of a double is not needed (64bit).
27==========================================================================
28Building for architecture: amd64 running linux (x86-64 kernel) 64-bit version
29==========================================================================
30C compiler is          /usr/bin/gcc -O3 -Wall -fno-strict-aliasing -fomit-frame-pointer    -fPIC
31Executable linker is   /usr/bin/gcc  -O3 -Wall -fno-strict-aliasing -fomit-frame-pointer    -Wl,--export-dynamic
32Dynamic Lib linker is  /usr/bin/gcc  -shared  $(CFLAGS) $(DLCFLAGS) -Wl,-shared,-soname=$(LIBPARI_SONAME)
33Looking in C lib for some symbols...
34...Found exp2.
35...Found log2.
36...Found strftime.
37...Found getrusage.
38...Found sigaction.
39...Found TIOCGWINSZ.
40...Found getrlimit.
41...Found stat.                                                                                                                                                                     
42...Found vsnprintf.                                                                                                                                                                 
43...I did not find dlopen.                                                                                                                                                           
44Try again, with -ldl this time...                                                                                                                                                   
45...Found dlopen.                                                                                                                                                                   
46Checking for optional libraries and headers...                                                                                                                                     
47###                                                                                                                                                                                 
48### libX11.so not found. Please install X11 development files.                                                                                                                     
49### They usually come in XFree86-devel (RPM) or xlibs-dev (Debian) packages                                                                                                         
50###                                                                                                                                                                                 
51### X11 not found                                                                                                                                                                   
52...Found libfltk in /usr/local/lib64                                                                                                                                               
53Using FLTK library, FLTKDIR = /usr/local                                                                                                                                           
54Hi-Res Graphics: fltk                                                                                                                                                               
55...Found libreadline in /usr/lib64                                                                                                                                                 
56...Found readline header in /usr/include/readline                                                                                                                                   
57...Found history header in /usr/include/readline                                                                                                                                   
58...Found libncurses in /usr/lib64                                                                                                                                                   
59...Found libtermcap in /usr/lib64                                                                                                                                                   
60...Library termcap needed by readline                                                                                                                                               
61Using GNU readline, version 6.1                                                                                                                                                     
62Installation prefix ? [/usr/local]                                                                                                                                                 
63...for architecture-independent files (share-prefix) ? [/usr/local/share]                                                                                                           
64Installation directories for:
65...executables (gp, gphelp) ? [/usr/local/bin]
66...libraries (libpari) ? [/usr/local/lib]
67...include files ? [/usr/local/include]
68...manual pages ? [/usr/local/share/man/man1]
69...emacs macros ? [/usr/local/share/emacs/site-lisp/pari]
70...other system-dependant data ? [/usr/local/lib/pari]
71...other system-independant data ? [/usr/local/share/pari]
72Default is dynamic executable and shared library
73==========================================================================
74Extracting examples/Makefile.linux-x86_64
75Extracting Olinux-x86_64/Makefile
76Extracting Makefile
77Extracting Olinux-x86_64/paricfg.h
78Extracting Olinux-x86_64/../Odos/paricfg.h
79Extracting scripts and macros
80...in doc
81...in emacs
82...in misc
83==========================================================================
84Shall we try to build pari 2.3.5 (released) now (y/n)? [n]
85Ok. Type "make install" when you are ready
86Bye !
87martherd@veblen% make gp
88Making gp in Olinux-x86_64
89make[1]: Entering directory `/hg/u/martherd/Download/pari-2.3.5/Olinux-x86_64'
90File ../src/funclist not changed.
91../config/genkernel ../src/kernel/x86_64/asm0.h > parilvl0.h
92cat ../src/kernel/none/tune.h ../src/kernel/none/int.h ../src/kernel/none/level1.h > parilvl1.h
93cat parilvl0.h parilvl1.h > pariinl.h
94/usr/bin/gcc  -c -O3 -Wall -fno-strict-aliasing -fomit-frame-pointer    -I. -I../src/headers -I../src/language -I/usr/include -o gp.o ../src/gp/gp.c
95cd ../src/desc && /usr/bin/perl merge_822 ../functions/*/* > def-linux-x86_64-20301.tmp
96mv ../src/desc/def-linux-x86_64-20301.tmp ../src/desc/pari.desc
97cd ../src/desc && /usr/bin/perl gen_proto gp pari.desc > gp_init-linux-x86_64-20301.tmp
98mv ../src/desc/gp_init-linux-x86_64-20301.tmp ../src/gp/gp_init.h
99/usr/bin/gcc  -c -O3 -Wall -fno-strict-aliasing -fomit-frame-pointer    -I. -I../src/headers -I../src/graph -o gp_init.o ../src/gp/gp_init.c
100/usr/bin/gcc  -c -O3 -Wall -fno-strict-aliasing -fomit-frame-pointer    -I. -I../src/headers -I../src/language -I/usr/include -o gp_rl.o ../src/gp/gp_rl.c
101cd ../src/desc && /usr/bin/perl gen_proto highlevel pari.desc > highlvl-linux-x86_64-20301.tmp
102mv ../src/desc/highlvl-linux-x86_64-20301.tmp ../src/gp/highlvl.h
103/usr/bin/gcc  -c -O3 -Wall -fno-strict-aliasing -fomit-frame-pointer    -I. -I../src/headers -DDL_DFLT_NAME=NULL -o highlvl.o ../src/gp/highlvl.c
104/usr/bin/gcc  -c -O3 -Wall -fno-strict-aliasing -fomit-frame-pointer    -I. -I../src/headers -o whatnow.o ../src/gp/whatnow.c
105/usr/bin/gcc  -c -O3 -Wall -fno-strict-aliasing -fomit-frame-pointer    -I. -I../src/headers -I../src/graph -o plotport.o ../src/graph/plotport.c
106g++ -c -O3 -Wall -fno-strict-aliasing -fomit-frame-pointer    -I. -I../src/headers -I"/usr/local"/include  -o plotfltk.o ../src/graph/plotfltk.c
107../src/graph/plotfltk.c:27:19: error: FL/Fl.H: No such file or directory
108../src/graph/plotfltk.c:28:26: error: FL/Fl_Window.H: No such file or directory
109../src/graph/plotfltk.c:29:24: error: FL/fl_draw.H: No such file or directory
110../src/graph/plotfltk.c:31: error: expected class-name before ‘{’ token
111../src/graph/plotfltk.c:45: error: ‘Fl_Color’ does not name a type
112../src/graph/plotfltk.c:48: error: ‘Fl_Color’ does not name a type
113../src/graph/plotfltk.c: In constructor ‘Plotter::Plotter(long int*, long int*, long int*, long int, const char*)’:
114../src/graph/plotfltk.c:56: error: class ‘Plotter’ does not have any field named ‘Fl_Window’
115../src/graph/plotfltk.c:60: error: ‘color’ was not declared in this scope
116../src/graph/plotfltk.c:60: error: ‘FL_WHITE’ was not declared in this scope
117../src/graph/plotfltk.c:61: error: ‘FL_BLACK’ was not declared in this scope
118../src/graph/plotfltk.c:62: error: ‘FL_BLUE’ was not declared in this scope
119../src/graph/plotfltk.c:63: error: ‘rgb_color’ was not declared in this scope
120../src/graph/plotfltk.c:64: error: ‘FL_RED’ was not declared in this scope
121../src/graph/plotfltk.c:65: error: ‘FL_GREEN’ was not declared in this scope
122../src/graph/plotfltk.c: In function ‘void DrawPoint(void*, long int, long int)’:
123../src/graph/plotfltk.c:73: error: ‘fl_point’ was not declared in this scope
124../src/graph/plotfltk.c: In function ‘void DrawLine(void*, long int, long int, long int, long int)’:
125../src/graph/plotfltk.c:79: error: ‘fl_line’ was not declared in this scope
126../src/graph/plotfltk.c: In function ‘void DrawRectangle(void*, long int, long int, long int, long int)’:
127../src/graph/plotfltk.c:85: error: ‘fl_rect’ was not declared in this scope
128../src/graph/plotfltk.c: In function ‘void DrawPoints(void*, long int, plot_points*)’:
129../src/graph/plotfltk.c:92: error: ‘fl_point’ was not declared in this scope
130../src/graph/plotfltk.c: In function ‘void SetForeground(void*, long int)’:
131../src/graph/plotfltk.c:97: error: ‘Fl_Color’ was not declared in this scope
132../src/graph/plotfltk.c:97: error: ‘color’ was not declared in this scope
133../src/graph/plotfltk.c:97: error: expected primary-expression before ‘)’ token
134../src/graph/plotfltk.c:97: error: expected ‘;’ before ‘data’
135../src/graph/plotfltk.c:98: error: ‘fl_color’ was not declared in this scope
136../src/graph/plotfltk.c: In function ‘void DrawLines(void*, long int, plot_points*)’:
137../src/graph/plotfltk.c:105: error: ‘fl_line’ was not declared in this scope
138../src/graph/plotfltk.c: In function ‘void DrawString(void*, long int, long int, char*, long int)’:
139../src/graph/plotfltk.c:111: error: ‘fl_draw’ was not declared in this scope
140../src/graph/plotfltk.c: In member function ‘void Plotter::draw()’:
141../src/graph/plotfltk.c:118: error: ‘class Plotter’ has no member named ‘w’
142../src/graph/plotfltk.c:119: error: ‘class Plotter’ has no member named ‘h’
143../src/graph/plotfltk.c:121: error: ‘FL_COURIER’ was not declared in this scope
144../src/graph/plotfltk.c:121: error: ‘fl_font’ was not declared in this scope
145../src/graph/plotfltk.c:122: error: ‘FL_WHITE’ was not declared in this scope
146../src/graph/plotfltk.c:122: error: ‘fl_color’ was not declared in this scope
147../src/graph/plotfltk.c:123: error: ‘class Plotter’ has no member named ‘w’
148../src/graph/plotfltk.c:123: error: ‘class Plotter’ has no member named ‘h’
149../src/graph/plotfltk.c:123: error: ‘fl_rectf’ was not declared in this scope
150../src/graph/plotfltk.c:133: error: ‘color’ was not declared in this scope
151../src/graph/plotfltk.c: In member function ‘int Plotter::handle(int)’:
152../src/graph/plotfltk.c:140: error: ‘FL_PUSH’ was not declared in this scope
153../src/graph/plotfltk.c:141: error: ‘Fl’ has not been declared
154../src/graph/plotfltk.c:155: error: ‘class Plotter’ has no member named ‘x’
155../src/graph/plotfltk.c:156: error: ‘class Plotter’ has no member named ‘y’
156../src/graph/plotfltk.c:157: error: ‘class Plotter’ has no member named ‘w’
157../src/graph/plotfltk.c:158: error: ‘class Plotter’ has no member named ‘h’
158../src/graph/plotfltk.c:159: error: ‘class Plotter’ has no member named ‘fullscreen’
159../src/graph/plotfltk.c:163: error: ‘class Plotter’ has no member named ‘fullscreen_off’
160../src/graph/plotfltk.c:164: error: ‘class Plotter’ has no member named ‘size_range’
161../src/graph/plotfltk.c: In function ‘void rectdraw0(long int*, long int*, long int*, long int)’:
162../src/graph/plotfltk.c:188: error: ‘Fl’ has not been declared
163../src/graph/plotfltk.c:188: error: ‘FL_DOUBLE’ was not declared in this scope
164../src/graph/plotfltk.c:188: error: ‘FL_INDEX’ was not declared in this scope
165../src/graph/plotfltk.c:190: error: ‘class Plotter’ has no member named ‘size_range’
166../src/graph/plotfltk.c:191: error: ‘class Plotter’ has no member named ‘box’
167../src/graph/plotfltk.c:191: error: ‘FL_FLAT_BOX’ was not declared in this scope
168../src/graph/plotfltk.c:192: error: ‘class Plotter’ has no member named ‘end’
169../src/graph/plotfltk.c:193: error: ‘class Plotter’ has no member named ‘show’
170../src/graph/plotfltk.c:194: error: ‘Fl’ has not been declared
171make[1]: *** [plotfltk.o] Error 1
172make[1]: Leaving directory `/hg/u/martherd/Download/pari-2.3.5/Olinux-x86_64'
173make: *** [gp] Error 2
174martherd@veblen%