Ticket #8783: frobby-0.7.6.p1-redhawk-SAGE_CHECK.log

File frobby-0.7.6.p1-redhawk-SAGE_CHECK.log, 129.6 KB (added by leif, 10 years ago)

Build with SAGE_CHECK=yes on Ubuntu 10.04, GCC 4.3.3

Line 
1Warning: Attempted to overwrite SAGE_ROOT environment variable
2frobby-0.7.6.p1
3Machine:
4Linux redhawk 2.6.32-33-server #72-Ubuntu SMP Fri Jul 29 21:21:55 UTC 2011 x86_64 GNU/Linux
5Deleting directories from past builds of previous/current versions of frobby-0.7.6.p1
6Extracting package /tmp/leif/sage-4.7.2.alpha2/merge/spkgs-optional/frobby-0.7.6.p1.spkg ...
7-rw-r--r-- 1 leif leif 119489 2010-07-06 04:40 /tmp/leif/sage-4.7.2.alpha2/merge/spkgs-optional/frobby-0.7.6.p1.spkg
8Finished extraction
9****************************************************
10Host system
11uname -a:
12Linux redhawk 2.6.32-33-server #72-Ubuntu SMP Fri Jul 29 21:21:55 UTC 2011 x86_64 GNU/Linux
13****************************************************
14****************************************************
15CC Version
16gcc -v
17Using built-in specs.
18Target: x86_64-linux-gnu
19Configured with: ../src/configure -v --with-pkgversion='Ubuntu 4.4.3-4ubuntu5' --with-bugurl=file:///usr/share/doc/gcc-4.4/README.Bugs --enable-languages=c,c++,fortran,objc,obj-c++ --prefix=/usr --enable-shared --enable-multiarch --enable-linker-build-id --with-system-zlib --libexecdir=/usr/lib --without-included-gettext --enable-threads=posix --with-gxx-include-dir=/usr/include/c++/4.4 --program-suffix=-4.4 --enable-nls --enable-clocale=gnu --enable-libstdcxx-debug --enable-plugin --enable-objc-gc --disable-werror --with-arch-32=i486 --with-tune=generic --enable-checking=release --build=x86_64-linux-gnu --host=x86_64-linux-gnu --target=x86_64-linux-gnu
20Thread model: posix
21gcc version 4.4.3 (Ubuntu 4.4.3-4ubuntu5)
22****************************************************
23mkdir -p bin/release/
24g++ -Wall -ansi -pedantic -Wextra -Wno-uninitialized -Wno-unused-parameter -Wno-deprecated -isystem /tmp/leif/sage-4.7.2.alpha2/local/include -O3 -c src/main.cpp -o bin/release/main.o
25g++ -Wall -ansi -pedantic -Wextra -Wno-uninitialized -Wno-unused-parameter -Wno-deprecated -isystem /tmp/leif/sage-4.7.2.alpha2/local/include -O3 -c src/Action.cpp -o bin/release/Action.o
26g++ -Wall -ansi -pedantic -Wextra -Wno-uninitialized -Wno-unused-parameter -Wno-deprecated -isystem /tmp/leif/sage-4.7.2.alpha2/local/include -O3 -c src/IOParameters.cpp -o bin/release/IOParameters.o
27g++ -Wall -ansi -pedantic -Wextra -Wno-uninitialized -Wno-unused-parameter -Wno-deprecated -isystem /tmp/leif/sage-4.7.2.alpha2/local/include -O3 -c src/IrreducibleDecomAction.cpp -o bin/release/IrreducibleDecomAction.o
28g++ -Wall -ansi -pedantic -Wextra -Wno-uninitialized -Wno-unused-parameter -Wno-deprecated -isystem /tmp/leif/sage-4.7.2.alpha2/local/include -O3 -c src/fplllIO.cpp -o bin/release/fplllIO.o
29g++ -Wall -ansi -pedantic -Wextra -Wno-uninitialized -Wno-unused-parameter -Wno-deprecated -isystem /tmp/leif/sage-4.7.2.alpha2/local/include -O3 -c src/IOHandler.cpp -o bin/release/IOHandler.o
30g++ -Wall -ansi -pedantic -Wextra -Wno-uninitialized -Wno-unused-parameter -Wno-deprecated -isystem /tmp/leif/sage-4.7.2.alpha2/local/include -O3 -c src/fourti2.cpp -o bin/release/fourti2.o
31g++ -Wall -ansi -pedantic -Wextra -Wno-uninitialized -Wno-unused-parameter -Wno-deprecated -isystem /tmp/leif/sage-4.7.2.alpha2/local/include -O3 -c src/randomDataGenerators.cpp -o bin/release/randomDataGenerators.o
32g++ -Wall -ansi -pedantic -Wextra -Wno-uninitialized -Wno-unused-parameter -Wno-deprecated -isystem /tmp/leif/sage-4.7.2.alpha2/local/include -O3 -c src/MonosIOHandler.cpp -o bin/release/MonosIOHandler.o
33g++ -Wall -ansi -pedantic -Wextra -Wno-uninitialized -Wno-unused-parameter -Wno-deprecated -isystem /tmp/leif/sage-4.7.2.alpha2/local/include -O3 -c src/BigIdeal.cpp -o bin/release/BigIdeal.o
34g++ -Wall -ansi -pedantic -Wextra -Wno-uninitialized -Wno-unused-parameter -Wno-deprecated -isystem /tmp/leif/sage-4.7.2.alpha2/local/include -O3 -c src/TransformAction.cpp -o bin/release/TransformAction.o
35g++ -Wall -ansi -pedantic -Wextra -Wno-uninitialized -Wno-unused-parameter -Wno-deprecated -isystem /tmp/leif/sage-4.7.2.alpha2/local/include -O3 -c src/Macaulay2IOHandler.cpp -o bin/release/Macaulay2IOHandler.o
36g++ -Wall -ansi -pedantic -Wextra -Wno-uninitialized -Wno-unused-parameter -Wno-deprecated -isystem /tmp/leif/sage-4.7.2.alpha2/local/include -O3 -c src/NewMonosIOHandler.cpp -o bin/release/NewMonosIOHandler.o
37g++ -Wall -ansi -pedantic -Wextra -Wno-uninitialized -Wno-unused-parameter -Wno-deprecated -isystem /tmp/leif/sage-4.7.2.alpha2/local/include -O3 -c src/HelpAction.cpp -o bin/release/HelpAction.o
38g++ -Wall -ansi -pedantic -Wextra -Wno-uninitialized -Wno-unused-parameter -Wno-deprecated -isystem /tmp/leif/sage-4.7.2.alpha2/local/include -O3 -c src/stdinc.cpp -o bin/release/stdinc.o
39g++ -Wall -ansi -pedantic -Wextra -Wno-uninitialized -Wno-unused-parameter -Wno-deprecated -isystem /tmp/leif/sage-4.7.2.alpha2/local/include -O3 -c src/DynamicFrobeniusAction.cpp -o bin/release/DynamicFrobeniusAction.o
40g++ -Wall -ansi -pedantic -Wextra -Wno-uninitialized -Wno-unused-parameter -Wno-deprecated -isystem /tmp/leif/sage-4.7.2.alpha2/local/include -O3 -c src/dynamicFrobeniusAlgorithm.cpp -o bin/release/dynamicFrobeniusAlgorithm.o
41g++ -Wall -ansi -pedantic -Wextra -Wno-uninitialized -Wno-unused-parameter -Wno-deprecated -isystem /tmp/leif/sage-4.7.2.alpha2/local/include -O3 -c src/GenerateIdealAction.cpp -o bin/release/GenerateIdealAction.o
42g++ -Wall -ansi -pedantic -Wextra -Wno-uninitialized -Wno-unused-parameter -Wno-deprecated -isystem /tmp/leif/sage-4.7.2.alpha2/local/include -O3 -c src/GenerateFrobeniusAction.cpp -o bin/release/GenerateFrobeniusAction.o
43g++ -Wall -ansi -pedantic -Wextra -Wno-uninitialized -Wno-unused-parameter -Wno-deprecated -isystem /tmp/leif/sage-4.7.2.alpha2/local/include -O3 -c src/IrreducibleDecomFacade.cpp -o bin/release/IrreducibleDecomFacade.o
44g++ -Wall -ansi -pedantic -Wextra -Wno-uninitialized -Wno-unused-parameter -Wno-deprecated -isystem /tmp/leif/sage-4.7.2.alpha2/local/include -O3 -c src/FrobeniusAction.cpp -o bin/release/FrobeniusAction.o
45g++ -Wall -ansi -pedantic -Wextra -Wno-uninitialized -Wno-unused-parameter -Wno-deprecated -isystem /tmp/leif/sage-4.7.2.alpha2/local/include -O3 -c src/Facade.cpp -o bin/release/Facade.o
46g++ -Wall -ansi -pedantic -Wextra -Wno-uninitialized -Wno-unused-parameter -Wno-deprecated -isystem /tmp/leif/sage-4.7.2.alpha2/local/include -O3 -c src/IOFacade.cpp -o bin/release/IOFacade.o
47g++ -Wall -ansi -pedantic -Wextra -Wno-uninitialized -Wno-unused-parameter -Wno-deprecated -isystem /tmp/leif/sage-4.7.2.alpha2/local/include -O3 -c src/DynamicFrobeniusFacade.cpp -o bin/release/DynamicFrobeniusFacade.o
48g++ -Wall -ansi -pedantic -Wextra -Wno-uninitialized -Wno-unused-parameter -Wno-deprecated -isystem /tmp/leif/sage-4.7.2.alpha2/local/include -O3 -c src/GenerateDataFacade.cpp -o bin/release/GenerateDataFacade.o
49g++ -Wall -ansi -pedantic -Wextra -Wno-uninitialized -Wno-unused-parameter -Wno-deprecated -isystem /tmp/leif/sage-4.7.2.alpha2/local/include -O3 -c src/AnalyzeAction.cpp -o bin/release/AnalyzeAction.o
50g++ -Wall -ansi -pedantic -Wextra -Wno-uninitialized -Wno-unused-parameter -Wno-deprecated -isystem /tmp/leif/sage-4.7.2.alpha2/local/include -O3 -c src/IdealFacade.cpp -o bin/release/IdealFacade.o
51g++ -Wall -ansi -pedantic -Wextra -Wno-uninitialized -Wno-unused-parameter -Wno-deprecated -isystem /tmp/leif/sage-4.7.2.alpha2/local/include -O3 -c src/Parameter.cpp -o bin/release/Parameter.o
52g++ -Wall -ansi -pedantic -Wextra -Wno-uninitialized -Wno-unused-parameter -Wno-deprecated -isystem /tmp/leif/sage-4.7.2.alpha2/local/include -O3 -c src/ParameterGroup.cpp -o bin/release/ParameterGroup.o
53g++ -Wall -ansi -pedantic -Wextra -Wno-uninitialized -Wno-unused-parameter -Wno-deprecated -isystem /tmp/leif/sage-4.7.2.alpha2/local/include -O3 -c src/IntegerParameter.cpp -o bin/release/IntegerParameter.o
54g++ -Wall -ansi -pedantic -Wextra -Wno-uninitialized -Wno-unused-parameter -Wno-deprecated -isystem /tmp/leif/sage-4.7.2.alpha2/local/include -O3 -c src/IrreducibleDecomParameters.cpp -o bin/release/IrreducibleDecomParameters.o
55g++ -Wall -ansi -pedantic -Wextra -Wno-uninitialized -Wno-unused-parameter -Wno-deprecated -isystem /tmp/leif/sage-4.7.2.alpha2/local/include -O3 -c src/BoolParameter.cpp -o bin/release/BoolParameter.o
56g++ -Wall -ansi -pedantic -Wextra -Wno-uninitialized -Wno-unused-parameter -Wno-deprecated -isystem /tmp/leif/sage-4.7.2.alpha2/local/include -O3 -c src/Scanner.cpp -o bin/release/Scanner.o
57g++ -Wall -ansi -pedantic -Wextra -Wno-uninitialized -Wno-unused-parameter -Wno-deprecated -isystem /tmp/leif/sage-4.7.2.alpha2/local/include -O3 -c src/Partition.cpp -o bin/release/Partition.o
58g++ -Wall -ansi -pedantic -Wextra -Wno-uninitialized -Wno-unused-parameter -Wno-deprecated -isystem /tmp/leif/sage-4.7.2.alpha2/local/include -O3 -c src/StringParameter.cpp -o bin/release/StringParameter.o
59g++ -Wall -ansi -pedantic -Wextra -Wno-uninitialized -Wno-unused-parameter -Wno-deprecated -isystem /tmp/leif/sage-4.7.2.alpha2/local/include -O3 -c src/Term.cpp -o bin/release/Term.o
60g++ -Wall -ansi -pedantic -Wextra -Wno-uninitialized -Wno-unused-parameter -Wno-deprecated -isystem /tmp/leif/sage-4.7.2.alpha2/local/include -O3 -c src/TermTranslator.cpp -o bin/release/TermTranslator.o
61g++ -Wall -ansi -pedantic -Wextra -Wno-uninitialized -Wno-unused-parameter -Wno-deprecated -isystem /tmp/leif/sage-4.7.2.alpha2/local/include -O3 -c src/Timer.cpp -o bin/release/Timer.o
62g++ -Wall -ansi -pedantic -Wextra -Wno-uninitialized -Wno-unused-parameter -Wno-deprecated -isystem /tmp/leif/sage-4.7.2.alpha2/local/include -O3 -c src/VarNames.cpp -o bin/release/VarNames.o
63g++ -Wall -ansi -pedantic -Wextra -Wno-uninitialized -Wno-unused-parameter -Wno-deprecated -isystem /tmp/leif/sage-4.7.2.alpha2/local/include -O3 -c src/LatticeFormatAction.cpp -o bin/release/LatticeFormatAction.o
64g++ -Wall -ansi -pedantic -Wextra -Wno-uninitialized -Wno-unused-parameter -Wno-deprecated -isystem /tmp/leif/sage-4.7.2.alpha2/local/include -O3 -c src/SliceAlgorithm.cpp -o bin/release/SliceAlgorithm.o
65g++ -Wall -ansi -pedantic -Wextra -Wno-uninitialized -Wno-unused-parameter -Wno-deprecated -isystem /tmp/leif/sage-4.7.2.alpha2/local/include -O3 -c src/Ideal.cpp -o bin/release/Ideal.o
66g++ -Wall -ansi -pedantic -Wextra -Wno-uninitialized -Wno-unused-parameter -Wno-deprecated -isystem /tmp/leif/sage-4.7.2.alpha2/local/include -O3 -c src/intersect.cpp -o bin/release/intersect.o
67g++ -Wall -ansi -pedantic -Wextra -Wno-uninitialized -Wno-unused-parameter -Wno-deprecated -isystem /tmp/leif/sage-4.7.2.alpha2/local/include -O3 -c src/IntersectFacade.cpp -o bin/release/IntersectFacade.o
68g++ -Wall -ansi -pedantic -Wextra -Wno-uninitialized -Wno-unused-parameter -Wno-deprecated -isystem /tmp/leif/sage-4.7.2.alpha2/local/include -O3 -c src/IntersectAction.cpp -o bin/release/IntersectAction.o
69g++ -Wall -ansi -pedantic -Wextra -Wno-uninitialized -Wno-unused-parameter -Wno-deprecated -isystem /tmp/leif/sage-4.7.2.alpha2/local/include -O3 -c src/AssociatedPrimesFacade.cpp -o bin/release/AssociatedPrimesFacade.o
70g++ -Wall -ansi -pedantic -Wextra -Wno-uninitialized -Wno-unused-parameter -Wno-deprecated -isystem /tmp/leif/sage-4.7.2.alpha2/local/include -O3 -c src/AssociatedPrimesAction.cpp -o bin/release/AssociatedPrimesAction.o
71g++ -Wall -ansi -pedantic -Wextra -Wno-uninitialized -Wno-unused-parameter -Wno-deprecated -isystem /tmp/leif/sage-4.7.2.alpha2/local/include -O3 -c src/PrimaryDecomAction.cpp -o bin/release/PrimaryDecomAction.o
72g++ -Wall -ansi -pedantic -Wextra -Wno-uninitialized -Wno-unused-parameter -Wno-deprecated -isystem /tmp/leif/sage-4.7.2.alpha2/local/include -O3 -c src/Slice.cpp -o bin/release/Slice.o
73g++ -Wall -ansi -pedantic -Wextra -Wno-uninitialized -Wno-unused-parameter -Wno-deprecated -isystem /tmp/leif/sage-4.7.2.alpha2/local/include -O3 -c src/IndependenceSplitter.cpp -o bin/release/IndependenceSplitter.o
74g++ -Wall -ansi -pedantic -Wextra -Wno-uninitialized -Wno-unused-parameter -Wno-deprecated -isystem /tmp/leif/sage-4.7.2.alpha2/local/include -O3 -c src/Projection.cpp -o bin/release/Projection.o
75g++ -Wall -ansi -pedantic -Wextra -Wno-uninitialized -Wno-unused-parameter -Wno-deprecated -isystem /tmp/leif/sage-4.7.2.alpha2/local/include -O3 -c src/SliceStrategy.cpp -o bin/release/SliceStrategy.o
76g++ -Wall -ansi -pedantic -Wextra -Wno-uninitialized -Wno-unused-parameter -Wno-deprecated -isystem /tmp/leif/sage-4.7.2.alpha2/local/include -O3 -c src/lattice.cpp -o bin/release/lattice.o
77g++ -Wall -ansi -pedantic -Wextra -Wno-uninitialized -Wno-unused-parameter -Wno-deprecated -isystem /tmp/leif/sage-4.7.2.alpha2/local/include -O3 -c src/LatticeFacade.cpp -o bin/release/LatticeFacade.o
78g++ -Wall -ansi -pedantic -Wextra -Wno-uninitialized -Wno-unused-parameter -Wno-deprecated -isystem /tmp/leif/sage-4.7.2.alpha2/local/include -O3 -c src/DecomRecorder.cpp -o bin/release/DecomRecorder.o
79g++ -Wall -ansi -pedantic -Wextra -Wno-uninitialized -Wno-unused-parameter -Wno-deprecated -isystem /tmp/leif/sage-4.7.2.alpha2/local/include -O3 -c src/TermGrader.cpp -o bin/release/TermGrader.o
80g++ -Wall -ansi -pedantic -Wextra -Wno-uninitialized -Wno-unused-parameter -Wno-deprecated -isystem /tmp/leif/sage-4.7.2.alpha2/local/include -O3 -c src/Fourti2IOHandler.cpp -o bin/release/Fourti2IOHandler.o
81g++ -Wall -ansi -pedantic -Wextra -Wno-uninitialized -Wno-unused-parameter -Wno-deprecated -isystem /tmp/leif/sage-4.7.2.alpha2/local/include -O3 -c src/NullIOHandler.cpp -o bin/release/NullIOHandler.o
82g++ -Wall -ansi -pedantic -Wextra -Wno-uninitialized -Wno-unused-parameter -Wno-deprecated -isystem /tmp/leif/sage-4.7.2.alpha2/local/include -O3 -c src/Minimizer.cpp -o bin/release/Minimizer.o
83g++ -Wall -ansi -pedantic -Wextra -Wno-uninitialized -Wno-unused-parameter -Wno-deprecated -isystem /tmp/leif/sage-4.7.2.alpha2/local/include -O3 -c src/AlexanderDualAction.cpp -o bin/release/AlexanderDualAction.o
84g++ -Wall -ansi -pedantic -Wextra -Wno-uninitialized -Wno-unused-parameter -Wno-deprecated -isystem /tmp/leif/sage-4.7.2.alpha2/local/include -O3 -c src/frobby.cpp -o bin/release/frobby.o
85g++ -Wall -ansi -pedantic -Wextra -Wno-uninitialized -Wno-unused-parameter -Wno-deprecated -isystem /tmp/leif/sage-4.7.2.alpha2/local/include -O3 -c src/BigTermConsumer.cpp -o bin/release/BigTermConsumer.o
86g++ -Wall -ansi -pedantic -Wextra -Wno-uninitialized -Wno-unused-parameter -Wno-deprecated -isystem /tmp/leif/sage-4.7.2.alpha2/local/include -O3 -c src/TranslatingTermConsumer.cpp -o bin/release/TranslatingTermConsumer.o
87g++ -Wall -ansi -pedantic -Wextra -Wno-uninitialized -Wno-unused-parameter -Wno-deprecated -isystem /tmp/leif/sage-4.7.2.alpha2/local/include -O3 -c src/frobbyTest.cpp -o bin/release/frobbyTest.o
88g++  bin/release/main.o  bin/release/Action.o  bin/release/IOParameters.o  bin/release/IrreducibleDecomAction.o  bin/release/fplllIO.o  bin/release/IOHandler.o  bin/release/fourti2.o  bin/release/randomDataGenerators.o  bin/release/MonosIOHandler.o  bin/release/BigIdeal.o  bin/release/TransformAction.o  bin/release/Macaulay2IOHandler.o  bin/release/NewMonosIOHandler.o  bin/release/HelpAction.o  bin/release/stdinc.o  bin/release/DynamicFrobeniusAction.o  bin/release/dynamicFrobeniusAlgorithm.o  bin/release/GenerateIdealAction.o  bin/release/GenerateFrobeniusAction.o  bin/release/IrreducibleDecomFacade.o  bin/release/FrobeniusAction.o  bin/release/Facade.o  bin/release/IOFacade.o  bin/release/DynamicFrobeniusFacade.o  bin/release/GenerateDataFacade.o  bin/release/AnalyzeAction.o  bin/release/IdealFacade.o  bin/release/Parameter.o  bin/release/ParameterGroup.o  bin/release/IntegerParameter.o  bin/release/IrreducibleDecomParameters.o  bin/release/BoolParameter.o  bin/release/Scanner.o  bin/release/Partition.o  bin/release/StringParameter.o  bin/release/Term.o  bin/release/TermTranslator.o  bin/release/Timer.o  bin/release/VarNames.o  bin/release/LatticeFormatAction.o  bin/release/SliceAlgorithm.o  bin/release/Ideal.o  bin/release/intersect.o  bin/release/IntersectFacade.o  bin/release/IntersectAction.o  bin/release/AssociatedPrimesFacade.o  bin/release/AssociatedPrimesAction.o  bin/release/PrimaryDecomAction.o  bin/release/Slice.o  bin/release/IndependenceSplitter.o  bin/release/Projection.o  bin/release/SliceStrategy.o  bin/release/lattice.o  bin/release/LatticeFacade.o  bin/release/DecomRecorder.o  bin/release/TermGrader.o  bin/release/Fourti2IOHandler.o  bin/release/NullIOHandler.o  bin/release/Minimizer.o  bin/release/AlexanderDualAction.o  bin/release/frobby.o  bin/release/BigTermConsumer.o  bin/release/TranslatingTermConsumer.o  bin/release/frobbyTest.o -L/tmp/leif/sage-4.7.2.alpha2/local/lib/ -lgmpxx -lgmp -o bin/release/frobby
89if [ -f bin/release/frobby.exe ]; then \
90          mv -f bin/release/frobby.exe bin/release/frobby; \
91        fi
92strip bin/release/frobby
93cd bin; rm -f frobby; link ../bin/release/frobby frobby; cd ..
94
95real    0m3.510s
96user    0m37.260s
97sys     0m4.030s
98Successfully installed frobby-0.7.6.p1
99Running the test suite.
100mkdir -p bin/debug/
101g++ -Wall -ansi -pedantic -Wextra -Wno-uninitialized -Wno-unused-parameter -Wno-deprecated -isystem "/sw/include" -g -D DEBUG -fno-inline -c src/main.cpp -o bin/debug/main.o
102g++ -Wall -ansi -pedantic -Wextra -Wno-uninitialized -Wno-unused-parameter -Wno-deprecated -isystem "/sw/include" -g -D DEBUG -fno-inline -c src/Action.cpp -o bin/debug/Action.o
103g++ -Wall -ansi -pedantic -Wextra -Wno-uninitialized -Wno-unused-parameter -Wno-deprecated -isystem "/sw/include" -g -D DEBUG -fno-inline -c src/IOParameters.cpp -o bin/debug/IOParameters.o
104g++ -Wall -ansi -pedantic -Wextra -Wno-uninitialized -Wno-unused-parameter -Wno-deprecated -isystem "/sw/include" -g -D DEBUG -fno-inline -c src/IrreducibleDecomAction.cpp -o bin/debug/IrreducibleDecomAction.o
105g++ -Wall -ansi -pedantic -Wextra -Wno-uninitialized -Wno-unused-parameter -Wno-deprecated -isystem "/sw/include" -g -D DEBUG -fno-inline -c src/fplllIO.cpp -o bin/debug/fplllIO.o
106g++ -Wall -ansi -pedantic -Wextra -Wno-uninitialized -Wno-unused-parameter -Wno-deprecated -isystem "/sw/include" -g -D DEBUG -fno-inline -c src/IOHandler.cpp -o bin/debug/IOHandler.o
107g++ -Wall -ansi -pedantic -Wextra -Wno-uninitialized -Wno-unused-parameter -Wno-deprecated -isystem "/sw/include" -g -D DEBUG -fno-inline -c src/fourti2.cpp -o bin/debug/fourti2.o
108g++ -Wall -ansi -pedantic -Wextra -Wno-uninitialized -Wno-unused-parameter -Wno-deprecated -isystem "/sw/include" -g -D DEBUG -fno-inline -c src/randomDataGenerators.cpp -o bin/debug/randomDataGenerators.o
109g++ -Wall -ansi -pedantic -Wextra -Wno-uninitialized -Wno-unused-parameter -Wno-deprecated -isystem "/sw/include" -g -D DEBUG -fno-inline -c src/MonosIOHandler.cpp -o bin/debug/MonosIOHandler.o
110g++ -Wall -ansi -pedantic -Wextra -Wno-uninitialized -Wno-unused-parameter -Wno-deprecated -isystem "/sw/include" -g -D DEBUG -fno-inline -c src/BigIdeal.cpp -o bin/debug/BigIdeal.o
111g++ -Wall -ansi -pedantic -Wextra -Wno-uninitialized -Wno-unused-parameter -Wno-deprecated -isystem "/sw/include" -g -D DEBUG -fno-inline -c src/TransformAction.cpp -o bin/debug/TransformAction.o
112g++ -Wall -ansi -pedantic -Wextra -Wno-uninitialized -Wno-unused-parameter -Wno-deprecated -isystem "/sw/include" -g -D DEBUG -fno-inline -c src/Macaulay2IOHandler.cpp -o bin/debug/Macaulay2IOHandler.o
113g++ -Wall -ansi -pedantic -Wextra -Wno-uninitialized -Wno-unused-parameter -Wno-deprecated -isystem "/sw/include" -g -D DEBUG -fno-inline -c src/NewMonosIOHandler.cpp -o bin/debug/NewMonosIOHandler.o
114g++ -Wall -ansi -pedantic -Wextra -Wno-uninitialized -Wno-unused-parameter -Wno-deprecated -isystem "/sw/include" -g -D DEBUG -fno-inline -c src/HelpAction.cpp -o bin/debug/HelpAction.o
115g++ -Wall -ansi -pedantic -Wextra -Wno-uninitialized -Wno-unused-parameter -Wno-deprecated -isystem "/sw/include" -g -D DEBUG -fno-inline -c src/stdinc.cpp -o bin/debug/stdinc.o
116g++ -Wall -ansi -pedantic -Wextra -Wno-uninitialized -Wno-unused-parameter -Wno-deprecated -isystem "/sw/include" -g -D DEBUG -fno-inline -c src/DynamicFrobeniusAction.cpp -o bin/debug/DynamicFrobeniusAction.o
117In file included from src/fourti2.cpp:17:
118src/stdinc.h:17:17: error: gmp.h: No such file or directory
119src/stdinc.h:18:19: error: gmpxx.h: No such file or directory
120In file included from src/IOParameters.cpp:17:
121src/stdinc.h:17:17: error: gmp.h: No such file or directory
122src/stdinc.h:18:19: error: gmpxx.h: No such file or directory
123In file included from src/TransformAction.cpp:17:
124src/stdinc.h:17:17: error: gmp.h: No such file or directory
125src/stdinc.h:18:19: error: gmpxx.h: No such file or directory
126In file included from src/IOHandler.cpp:17:
127src/stdinc.h:17:17: error: gmp.h: No such file or directory
128src/stdinc.h:18:19: error: gmpxx.h: No such file or directory
129In file included from src/NewMonosIOHandler.cpp:17:
130src/stdinc.h:17:17: error: gmp.h: No such file or directory
131src/stdinc.h:18:19: error: gmpxx.h: No such file or directory
132In file included from src/main.cpp:17:
133src/stdinc.h:17:17: error: gmp.h: No such file or directory
134src/stdinc.h:18:19: error: gmpxx.h: No such file or directory
135In file included from src/stdinc.cpp:17:
136src/stdinc.h:17:17: error: gmp.h: No such file or directory
137src/stdinc.h:18:19: error: gmpxx.h: No such file or directory
138In file included from src/stdinc.cpp:17:
139src/stdinc.h:50: error: ‘mpz_class’ does not name a type
140In file included from src/Action.cpp:17:
141src/stdinc.h:17:17: error: gmp.h: No such file or directory
142src/stdinc.h:18:19: error: gmpxx.h: No such file or directory
143make: *** [bin/debug/stdinc.o] Error 1
144make: *** Waiting for unfinished jobs....
145In file included from src/IrreducibleDecomAction.cpp:17:
146src/stdinc.h:17:17: error: gmp.h: No such file or directory
147src/stdinc.h:18:19: error: gmpxx.h: No such file or directory
148In file included from src/fplllIO.cpp:17:
149src/stdinc.h:17:17: error: gmp.h: No such file or directory
150src/stdinc.h:18:19: error: gmpxx.h: No such file or directory
151In file included from src/Macaulay2IOHandler.cpp:17:
152src/stdinc.h:17:17: error: gmp.h: No such file or directory
153src/stdinc.h:18:19: error: gmpxx.h: No such file or directory
154In file included from src/MonosIOHandler.cpp:17:
155src/stdinc.h:17:17: error: gmp.h: No such file or directory
156src/stdinc.h:18:19: error: gmpxx.h: No such file or directory
157In file included from src/BigIdeal.cpp:17:
158src/stdinc.h:17:17: error: gmp.h: No such file or directory
159src/stdinc.h:18:19: error: gmpxx.h: No such file or directory
160In file included from src/randomDataGenerators.cpp:17:
161src/stdinc.h:17:17: error: gmp.h: No such file or directory
162src/stdinc.h:18:19: error: gmpxx.h: No such file or directory
163In file included from src/HelpAction.cpp:17:
164src/stdinc.h:17:17: error: gmp.h: No such file or directory
165src/stdinc.h:18:19: error: gmpxx.h: No such file or directory
166In file included from src/DynamicFrobeniusAction.cpp:17:
167src/stdinc.h:17:17: error: gmp.h: No such file or directory
168src/stdinc.h:18:19: error: gmpxx.h: No such file or directory
169In file included from src/main.cpp:17:
170src/stdinc.h:50: error: ‘mpz_class’ does not name a type
171In file included from src/BoolParameter.h:20,
172                 from src/Action.h:20,
173                 from src/main.cpp:18:
174src/Parameter.h:29: error: ‘string’ has not been declared
175In file included from src/Action.h:20,
176                 from src/main.cpp:18:
177src/BoolParameter.h:27: error: ‘string’ has not been declared
178In file included from src/Action.cpp:17:
179src/stdinc.h:50: error: ‘mpz_class’ does not name a type
180In file included from src/BoolParameter.h:20,
181                 from src/Action.h:20,
182                 from src/Action.cpp:18:
183src/Parameter.h:29: error: ‘string’ has not been declared
184In file included from src/Action.h:20,
185                 from src/Action.cpp:18:
186src/BoolParameter.h:27: error: ‘string’ has not been declared
187In file included from src/HelpAction.cpp:17:
188src/stdinc.h:50: error: ‘mpz_class’ does not name a type
189In file included from src/BoolParameter.h:20,
190                 from src/Action.h:20,
191                 from src/HelpAction.h:20,
192                 from src/HelpAction.cpp:18:
193src/Parameter.h:29: error: ‘string’ has not been declared
194In file included from src/Action.h:20,
195                 from src/HelpAction.h:20,
196                 from src/HelpAction.cpp:18:
197src/BoolParameter.h:27: error: ‘string’ has not been declared
198In file included from src/DynamicFrobeniusAction.cpp:17:
199src/stdinc.h:50: error: ‘mpz_class’ does not name a type
200In file included from src/BoolParameter.h:20,
201                 from src/Action.h:20,
202                 from src/DynamicFrobeniusAction.h:20,
203                 from src/DynamicFrobeniusAction.cpp:18:
204src/Parameter.h:29: error: ‘string’ has not been declared
205In file included from src/Action.h:20,
206                 from src/DynamicFrobeniusAction.h:20,
207                 from src/DynamicFrobeniusAction.cpp:18:
208src/BoolParameter.h:27: error: ‘string’ has not been declared
209In file included from src/fourti2.cpp:17:
210src/stdinc.h:50: error: ‘mpz_class’ does not name a type
211In file included from src/fourti2.cpp:18:
212src/fourti2.h:27: error: variable or field ‘writeLatticeBasis’ declared void
213src/fourti2.h:27: error: ‘FILE’ was not declared in this scope
214src/fourti2.h:27: error: ‘out’ was not declared in this scope
215src/fourti2.h:27: error: expected primary-expression before ‘const’
216In file included from src/IOParameters.cpp:17:
217src/stdinc.h:50: error: ‘mpz_class’ does not name a type
218In file included from src/ParameterGroup.h:20,
219                 from src/IOParameters.h:20,
220                 from src/IOParameters.cpp:18:
221src/Parameter.h:29: error: ‘string’ has not been declared
222In file included from src/TransformAction.cpp:17:
223src/stdinc.h:50: error: ‘mpz_class’ does not name a type
224In file included from src/BoolParameter.h:20,
225                 from src/Action.h:20,
226                 from src/TransformAction.h:20,
227                 from src/TransformAction.cpp:18:
228src/Parameter.h:29: error: ‘string’ has not been declared
229In file included from src/Action.h:20,
230                 from src/TransformAction.h:20,
231                 from src/TransformAction.cpp:18:
232src/BoolParameter.h:27: error: ‘string’ has not been declared
233In file included from src/NewMonosIOHandler.cpp:17:
234src/stdinc.h:50: error: ‘mpz_class’ does not name a type
235In file included from src/IOHandler.cpp:17:
236src/stdinc.h:50: error: ‘mpz_class’ does not name a type
237In file included from src/IrreducibleDecomAction.cpp:17:
238src/stdinc.h:50: error: ‘mpz_class’ does not name a type
239In file included from src/BoolParameter.h:20,
240                 from src/Action.h:20,
241                 from src/IrreducibleDecomAction.h:20,
242                 from src/IrreducibleDecomAction.cpp:18:
243src/Parameter.h:29: error: ‘string’ has not been declared
244In file included from src/Action.h:20,
245                 from src/IrreducibleDecomAction.h:20,
246                 from src/IrreducibleDecomAction.cpp:18:
247src/BoolParameter.h:27: error: ‘string’ has not been declared
248In file included from src/main.cpp:18:
249src/Action.h:50: error: ISO C++ forbids declaration of ‘string’ with no type
250src/Action.h:50: error: expected ‘,’ or ‘...’ before ‘&’ token
251src/Action.h:56: error: ISO C++ forbids declaration of ‘string’ with no type
252src/Action.h:56: error: expected ‘,’ or ‘...’ before ‘&’ token
253In file included from src/fplllIO.cpp:17:
254src/stdinc.h:50: error: ‘mpz_class’ does not name a type
255In file included from src/fplllIO.cpp:18:
256src/fplllIO.h:26: error: variable or field ‘writeLatticeBasis’ declared void
257src/fplllIO.h:26: error: ‘FILE’ was not declared in this scope
258src/fplllIO.h:26: error: ‘out’ was not declared in this scope
259src/fplllIO.h:26: error: expected primary-expression before ‘const’
260In file included from src/Action.cpp:18:
261src/Action.h:50: error: ISO C++ forbids declaration of ‘string’ with no type
262src/Action.h:50: error: expected ‘,’ or ‘...’ before ‘&’ token
263src/Action.h:56: error: ISO C++ forbids declaration of ‘string’ with no type
264src/Action.h:56: error: expected ‘,’ or ‘...’ before ‘&’ token
265In file included from src/Macaulay2IOHandler.cpp:17:
266src/stdinc.h:50: error: ‘mpz_class’ does not name a type
267In file included from src/BigIdeal.cpp:17:
268src/stdinc.h:50: error: ‘mpz_class’ does not name a type
269In file included from src/IOParameters.h:20,
270                 from src/IrreducibleDecomAction.h:21,
271                 from src/Action.cpp:20:
272src/ParameterGroup.h:35: error: ‘string’ has not been declared
273In file included from src/MonosIOHandler.cpp:17:
274src/stdinc.h:50: error: ‘mpz_class’ does not name a type
275In file included from src/IOParameters.h:21,
276                 from src/IrreducibleDecomAction.h:21,
277                 from src/Action.cpp:20:
278src/StringParameter.h:26: error: ISO C++ forbids declaration of ‘string’ with no type
279src/StringParameter.h:26: error: expected ‘,’ or ‘...’ before ‘&’ token
280src/StringParameter.h:30: error: ‘string’ has not been declared
281src/StringParameter.h:31: error: ISO C++ forbids declaration of ‘string’ with no type
282src/StringParameter.h:31: error: expected ‘;’ before ‘&’ token
283src/StringParameter.h:33: error: ISO C++ forbids declaration of ‘type name’ with no type
284src/StringParameter.h:33: error: ‘operator const int’ does not name a type
285src/StringParameter.h:35: error: ISO C++ forbids declaration of ‘string’ with no type
286src/StringParameter.h:35: error: expected ‘,’ or ‘...’ before ‘&’ token
287src/StringParameter.h:40: error: ‘string’ does not name a type
288In file included from src/IrreducibleDecomAction.h:21,
289                 from src/Action.cpp:20:
290src/IOParameters.h:35: error: ISO C++ forbids declaration of ‘string’ with no type
291src/IOParameters.h:35: error: expected ‘;’ before ‘&’ token
292src/IOParameters.h:36: error: ISO C++ forbids declaration of ‘string’ with no type
293src/IOParameters.h:36: error: expected ‘;’ before ‘&’ token
294In file included from src/IrreducibleDecomAction.h:22,
295                 from src/Action.cpp:20:
296src/IrreducibleDecomParameters.h:29: error: ISO C++ forbids declaration of ‘string’ with no type
297src/IrreducibleDecomParameters.h:29: error: expected ‘,’ or ‘...’ before ‘&’ token
298src/IrreducibleDecomParameters.h:37: error: ISO C++ forbids declaration of ‘string’ with no type
299src/IrreducibleDecomParameters.h:37: error: expected ‘;’ before ‘&’ token
300In file included from src/GenerateIdealAction.h:22,
301                 from src/Action.cpp:24:
302src/IntegerParameter.h:29: error: ‘string’ has not been declared
303src/main.cpp: In function ‘int main(int, const char**)’:
304src/main.cpp:24: error: ‘stderr’ was not declared in this scope
305src/main.cpp:24: error: ‘fputs’ was not declared in this scope
306src/main.cpp:25: error: ‘fflush’ was not declared in this scope
307src/main.cpp:32: error: ‘time’ was not declared in this scope
308src/main.cpp:34: error: ‘string’ was not declared in this scope
309src/main.cpp:34: error: expected ‘;’ before ‘actionName’
310src/main.cpp:36: error: ‘actionName’ was not declared in this scope
311src/main.cpp:41: error: ‘actionName’ was not declared in this scope
312src/main.cpp:44: error: ‘fprintf’ was not declared in this scope
313In file included from src/HelpAction.h:20,
314                 from src/HelpAction.cpp:18:
315src/Action.h:50: error: ISO C++ forbids declaration of ‘string’ with no type
316src/Action.h:50: error: expected ‘,’ or ‘...’ before ‘&’ token
317src/Action.h:56: error: ISO C++ forbids declaration of ‘string’ with no type
318src/Action.h:56: error: expected ‘,’ or ‘...’ before ‘&’ token
319make: *** [bin/debug/main.o] Error 1
320src/HelpAction.cpp: In member function ‘virtual bool HelpAction::processNonParameter(const char*)’:
321src/HelpAction.cpp:57: error: no matching function for call to ‘HelpAction::createAction(const char*&)’
322src/Action.h:50: note: candidates are: static Action* Action::createAction(int) <near match>
323src/HelpAction.cpp:59: error: ‘stderr’ was not declared in this scope
324src/HelpAction.cpp:59: error: ‘fprintf’ was not declared in this scope
325src/HelpAction.cpp: In member function ‘void HelpAction::displayTopic()’:
326src/HelpAction.cpp:67: error: ‘stdout’ was not declared in this scope
327src/HelpAction.cpp:68: error: ‘fprintf’ was not declared in this scope
328In file included from src/DynamicFrobeniusAction.h:20,
329                 from src/DynamicFrobeniusAction.cpp:18:
330src/Action.h:50: error: ISO C++ forbids declaration of ‘string’ with no type
331src/Action.h:50: error: expected ‘,’ or ‘...’ before ‘&’ token
332src/Action.h:56: error: ISO C++ forbids declaration of ‘string’ with no type
333src/Action.h:56: error: expected ‘,’ or ‘...’ before ‘&’ token
334src/HelpAction.cpp:79: error: ‘string’ was not declared in this scope
335src/HelpAction.cpp:79: error: expected ‘;’ before ‘defaultValue’
336src/HelpAction.cpp:80: error: ‘defaultValue’ was not declared in this scope
337In file included from src/randomDataGenerators.cpp:17:
338src/stdinc.h:50: error: ‘mpz_class’ does not name a type
339src/HelpAction.cpp: In member function ‘virtual void HelpAction::perform()’:
340src/HelpAction.cpp:94: error: ‘stdout’ was not declared in this scope
341src/HelpAction.cpp:102: error: ‘fprintf’ was not declared in this scope
342In file included from src/Facade.h:20,
343                 from src/IOFacade.h:20,
344                 from src/DynamicFrobeniusAction.cpp:20:
345src/Timer.h:28: error: ‘FILE’ has not been declared
346src/Timer.h:31: error: ‘time_t’ does not name a type
347In file included from src/DynamicFrobeniusAction.cpp:20:
348src/IOFacade.h:30: error: ISO C++ forbids declaration of ‘string’ with no type
349src/IOFacade.h:30: error: expected ‘,’ or ‘...’ before ‘&’ token
350src/IOFacade.h:34: error: ‘FILE’ has not been declared
351src/IOFacade.h:34: error: ISO C++ forbids declaration of ‘string’ with no typesrc/HelpAction.cpp:110: error: ‘string’ was not declared in this scope
352
353src/IOFacade.h:34: error: expected ‘,’ or ‘...’ before ‘&’ token
354src/IOFacade.h:36: error: ‘mpz_class’ was not declared in this scope
355src/HelpAction.cpp:117: error: ‘string’ was not declared in this scopesrc/IOFacade.h:36: error: template argument 1 is invalid
356
357src/IOFacade.h:36: error: template argument 2 is invalid
358src/HelpAction.cpp:120: error: ‘string’ was not declared in this scope
359src/HelpAction.cpp:121: error: ‘fputc’ was not declared in this scope
360src/HelpAction.cpp:122: error: ‘fputs’ was not declared in this scope
361src/IOFacade.h:38: error: ‘mpz_class’ was not declared in this scope
362src/IOFacade.h:38: error: template argument 1 is invalid
363src/HelpAction.cpp:133: error: ‘fputs’ was not declared in this scope
364src/HelpAction.cpp:134: error: ‘fflush’ was not declared in this scope
365src/IOFacade.h:38: error: template argument 2 is invalid
366src/IOFacade.h:39: error: ‘FILE’ has not been declared
367src/IOFacade.h:39: error: ‘mpz_class’ was not declared in this scope
368src/IOFacade.h:39: error: template argument 1 is invalid
369src/IOFacade.h:39: error: template argument 2 is invalid
370src/IOFacade.h:42: error: ‘mpz_class’ was not declared in this scope
371src/IOFacade.h:42: error: template argument 1 is invalid
372src/IOFacade.h:42: error: template argument 2 is invalid
373src/IOFacade.h:44: error: ISO C++ forbids declaration of ‘string’ with no type
374src/IOFacade.h:44: error: expected ‘,’ or ‘...’ before ‘&’ token
375src/IOFacade.h:46: error: ‘FILE’ has not been declared
376src/IOFacade.h:46: error: ISO C++ forbids declaration of ‘string’ with no type
377src/IOFacade.h:46: error: expected ‘,’ or ‘...’ before ‘&’ token
378In file included from src/DynamicFrobeniusAction.cpp:21:
379src/DynamicFrobeniusFacade.h:29: error: ‘mpz_class’ was not declared in this scope
380src/DynamicFrobeniusFacade.h:29: error: template argument 1 is invalid
381src/DynamicFrobeniusFacade.h:29: error: template argument 2 is invalid
382src/DynamicFrobeniusFacade.h:30: error: ‘mpz_class’ has not been declared
383In file included from src/DynamicFrobeniusAction.cpp:22:
384src/Scanner.h:25: error: ISO C++ forbids declaration of ‘string’ with no type
385src/Scanner.h:25: error: expected ‘,’ or ‘...’ before ‘&’ token
386src/Scanner.h:28: error: ISO C++ forbids declaration of ‘string’ with no type
387src/Scanner.h:28: error: expected ‘;’ before ‘&’ token
388src/Scanner.h:29: error: ISO C++ forbids declaration of ‘string’ with no type
389src/Scanner.h:29: error: expected ‘,’ or ‘...’ before ‘&’ token
390src/Scanner.h:37: error: ISO C++ forbids declaration of ‘string’ with no type
391src/Scanner.h:37: error: expected ‘,’ or ‘...’ before ‘&’ token
392src/Scanner.h:40: error: ‘mpz_class’ has not been declared
393src/Scanner.h:41: error: ‘mpz_class’ has not been declared
394src/Scanner.h:62: error: ‘mpz_class’ has not been declared
395src/Scanner.h:66: error: ISO C++ forbids declaration of ‘string’ with no type
396src/Scanner.h:66: error: expected ‘,’ or ‘...’ before ‘&’ token
397src/Scanner.h:70: error: ‘mpz_class’ does not name a type
398src/Scanner.h:71: error: ISO C++ forbids declaration of ‘FILE’ with no type
399src/Scanner.h:71: error: expected ‘;’ before ‘*’ token
400src/Scanner.h:78: error: ‘string’ does not name a type
401src/DynamicFrobeniusAction.cpp: In member function ‘virtual void DynamicFrobeniusAction::perform()’:
402src/DynamicFrobeniusAction.cpp:49: error: ‘mpz_class’ was not declared in this scope
403src/DynamicFrobeniusAction.cpp:49: error: template argument 1 is invalid
404src/DynamicFrobeniusAction.cpp:49: error: template argument 2 is invalid
405src/DynamicFrobeniusAction.cpp:49: error: invalid type in declaration before ‘;’ token
406src/DynamicFrobeniusAction.cpp:52: error: ‘stdin’ was not declared in this scope
407src/DynamicFrobeniusAction.cpp:55: error: expected ‘;’ before ‘frobeniusNumber’
408src/DynamicFrobeniusAction.cpp:58: error: ‘frobeniusNumber’ was not declared in this scope
409In file included from src/IOParameters.h:20,
410                 from src/IOParameters.cpp:18:
411src/ParameterGroup.h:35: error: ‘string’ has not been declaredsrc/DynamicFrobeniusAction.cpp:60: error: ‘stdout’ was not declared in this scope
412
413src/DynamicFrobeniusAction.cpp:60: error: ‘gmp_fprintf’ was not declared in this scope
414src/Action.cpp:93: error: ISO C++ forbids declaration of ‘string’ with no type
415src/Action.cpp:93: error: expected ‘,’ or ‘...’ before ‘&’ token
416src/Action.cpp: In static member function ‘static Action* Action::createAction(int)’:
417src/Action.cpp:97: error: ‘name’ was not declared in this scope
418In file included from src/IOParameters.h:21,
419                 from src/IOParameters.cpp:18:
420src/StringParameter.h:26: error: ISO C++ forbids declaration of ‘string’ with no type
421src/StringParameter.h:26: error: expected ‘,’ or ‘...’ before ‘&’ token
422src/StringParameter.h:30: error: ‘string’ has not been declared
423src/StringParameter.h:31: error: ISO C++ forbids declaration of ‘string’ with no type
424src/StringParameter.h:31: error: expected ‘;’ before ‘&’ token
425src/StringParameter.h:33: error: ISO C++ forbids declaration of ‘type name’ with no type
426src/StringParameter.h:33: error: ‘operator const int’ does not name a type
427src/StringParameter.h:35: error: ISO C++ forbids declaration of ‘string’ with no type
428src/StringParameter.h:35: error: expected ‘,’ or ‘...’ before ‘&’ token
429src/StringParameter.h:40: error: ‘string’ does not name a type
430In file included from src/IOParameters.cpp:18:
431src/IOParameters.h:35: error: ISO C++ forbids declaration of ‘string’ with no type
432src/IOParameters.h:35: error: expected ‘;’ before ‘&’ token
433src/IOParameters.h:36: error: ISO C++ forbids declaration of ‘string’ with no type
434src/IOParameters.h:36: error: expected ‘;’ before ‘&’ token
435src/Action.cpp: At global scope:
436src/Action.cpp:118: error: ISO C++ forbids declaration of ‘string’ with no type
437src/Action.cpp:118: error: expected ‘,’ or ‘...’ before ‘&’ token
438src/Action.cpp: In member function ‘void Action::processOption(int)’:
439src/Action.cpp:121: error: ‘params’ was not declared in this scope
440In file included from src/Facade.h:20,
441                 from src/IOFacade.h:20,
442                 from src/IOParameters.cpp:20:
443src/Timer.h:28: error: ‘FILE’ has not been declared
444src/Timer.h:31: error: ‘time_t’ does not name a type
445In file included from src/IOParameters.cpp:20:
446src/IOFacade.h:30: error: ISO C++ forbids declaration of ‘string’ with no type
447src/IOFacade.h:30: error: expected ‘,’ or ‘...’ before ‘&’ token
448src/IOFacade.h:34: error: ‘FILE’ has not been declared
449src/IOFacade.h:34: error: ISO C++ forbids declaration of ‘string’ with no type
450src/IOFacade.h:34: error: expected ‘,’ or ‘...’ before ‘&’ token
451src/IOFacade.h:36: error: ‘mpz_class’ was not declared in this scope
452src/IOFacade.h:36: error: template argument 1 is invalid
453src/IOFacade.h:36: error: template argument 2 is invalid
454src/IOFacade.h:38: error: ‘mpz_class’ was not declared in this scope
455src/IOFacade.h:38: error: template argument 1 is invalid
456src/IOFacade.h:38: error: template argument 2 is invalid
457src/IOFacade.h:39: error: ‘FILE’ has not been declared
458src/IOFacade.h:39: error: ‘mpz_class’ was not declared in this scope
459src/IOFacade.h:39: error: template argument 1 is invalid
460src/IOFacade.h:39: error: template argument 2 is invalid
461src/IOFacade.h:42: error: ‘mpz_class’ was not declared in this scope
462src/IOFacade.h:42: error: template argument 1 is invalid
463src/IOFacade.h:42: error: template argument 2 is invalid
464src/IOFacade.h:44: error: ISO C++ forbids declaration of ‘string’ with no type
465src/IOFacade.h:44: error: expected ‘,’ or ‘...’ before ‘&’ token
466src/IOFacade.h:46: error: ‘FILE’ has not been declared
467src/IOFacade.h:46: error: ISO C++ forbids declaration of ‘string’ with no type
468src/IOFacade.h:46: error: expected ‘,’ or ‘...’ before ‘&’ token
469src/Action.cpp:124: error: ‘paramCount’ was not declared in this scope
470src/Action.cpp:128: error: ‘stderr’ was not declared in this scope
471src/Action.cpp:129: error: ‘optionName’ was not declared in this scope
472src/Action.cpp:129: error: ‘fprintf’ was not declared in this scope
473src/Action.cpp: In member function ‘virtual void Action::parseCommandLine(unsigned int, const char**)’:
474src/Action.cpp:148: error: ‘stderr’ was not declared in this scope
475src/Action.cpp:150: error: ‘fprintf’ was not declared in this scope
476src/Action.cpp:159: error: ‘string’ was not declared in this scope
477src/Action.cpp:159: error: expected ‘;’ before ‘optionName’
478src/Action.cpp:160: error: ‘optionName’ was not declared in this scope
479make: *** [bin/debug/DynamicFrobeniusAction.o] Error 1
480make: *** [bin/debug/HelpAction.o] Error 1
481In file included from src/TransformAction.h:20,
482                 from src/TransformAction.cpp:18:
483src/Action.h:50: error: ISO C++ forbids declaration of ‘string’ with no type
484src/Action.h:50: error: expected ‘,’ or ‘...’ before ‘&’ token
485src/Action.h:56: error: ISO C++ forbids declaration of ‘string’ with no type
486src/Action.h:56: error: expected ‘,’ or ‘...’ before ‘&’ token
487In file included from src/IOParameters.h:20,
488                 from src/TransformAction.h:21,
489                 from src/TransformAction.cpp:18:
490src/ParameterGroup.h:35: error: ‘string’ has not been declared
491In file included from src/IOParameters.h:21,
492                 from src/TransformAction.h:21,
493                 from src/TransformAction.cpp:18:
494src/StringParameter.h:26: error: ISO C++ forbids declaration of ‘string’ with no type
495src/StringParameter.h:26: error: expected ‘,’ or ‘...’ before ‘&’ token
496src/StringParameter.h:30: error: ‘string’ has not been declared
497src/StringParameter.h:31: error: ISO C++ forbids declaration of ‘string’ with no type
498src/StringParameter.h:31: error: expected ‘;’ before ‘&’ token
499src/StringParameter.h:33: error: ISO C++ forbids declaration of ‘type name’ with no type
500src/StringParameter.h:33: error: ‘operator const int’ does not name a type
501src/StringParameter.h:35: error: ISO C++ forbids declaration of ‘string’ with no type
502src/StringParameter.h:35: error: expected ‘,’ or ‘...’ before ‘&’ token
503src/StringParameter.h:40: error: ‘string’ does not name a type
504In file included from src/TransformAction.h:21,
505                 from src/TransformAction.cpp:18:
506src/IOParameters.h:35: error: ISO C++ forbids declaration of ‘string’ with no type
507src/IOParameters.h:35: error: expected ‘;’ before ‘&’ token
508src/IOParameters.h:36: error: ISO C++ forbids declaration of ‘string’ with no type
509src/IOParameters.h:36: error: expected ‘;’ before ‘&’ token
510In file included from src/IrreducibleDecomAction.h:20,
511                 from src/IrreducibleDecomAction.cpp:18:
512src/Action.h:50: error: ISO C++ forbids declaration of ‘string’ with no type
513src/Action.h:50: error: expected ‘,’ or ‘...’ before ‘&’ token
514src/Action.h:56: error: ISO C++ forbids declaration of ‘string’ with no type
515src/Action.h:56: error: expected ‘,’ or ‘...’ before ‘&’ token
516In file included from src/IOParameters.h:20,
517                 from src/IrreducibleDecomAction.h:21,
518                 from src/IrreducibleDecomAction.cpp:18:
519src/ParameterGroup.h:35: error: ‘string’ has not been declared
520In file included from src/IOParameters.h:21,
521                 from src/IrreducibleDecomAction.h:21,
522                 from src/IrreducibleDecomAction.cpp:18:
523src/StringParameter.h:26: error: ISO C++ forbids declaration of ‘string’ with no type
524src/StringParameter.h:26: error: expected ‘,’ or ‘...’ before ‘&’ token
525src/StringParameter.h:30: error: ‘string’ has not been declared
526src/StringParameter.h:31: error: ISO C++ forbids declaration of ‘string’ with no type
527src/StringParameter.h:31: error: expected ‘;’ before ‘&’ token
528src/StringParameter.h:33: error: ISO C++ forbids declaration of ‘type name’ with no type
529src/StringParameter.h:33: error: ‘operator const int’ does not name a type
530src/StringParameter.h:35: error: ISO C++ forbids declaration of ‘string’ with no type
531src/StringParameter.h:35: error: expected ‘,’ or ‘...’ before ‘&’ token
532src/StringParameter.h:40: error: ‘string’ does not name a type
533In file included from src/IrreducibleDecomAction.h:21,
534                 from src/IrreducibleDecomAction.cpp:18:
535src/IOParameters.h:35: error: ISO C++ forbids declaration of ‘string’ with no type
536src/IOParameters.h:35: error: expected ‘;’ before ‘&’ token
537src/IOParameters.h:36: error: ISO C++ forbids declaration of ‘string’ with no type
538src/IOParameters.h:36: error: expected ‘;’ before ‘&’ token
539In file included from src/IrreducibleDecomAction.h:22,
540                 from src/IrreducibleDecomAction.cpp:18:
541src/IrreducibleDecomParameters.h:29: error: ISO C++ forbids declaration of ‘string’ with no type
542src/IrreducibleDecomParameters.h:29: error: expected ‘,’ or ‘...’ before ‘&’ token
543src/IrreducibleDecomParameters.h:37: error: ISO C++ forbids declaration of ‘string’ with no type
544src/IrreducibleDecomParameters.h:37: error: expected ‘;’ before ‘&’ token
545make: *** [bin/debug/Action.o] Error 1
546In file included from src/randomDataGenerators.cpp:18:
547src/randomDataGenerators.h:34: error: ‘Degree’ was not declared in this scope
548src/randomDataGenerators.h:34: error: template argument 1 is invalid
549src/randomDataGenerators.h:34: error: template argument 2 is invalid
550In file included from src/BigIdeal.h:20,
551                 from src/fourti2.cpp:20:
552src/VarNames.h: In member function ‘bool StringEquals::operator()(const char*, const char*) const’:
553src/VarNames.h:30: error: ‘strcmp’ was not declared in this scope
554In file included from src/IOHandler.h:21,
555                 from src/MonosIOHandler.h:20,
556                 from src/IOParameters.cpp:21:
557src/VarNames.h: In member function ‘bool StringEquals::operator()(const char*, const char*) const’:
558src/VarNames.h:30: error: ‘strcmp’ was not declared in this scope
559In file included from src/fourti2.cpp:20:
560src/BigIdeal.h: At global scope:
561src/BigIdeal.h:39: error: ISO C++ forbids declaration of ‘mpz_class’ with no type
562src/BigIdeal.h:39: error: expected ‘;’ before ‘&’ token
563src/BigIdeal.h:40: error: ‘mpz_class’ was not declared in this scope
564src/BigIdeal.h:40: error: template argument 1 is invalid
565src/BigIdeal.h:40: error: template argument 2 is invalid
566src/BigIdeal.h:41: error: ‘mpz_class’ was not declared in this scope
567src/BigIdeal.h:41: error: template argument 1 is invalid
568src/BigIdeal.h:41: error: template argument 2 is invalid
569src/BigIdeal.h:43: error: ‘mpz_class’ was not declared in this scope
570src/BigIdeal.h:43: error: template argument 1 is invalid
571src/BigIdeal.h:43: error: template argument 2 is invalid
572src/BigIdeal.h:45: error: ISO C++ forbids declaration of ‘mpz_class’ with no type
573src/BigIdeal.h:45: error: expected ‘;’ before ‘&’ token
574src/BigIdeal.h:46: error: ISO C++ forbids declaration of ‘mpz_class’ with no type
575src/BigIdeal.h:46: error: expected ‘;’ before ‘&’ token
576src/BigIdeal.h:47: error: ISO C++ forbids declaration of ‘mpz_class’ with no type
577src/BigIdeal.h:47: error: expected ‘,’ or ‘...’ before ‘&’ token
578src/BigIdeal.h:51: error: ‘mpz_class’ was not declared in this scope
579src/BigIdeal.h:51: error: template argument 1 is invalid
580src/BigIdeal.h:51: error: template argument 2 is invalid
581src/BigIdeal.h:52: error: ‘mpz_class’ was not declared in this scope
582src/BigIdeal.h:52: error: template argument 1 is invalid
583src/BigIdeal.h:52: error: template argument 2 is invalid
584src/BigIdeal.h:83: error: ‘mpz_class’ was not declared in this scope
585src/BigIdeal.h:83: error: template argument 1 is invalid
586src/BigIdeal.h:83: error: template argument 2 is invalid
587src/BigIdeal.h:84: error: ‘mpz_class’ was not declared in this scope
588src/BigIdeal.h:84: error: template argument 1 is invalid
589src/BigIdeal.h:84: error: template argument 2 is invalid
590In file included from src/IOHandler.h:21,
591                 from src/NewMonosIOHandler.h:20,
592                 from src/NewMonosIOHandler.cpp:18:
593src/VarNames.h: In member function ‘bool StringEquals::operator()(const char*, const char*) const’:
594src/VarNames.h:30: error: ‘strcmp’ was not declared in this scope
595src/BigIdeal.h:87: error: ‘mpz_class’ was not declared in this scope
596src/BigIdeal.h:87: error: template argument 1 is invalid
597src/BigIdeal.h:87: error: template argument 2 is invalid
598src/BigIdeal.h:87: error: template argument 1 is invalid
599src/BigIdeal.h:87: error: template argument 2 is invalid
600In file included from src/fourti2.cpp:21:
601src/Scanner.h:40: error: ‘mpz_class’ has not been declared
602src/Scanner.h:41: error: ‘mpz_class’ has not been declared
603src/Scanner.h:62: error: ‘mpz_class’ has not been declared
604src/Scanner.h:70: error: ‘mpz_class’ does not name a type
605In file included from src/fourti2.cpp:22:
606src/IOHandler.h:39: error: ‘mpz_class’ was not declared in this scope
607src/IOHandler.h:39: error: template argument 1 is invalid
608src/IOHandler.h:39: error: template argument 2 is invalid
609src/IOHandler.h:59: error: ‘mpz_class’ was not declared in this scope
610src/IOHandler.h:59: error: template argument 1 is invalid
611src/IOHandler.h:59: error: template argument 2 is invalid
612In file included from src/IOHandler.h:63,
613                 from src/fourti2.cpp:22:
614src/BigTermConsumer.h:28: error: ‘mpz_ptr’ has not been declared
615In file included from src/fourti2.cpp:22:
616src/IOHandler.h:72: error: ‘mpz_class’ was not declared in this scope
617src/IOHandler.h:72: error: template argument 1 is invalid
618src/IOHandler.h:72: error: template argument 2 is invalid
619src/IOHandler.h:86: error: ‘mpz_ptr’ has not been declared
620src/IOHandler.h:100: error: ‘mpz_class’ was not declared in this scope
621src/IOHandler.h:100: error: template argument 1 is invalid
622In file included from src/BigIdeal.h:20,
623                 from src/TransformAction.cpp:20:
624src/VarNames.h: In member function ‘bool StringEquals::operator()(const char*, const char*) const’:
625src/VarNames.h:30: error: ‘strcmp’ was not declared in this scopesrc/IOHandler.h:100: error: template argument 2 is invalid
626
627src/IOHandler.h: In member function ‘virtual void IdealWriter::consume(int*)’:
628src/IOHandler.h:87: error: ‘mpz_class’ was not declared in this scope
629src/IOHandler.h:87: error: template argument 1 is invalid
630src/IOHandler.h:87: error: template argument 2 is invalid
631src/IOHandler.h:87: error: invalid type in declaration before ‘(’ token
632src/IOHandler.h:89: error: invalid types ‘int[size_t]’ for array subscript
633src/IOHandler.h: At global scope:
634src/IOHandler.h:109: error: ‘mpz_class’ was not declared in this scope
635src/IOHandler.h:109: error: template argument 1 is invalid
636src/IOHandler.h:109: error: template argument 2 is invalid
637src/fourti2.cpp: In function ‘void fourti2::readTerm(BigIdeal&, Scanner&)’:
638src/fourti2.cpp:28: error: ‘mpz_class’ was not declared in this scope
639src/fourti2.cpp:28: error: expected ‘;’ before ‘tmp’
640src/fourti2.cpp:29: error: ‘tmp’ was not declared in this scope
641src/fourti2.cpp:34: error: ‘stderr’ was not declared in this scope
642src/fourti2.cpp:34: error: ‘fputs’ was not declared in this scope
643src/fourti2.cpp:41: error: ‘class BigIdeal’ has no member named ‘getLastTermExponentRef’
644src/fourti2.cpp: In function ‘void fourti2::readLatticeBasis(Scanner&, BigIdeal&)’:
645src/fourti2.cpp:72: error: ‘class BigIdeal’ has no member named ‘getLastTermExponentRef’
646src/fourti2.cpp: In function ‘void fourti2::writeLatticeBasis(FILE*, const BigIdeal&)’:
647src/fourti2.cpp:79: error: ‘fprintf’ was not declared in this scope
648src/fourti2.cpp:82: error: request for member ‘size’ in ‘((const BigIdeal*)basis)->BigIdeal::operator[](((size_t)i))’, which is of non-class type ‘const int’
649src/fourti2.cpp:83: error: invalid types ‘const int[unsigned int]’ for array subscript
650src/fourti2.cpp:83: error: ‘gmp_fprintf’ was not declared in this scope
651src/fourti2.cpp:86: error: ‘fputc’ was not declared in this scope
652In file included from src/MonosIOHandler.h:20,
653                 from src/IOParameters.cpp:21:
654src/IOHandler.h: At global scope:
655src/IOHandler.h:39: error: ‘mpz_class’ was not declared in this scope
656src/IOHandler.h:39: error: template argument 1 is invalid
657src/IOHandler.h:39: error: template argument 2 is invalid
658src/IOHandler.h:59: error: ‘mpz_class’ was not declared in this scope
659src/IOHandler.h:59: error: template argument 1 is invalid
660src/IOHandler.h:59: error: template argument 2 is invalid
661In file included from src/IOHandler.h:63,
662                 from src/MonosIOHandler.h:20,
663                 from src/IOParameters.cpp:21:
664src/BigTermConsumer.h:28: error: ‘mpz_ptr’ has not been declared
665In file included from src/MonosIOHandler.h:20,
666                 from src/IOParameters.cpp:21:
667src/IOHandler.h:72: error: ‘mpz_class’ was not declared in this scope
668src/IOHandler.h:72: error: template argument 1 is invalid
669src/IOHandler.h:72: error: template argument 2 is invalid
670src/IOHandler.h:86: error: ‘mpz_ptr’ has not been declared
671src/IOHandler.h:100: error: ‘mpz_class’ was not declared in this scope
672src/IOHandler.h:100: error: template argument 1 is invalid
673src/IOHandler.h:100: error: template argument 2 is invalid
674src/IOHandler.h: In member function ‘virtual void IdealWriter::consume(int*)’:
675src/IOHandler.h:87: error: ‘mpz_class’ was not declared in this scope
676src/IOHandler.h:87: error: template argument 1 is invalid
677src/IOHandler.h:87: error: template argument 2 is invalid
678src/IOHandler.h:87: error: invalid type in declaration before ‘(’ token
679src/IOHandler.h:89: error: invalid types ‘int[size_t]’ for array subscript
680src/IOHandler.h: At global scope:
681src/IOHandler.h:109: error: ‘mpz_class’ was not declared in this scope
682src/IOHandler.h:109: error: template argument 1 is invalid
683src/IOHandler.h:109: error: template argument 2 is invalid
684In file included from src/IOParameters.cpp:22:
685src/Scanner.h:40: error: ‘mpz_class’ has not been declared
686src/Scanner.h:41: error: ‘mpz_class’ has not been declared
687src/Scanner.h:62: error: ‘mpz_class’ has not been declared
688In file included from src/NewMonosIOHandler.h:20,
689                 from src/NewMonosIOHandler.cpp:18:
690src/IOHandler.h: At global scope:
691src/IOHandler.h:39: error: ‘mpz_class’ was not declared in this scope
692src/IOHandler.h:39: error: template argument 1 is invalid
693src/IOHandler.h:39: error: template argument 2 is invalid
694src/Scanner.h:70: error: ‘mpz_class’ does not name a type
695src/IOHandler.h:59: error: ‘mpz_class’ was not declared in this scope
696src/IOHandler.h:59: error: template argument 1 is invalid
697src/IOHandler.h:59: error: template argument 2 is invalid
698In file included from src/IOHandler.h:63,
699                 from src/NewMonosIOHandler.h:20,
700                 from src/NewMonosIOHandler.cpp:18:
701src/BigTermConsumer.h:28: error: ‘mpz_ptr’ has not been declared
702In file included from src/NewMonosIOHandler.h:20,
703                 from src/NewMonosIOHandler.cpp:18:
704src/IOHandler.h:72: error: ‘mpz_class’ was not declared in this scope
705src/IOHandler.h:72: error: template argument 1 is invalid
706src/IOHandler.h:72: error: template argument 2 is invalid
707src/IOHandler.h:86: error: ‘mpz_ptr’ has not been declared
708src/IOHandler.h:100: error: ‘mpz_class’ was not declared in this scope
709src/IOHandler.h:100: error: template argument 1 is invalid
710src/IOHandler.h:100: error: template argument 2 is invalid
711src/IOParameters.cpp: In constructor ‘IOParameters::IOParameters(IOParameters::Type)’:
712src/IOParameters.cpp:41: error: no matching function for call to ‘StringParameter::StringParameter(const char [8], const char [206], const char [11])’
713src/StringParameter.h:24: note: candidates are: StringParameter::StringParameter(const char*, const char*, int) <near match>
714src/StringParameter.h:22: note:                 StringParameter::StringParameter(const StringParameter&)
715src/IOParameters.cpp:41: error: no matching function for call to ‘StringParameter::StringParameter(const char [8], const char*, const char*)’
716src/StringParameter.h:24: note: candidates are: StringParameter::StringParameter(const char*, const char*, int) <near match>
717src/StringParameter.h:22: note:                 StringParameter::StringParameter(const StringParameter&)
718src/IOHandler.h: In member function ‘virtual void IdealWriter::consume(int*)’:
719src/IOHandler.h:87: error: ‘mpz_class’ was not declared in this scope
720src/IOHandler.h:87: error: template argument 1 is invalid
721src/IOHandler.h:87: error: template argument 2 is invalid
722src/IOHandler.h:87: error: invalid type in declaration before ‘(’ token
723src/IOHandler.h:89: error: invalid types ‘int[size_t]’ for array subscript
724src/IOHandler.h: At global scope:
725src/IOHandler.h:109: error: ‘mpz_class’ was not declared in this scope
726src/IOHandler.h:109: error: template argument 1 is invalid
727src/IOHandler.h:109: error: template argument 2 is invalid
728src/IOParameters.cpp: At global scope:
729src/IOParameters.cpp:48: error: no ‘const std::string& IOParameters::getInputFormat() const’ member function declared in class ‘IOParameters’
730src/IOParameters.cpp:53: error: no ‘const std::string& IOParameters::getOutputFormat() const’ member function declared in class ‘IOParameters’
731src/IOParameters.cpp: In member function ‘void IOParameters::autoDetectInputFormat(Scanner&)’:
732src/IOParameters.cpp:65: error: no matching function for call to ‘StringParameter::getValue()’
733src/StringParameter.h:30: note: candidates are: virtual void StringParameter::getValue(int&) const
734src/IOParameters.cpp:73: error: no match for ‘operator=’ in ‘((IOParameters*)this)->IOParameters::_inputFormat = "m2"’
735src/StringParameter.h:35: note: candidates are: StringParameter& StringParameter::operator=(int) <near match>
736src/StringParameter.h:22: note:                 StringParameter& StringParameter::operator=(const StringParameter&)
737src/IOParameters.cpp:75: error: no match for ‘operator=’ in ‘((IOParameters*)this)->IOParameters::_inputFormat = "newmonos"’
738src/StringParameter.h:35: note: candidates are: StringParameter& StringParameter::operator=(int) <near match>
739src/StringParameter.h:22: note:                 StringParameter& StringParameter::operator=(const StringParameter&)
740src/IOParameters.cpp:77: error: no match for ‘operator=’ in ‘((IOParameters*)this)->IOParameters::_inputFormat = "4ti2"’
741src/StringParameter.h:35: note: candidates are: StringParameter& StringParameter::operator=(int) <near match>
742src/StringParameter.h:22: note:                 StringParameter& StringParameter::operator=(const StringParameter&)
743src/IOParameters.cpp:79: error: no match for ‘operator=’ in ‘((IOParameters*)this)->IOParameters::_inputFormat = "monos"’
744src/StringParameter.h:35: note: candidates are: StringParameter& StringParameter::operator=(int) <near match>
745src/StringParameter.h:22: note:                 StringParameter& StringParameter::operator=(const StringParameter&)
746src/IOParameters.cpp:83: error: no matching function for call to ‘Scanner::setFormat(StringParameter&)’
747src/Scanner.h:29: note: candidates are: void Scanner::setFormat(const std::string&)
748In file included from src/NewMonosIOHandler.cpp:20:
749src/Scanner.h:40: error: ‘mpz_class’ has not been declared
750src/Scanner.h:41: error: ‘mpz_class’ has not been declared
751src/IOParameters.cpp: In member function ‘void IOParameters::validateFormats() const’:
752src/IOParameters.cpp:90: error: ‘getInputFormat’ was not declared in this scope
753src/IOParameters.cpp:91: error: ‘stderr’ was not declared in this scope
754src/Scanner.h:62: error: ‘mpz_class’ has not been declared
755src/IOParameters.cpp:92: error: ‘fprintf’ was not declared in this scope
756src/Scanner.h:70: error: ‘mpz_class’ does not name a type
757src/IOParameters.cpp:97: error: ‘getOutputFormat’ was not declared in this scope
758src/IOParameters.cpp:98: error: ‘stderr’ was not declared in this scope
759src/IOParameters.cpp:99: error: ‘fprintf’ was not declared in this scope
760In file included from src/NewMonosIOHandler.cpp:21:
761src/BigIdeal.h:39: error: ISO C++ forbids declaration of ‘mpz_class’ with no type
762src/BigIdeal.h:39: error: expected ‘;’ before ‘&’ token
763src/BigIdeal.h:40: error: ‘mpz_class’ was not declared in this scope
764src/BigIdeal.h:40: error: template argument 1 is invalid
765src/BigIdeal.h:40: error: template argument 2 is invalid
766src/BigIdeal.h:41: error: ‘mpz_class’ was not declared in this scope
767src/BigIdeal.h:41: error: template argument 1 is invalid
768src/BigIdeal.h:41: error: template argument 2 is invalid
769src/BigIdeal.h:43: error: ‘mpz_class’ was not declared in this scope
770src/BigIdeal.h:43: error: template argument 1 is invalid
771src/BigIdeal.h:43: error: template argument 2 is invalid
772src/BigIdeal.h:45: error: ISO C++ forbids declaration of ‘mpz_class’ with no type
773src/BigIdeal.h:45: error: expected ‘;’ before ‘&’ token
774src/BigIdeal.h:46: error: ISO C++ forbids declaration of ‘mpz_class’ with no type
775src/BigIdeal.h:46: error: expected ‘;’ before ‘&’ token
776src/BigIdeal.h:47: error: ISO C++ forbids declaration of ‘mpz_class’ with no type
777src/BigIdeal.h:47: error: expected ‘,’ or ‘...’ before ‘&’ token
778src/BigIdeal.h:51: error: ‘mpz_class’ was not declared in this scope
779src/BigIdeal.h:51: error: template argument 1 is invalid
780src/BigIdeal.h:51: error: template argument 2 is invalid
781src/BigIdeal.h:52: error: ‘mpz_class’ was not declared in this scope
782src/BigIdeal.h:52: error: template argument 1 is invalid
783src/BigIdeal.h:52: error: template argument 2 is invalid
784src/BigIdeal.h:83: error: ‘mpz_class’ was not declared in this scope
785src/BigIdeal.h:83: error: template argument 1 is invalid
786src/BigIdeal.h:83: error: template argument 2 is invalid
787src/BigIdeal.h:84: error: ‘mpz_class’ was not declared in this scope
788src/BigIdeal.h:84: error: template argument 1 is invalid
789src/BigIdeal.h:84: error: template argument 2 is invalid
790In file included from src/TransformAction.cpp:20:
791src/BigIdeal.h: At global scope:
792src/BigIdeal.h:39: error: ISO C++ forbids declaration of ‘mpz_class’ with no type
793src/BigIdeal.h:39: error: expected ‘;’ before ‘&’ token
794src/BigIdeal.h:40: error: ‘mpz_class’ was not declared in this scope
795src/BigIdeal.h:40: error: template argument 1 is invalid
796src/BigIdeal.h:40: error: template argument 2 is invalid
797src/BigIdeal.h:41: error: ‘mpz_class’ was not declared in this scope
798src/BigIdeal.h:41: error: template argument 1 is invalid
799src/BigIdeal.h:41: error: template argument 2 is invalid
800src/BigIdeal.h:43: error: ‘mpz_class’ was not declared in this scope
801src/BigIdeal.h:43: error: template argument 1 is invalid
802src/BigIdeal.h:43: error: template argument 2 is invalid
803src/BigIdeal.h:45: error: ISO C++ forbids declaration of ‘mpz_class’ with no type
804src/BigIdeal.h:45: error: expected ‘;’ before ‘&’ token
805src/BigIdeal.h:46: error: ISO C++ forbids declaration of ‘mpz_class’ with no type
806src/BigIdeal.h:46: error: expected ‘;’ before ‘&’ token
807src/BigIdeal.h:47: error: ISO C++ forbids declaration of ‘mpz_class’ with no type
808src/BigIdeal.h:47: error: expected ‘,’ or ‘...’ before ‘&’ token
809src/BigIdeal.h:51: error: ‘mpz_class’ was not declared in this scope
810src/BigIdeal.h:51: error: template argument 1 is invalid
811src/BigIdeal.h:51: error: template argument 2 is invalid
812src/BigIdeal.h:52: error: ‘mpz_class’ was not declared in this scope
813src/BigIdeal.h:52: error: template argument 1 is invalid
814src/BigIdeal.h:52: error: template argument 2 is invalid
815src/BigIdeal.h:83: error: ‘mpz_class’ was not declared in this scope
816src/BigIdeal.h:83: error: template argument 1 is invalid
817src/BigIdeal.h:83: error: template argument 2 is invalid
818src/BigIdeal.h:84: error: ‘mpz_class’ was not declared in this scope
819src/BigIdeal.h:84: error: template argument 1 is invalid
820src/BigIdeal.h:84: error: template argument 2 is invalid
821make: *** [bin/debug/fourti2.o] Error 1
822src/BigIdeal.h:87: error: ‘mpz_class’ was not declared in this scope
823src/BigIdeal.h:87: error: template argument 1 is invalid
824src/BigIdeal.h:87: error: template argument 2 is invalid
825src/BigIdeal.h:87: error: template argument 1 is invalid
826src/BigIdeal.h:87: error: template argument 2 is invalid
827src/NewMonosIOHandler.cpp:45: error: ‘mpz_class’ was not declared in this scope
828src/NewMonosIOHandler.cpp:45: error: template argument 1 is invalid
829src/NewMonosIOHandler.cpp:45: error: template argument 2 is invalid
830src/NewMonosIOHandler.cpp: In destructor ‘virtual NewMonosIdealWriter::~NewMonosIdealWriter()’:
831src/NewMonosIOHandler.cpp:37: error: ‘fputs’ was not declared in this scope
832src/NewMonosIOHandler.cpp: In member function ‘virtual void NewMonosIdealWriter::consume(const std::vector<const char*, std::allocator<const char*> >&)’:
833src/NewMonosIOHandler.cpp:42: error: ‘putc’ was not declared in this scope
834src/NewMonosIOHandler.cpp: In member function ‘virtual void NewMonosIdealWriter::consume(const int&)’:
835src/NewMonosIOHandler.cpp:47: error: ‘putc’ was not declared in this scope
836src/NewMonosIOHandler.cpp: In member function ‘virtual void NewMonosIdealWriter::consume(const Term&)’:
837src/NewMonosIOHandler.cpp:52: error: ‘putc’ was not declared in this scope
838src/BigIdeal.h:87: error: ‘mpz_class’ was not declared in this scope
839src/BigIdeal.h:87: error: template argument 1 is invalid
840src/BigIdeal.h:87: error: template argument 2 is invalid
841src/NewMonosIOHandler.cpp: In member function ‘void NewMonosIdealWriter::writeHeader()’:
842src/NewMonosIOHandler.cpp:57: error: ‘fputs’ was not declared in this scope
843src/BigIdeal.h:87: error: template argument 1 is invalid
844src/BigIdeal.h:87: error: template argument 2 is invalid
845In file included from src/IOHandler.h:21,
846                 from src/MonosIOHandler.h:20,
847                 from src/MonosIOHandler.cpp:18:
848src/VarNames.h: In member function ‘bool StringEquals::operator()(const char*, const char*) const’:
849src/VarNames.h:30: error: ‘strcmp’ was not declared in this scope
850src/NewMonosIOHandler.cpp:59: error: ‘putc’ was not declared in this scope
851In file included from src/TransformAction.cpp:21:
852src/IOFacade.h:36: error: ‘mpz_class’ was not declared in this scope
853src/IOFacade.h:36: error: template argument 1 is invalid
854src/IOFacade.h:36: error: template argument 2 is invalid
855src/IOFacade.h:38: error: ‘mpz_class’ was not declared in this scope
856src/IOFacade.h:38: error: template argument 1 is invalid
857src/IOFacade.h:38: error: template argument 2 is invalid
858src/IOFacade.h:39: error: ‘mpz_class’ was not declared in this scope
859src/IOFacade.h:39: error: template argument 1 is invalid
860src/IOFacade.h:39: error: template argument 2 is invalid
861src/IOFacade.h:42: error: ‘mpz_class’ was not declared in this scope
862src/IOFacade.h:42: error: template argument 1 is invalid
863src/IOFacade.h:42: error: template argument 2 is invalid
864In file included from src/BigIdeal.h:20,
865                 from src/IrreducibleDecomAction.cpp:20:
866src/VarNames.h: In member function ‘bool StringEquals::operator()(const char*, const char*) const’:
867src/VarNames.h:30: error: ‘strcmp’ was not declared in this scope
868In file included from src/TransformAction.cpp:23:
869src/Scanner.h:40: error: ‘mpz_class’ has not been declared
870src/Scanner.h:41: error: ‘mpz_class’ has not been declared
871In file included from src/BigIdeal.h:20,
872                 from src/BigIdeal.cpp:18:
873src/VarNames.h: In member function ‘bool StringEquals::operator()(const char*, const char*) const’:
874src/VarNames.h:30: error: ‘strcmp’ was not declared in this scope
875src/Scanner.h:62: error: ‘mpz_class’ has not been declared
876src/Scanner.h:70: error: ‘mpz_class’ does not name a type
877src/NewMonosIOHandler.cpp: In member function ‘void NewMonosIOHandler::readVarsAndClearIdeal(BigIdeal&, Scanner&)’:
878src/NewMonosIOHandler.cpp:121: error: ‘stderr’ was not declared in this scope
879src/NewMonosIOHandler.cpp:121: error: ‘fprintf’ was not declared in this scope
880In file included from src/IOHandler.h:21,
881                 from src/IOHandler.cpp:18:
882src/VarNames.h: In member function ‘bool StringEquals::operator()(const char*, const char*) const’:
883src/VarNames.h:30: error: ‘strcmp’ was not declared in this scope
884src/TransformAction.cpp: In member function ‘virtual void TransformAction::perform()’:
885src/TransformAction.cpp:87: error: ‘class IOParameters’ has no member named ‘getInputFormat’
886src/TransformAction.cpp:87: error: ‘stdin’ was not declared in this scope
887make: src/TransformAction.cpp:105: error: ‘stdout’ was not declared in this scope
888*** [bin/debug/IOParameters.o] Error 1
889src/TransformAction.cpp:106: error: ‘class IOParameters’ has no member named ‘getOutputFormat’
890src/TransformAction.cpp:123: error: ‘stdout’ was not declared in this scope
891src/TransformAction.cpp:123: error: ‘class IOParameters’ has no member named ‘getOutputFormat’
892In file included from src/BigIdeal.h:20,
893                 from src/fplllIO.cpp:20:
894src/VarNames.h: In member function ‘bool StringEquals::operator()(const char*, const char*) const’:
895src/VarNames.h:30: error: ‘strcmp’ was not declared in this scope
896In file included from src/IOHandler.h:21,
897                 from src/Macaulay2IOHandler.h:20,
898                 from src/Macaulay2IOHandler.cpp:18:
899src/VarNames.h: In member function ‘bool StringEquals::operator()(const char*, const char*) const’:
900src/VarNames.h:30: error: ‘strcmp’ was not declared in this scope
901In file included from src/BigIdeal.h:20,
902                 from src/randomDataGenerators.cpp:20:
903src/VarNames.h: In member function ‘bool StringEquals::operator()(const char*, const char*) const’:
904src/VarNames.h:30: error: ‘strcmp’ was not declared in this scope
905In file included from src/MonosIOHandler.h:20,
906                 from src/MonosIOHandler.cpp:18:
907src/IOHandler.h: At global scope:
908src/IOHandler.h:39: error: ‘mpz_class’ was not declared in this scope
909src/IOHandler.h:39: error: template argument 1 is invalid
910src/IOHandler.h:39: error: template argument 2 is invalid
911src/IOHandler.h:59: error: ‘mpz_class’ was not declared in this scope
912src/IOHandler.h:59: error: template argument 1 is invalid
913src/IOHandler.h:59: error: template argument 2 is invalid
914In file included from src/IOHandler.h:63,
915                 from src/MonosIOHandler.h:20,
916                 from src/MonosIOHandler.cpp:18:
917src/BigTermConsumer.h:28: error: ‘mpz_ptr’ has not been declared
918In file included from src/MonosIOHandler.h:20,
919                 from src/MonosIOHandler.cpp:18:
920src/IOHandler.h:72: error: ‘mpz_class’ was not declared in this scope
921src/IOHandler.h:72: error: template argument 1 is invalid
922src/IOHandler.h:72: error: template argument 2 is invalid
923src/IOHandler.h:86: error: ‘mpz_ptr’ has not been declared
924src/IOHandler.h:100: error: ‘mpz_class’ was not declared in this scope
925src/IOHandler.h:100: error: template argument 1 is invalid
926src/IOHandler.h:100: error: template argument 2 is invalid
927In file included from src/BigIdeal.cpp:18:
928src/BigIdeal.h: At global scope:
929src/BigIdeal.h:39: error: ISO C++ forbids declaration of ‘mpz_class’ with no type
930src/BigIdeal.h:39: error: expected ‘;’ before ‘&’ token
931src/BigIdeal.h:40: error: ‘mpz_class’ was not declared in this scope
932src/BigIdeal.h:40: error: template argument 1 is invalid
933src/BigIdeal.h:40: error: template argument 2 is invalid
934src/BigIdeal.h:41: error: ‘mpz_class’ was not declared in this scope
935src/BigIdeal.h:41: error: template argument 1 is invalid
936src/BigIdeal.h:41: error: template argument 2 is invalid
937src/BigIdeal.h:43: error: ‘mpz_class’ was not declared in this scope
938src/BigIdeal.h:43: error: template argument 1 is invalid
939src/BigIdeal.h:43: error: template argument 2 is invalid
940src/BigIdeal.h:45: error: ISO C++ forbids declaration of ‘mpz_class’ with no type
941src/BigIdeal.h:45: error: expected ‘;’ before ‘&’ token
942src/BigIdeal.h:46: error: ISO C++ forbids declaration of ‘mpz_class’ with no type
943src/IOHandler.h: In member function ‘virtual void IdealWriter::consume(int*)’:
944src/IOHandler.h:87: error: ‘mpz_class’ was not declared in this scopesrc/BigIdeal.h:46: error: expected ‘;’ before ‘&’ token
945
946src/IOHandler.h:87: error: template argument 1 is invalid
947src/IOHandler.h:87: error: template argument 2 is invalid
948src/BigIdeal.h:47: error: ISO C++ forbids declaration of ‘mpz_class’ with no type
949src/BigIdeal.h:47: error: expected ‘,’ or ‘...’ before ‘&’ token
950src/IOHandler.h:87: error: invalid type in declaration before ‘(’ token
951src/BigIdeal.h:51: error: ‘mpz_class’ was not declared in this scope
952src/BigIdeal.h:51: error: template argument 1 is invalid
953src/BigIdeal.h:51: error: template argument 2 is invalid
954src/BigIdeal.h:52: error: ‘mpz_class’ was not declared in this scope
955src/BigIdeal.h:52: error: template argument 1 is invalid
956src/IOHandler.h:89: error: invalid types ‘int[size_t]’ for array subscript
957src/BigIdeal.h:52: error: template argument 2 is invalid
958In file included from src/IrreducibleDecomAction.cpp:20:
959src/BigIdeal.h: At global scope:
960src/BigIdeal.h:39: error: ISO C++ forbids declaration of ‘mpz_class’ with no type
961src/BigIdeal.h:39: error: expected ‘;’ before ‘&’ token
962src/BigIdeal.h:40: error: ‘mpz_class’ was not declared in this scope
963src/BigIdeal.h:40: error: template argument 1 is invalid
964src/BigIdeal.h:40: error: template argument 2 is invalid
965src/BigIdeal.h:41: error: ‘mpz_class’ was not declared in this scope
966src/BigIdeal.h:41: error: template argument 1 is invalid
967src/BigIdeal.h:41: error: template argument 2 is invalid
968src/IOHandler.h: At global scope:
969src/IOHandler.h:109: error: ‘mpz_class’ was not declared in this scope
970src/IOHandler.h:109: error: template argument 1 is invalid
971src/IOHandler.h:109: error: template argument 2 is invalid
972src/BigIdeal.h:43: error: ‘mpz_class’ was not declared in this scope
973src/BigIdeal.h:43: error: template argument 1 is invalid
974src/BigIdeal.h:43: error: template argument 2 is invalid
975src/BigIdeal.h:83: error: ‘mpz_class’ was not declared in this scope
976src/BigIdeal.h:83: error: template argument 1 is invalid
977src/BigIdeal.h:83: error: template argument 2 is invalidsrc/BigIdeal.h:45: error: ISO C++ forbids declaration of ‘mpz_class’ with no type
978
979src/BigIdeal.h:45: error: expected ‘;’ before ‘&’ token
980src/BigIdeal.h:84: error: ‘mpz_class’ was not declared in this scope
981src/BigIdeal.h:46: error: ISO C++ forbids declaration of ‘mpz_class’ with no type
982src/BigIdeal.h:84: error: template argument 1 is invalid
983src/BigIdeal.h:46: error: expected ‘;’ before ‘&’ token
984src/BigIdeal.h:84: error: template argument 2 is invalid
985src/BigIdeal.h:47: error: ISO C++ forbids declaration of ‘mpz_class’ with no type
986src/BigIdeal.h:47: error: expected ‘,’ or ‘...’ before ‘&’ token
987src/BigIdeal.h:51: error: ‘mpz_class’ was not declared in this scope
988src/BigIdeal.h:51: error: template argument 1 is invalid
989src/BigIdeal.h:51: error: template argument 2 is invalid
990In file included from src/IOHandler.cpp:18:
991src/IOHandler.h: At global scope:
992src/IOHandler.h:39: error: ‘mpz_class’ was not declared in this scope
993src/IOHandler.h:39: error: template argument 1 is invalid
994src/IOHandler.h:39: error: template argument 2 is invalid
995src/BigIdeal.h:52: error: ‘mpz_class’ was not declared in this scope
996src/BigIdeal.h:52: error: template argument 1 is invalid
997src/BigIdeal.h:52: error: template argument 2 is invalid
998src/BigIdeal.h:83: error: ‘mpz_class’ was not declared in this scope
999src/BigIdeal.h:83: error: template argument 1 is invalid
1000src/BigIdeal.h:83: error: template argument 2 is invalid
1001src/IOHandler.h:59: error: ‘mpz_class’ was not declared in this scope
1002src/BigIdeal.h:84: error: ‘mpz_class’ was not declared in this scope
1003src/IOHandler.h:59: error: template argument 1 is invalid
1004src/BigIdeal.h:84: error: template argument 1 is invalid
1005src/IOHandler.h:59: error: template argument 2 is invalid
1006src/BigIdeal.h:84: error: template argument 2 is invalid
1007In file included from src/IOHandler.h:63,
1008                 from src/IOHandler.cpp:18:
1009src/BigTermConsumer.h:28: error: ‘mpz_ptr’ has not been declared
1010make: *** [bin/debug/NewMonosIOHandler.o] Error 1
1011In file included from src/IOHandler.cpp:18:
1012src/IOHandler.h:72: error: ‘mpz_class’ was not declared in this scope
1013src/IOHandler.h:72: error: template argument 1 is invalid
1014src/IOHandler.h:72: error: template argument 2 is invalid
1015src/IOHandler.h:86: error: ‘mpz_ptr’ has not been declared
1016src/IOHandler.h:100: error: ‘mpz_class’ was not declared in this scope
1017src/IOHandler.h:100: error: template argument 1 is invalid
1018src/IOHandler.h:100: error: template argument 2 is invalid
1019In file included from src/MonosIOHandler.cpp:20:
1020src/BigIdeal.h:39: error: ISO C++ forbids declaration of ‘mpz_class’ with no type
1021src/BigIdeal.h:39: error: expected ‘;’ before ‘&’ token
1022src/BigIdeal.h:40: error: ‘mpz_class’ was not declared in this scope
1023src/BigIdeal.h:40: error: template argument 1 is invalid
1024src/BigIdeal.h:40: error: template argument 2 is invalid
1025src/BigIdeal.h:41: error: ‘mpz_class’ was not declared in this scope
1026src/BigIdeal.h:41: error: template argument 1 is invalid
1027src/BigIdeal.h:41: error: template argument 2 is invalid
1028src/BigIdeal.h:43: error: ‘mpz_class’ was not declared in this scope
1029src/BigIdeal.h:43: error: template argument 1 is invalid
1030src/BigIdeal.h:43: error: template argument 2 is invalid
1031src/BigIdeal.h:45: error: ISO C++ forbids declaration of ‘mpz_class’ with no type
1032src/BigIdeal.h:45: error: expected ‘;’ before ‘&’ token
1033src/BigIdeal.h:46: error: ISO C++ forbids declaration of ‘mpz_class’ with no type
1034src/BigIdeal.h:46: error: expected ‘;’ before ‘&’ token
1035src/BigIdeal.h:47: error: ISO C++ forbids declaration of ‘mpz_class’ with no type
1036src/BigIdeal.h:47: error: expected ‘,’ or ‘...’ before ‘&’ token
1037src/BigIdeal.h:51: error: ‘mpz_class’ was not declared in this scope
1038src/BigIdeal.h:51: error: template argument 1 is invalid
1039src/BigIdeal.h:51: error: template argument 2 is invalid
1040src/BigIdeal.h:52: error: ‘mpz_class’ was not declared in this scope
1041src/BigIdeal.h:52: error: template argument 1 is invalid
1042src/BigIdeal.h:52: error: template argument 2 is invalid
1043src/BigIdeal.h:83: error: ‘mpz_class’ was not declared in this scope
1044src/BigIdeal.h:83: error: template argument 1 is invalid
1045src/BigIdeal.h:83: error: template argument 2 is invalid
1046src/BigIdeal.h:84: error: ‘mpz_class’ was not declared in this scope
1047src/BigIdeal.h:84: error: template argument 1 is invalid
1048src/BigIdeal.h:84: error: template argument 2 is invalid
1049src/IOHandler.h: In member function ‘virtual void IdealWriter::consume(int*)’:
1050src/IOHandler.h:87: error: ‘mpz_class’ was not declared in this scope
1051src/IOHandler.h:87: error: template argument 1 is invalid
1052src/IOHandler.h:87: error: template argument 2 is invalid
1053src/IOHandler.h:87: error: invalid type in declaration before ‘(’ token
1054src/IOHandler.h:89: error: invalid types ‘int[size_t]’ for array subscript
1055src/IOHandler.h: At global scope:
1056src/IOHandler.h:109: error: ‘mpz_class’ was not declared in this scope
1057src/IOHandler.h:109: error: template argument 1 is invalid
1058src/IOHandler.h:109: error: template argument 2 is invalid
1059src/BigIdeal.h:87: error: ‘mpz_class’ was not declared in this scope
1060src/BigIdeal.h:87: error: template argument 1 is invalid
1061src/BigIdeal.h:87: error: template argument 2 is invalid
1062src/BigIdeal.h:87: error: template argument 1 is invalid
1063src/BigIdeal.h:87: error: template argument 2 is invalid
1064In file included from src/IOHandler.cpp:20:
1065src/Scanner.h:40: error: ‘mpz_class’ has not been declared
1066src/Scanner.h:41: error: ‘mpz_class’ has not been declared
1067src/Scanner.h:62: error: ‘mpz_class’ has not been declared
1068In file included from src/IrreducibleDecomFacade.h:31,
1069                 from src/IrreducibleDecomAction.cpp:21:
1070src/BigTermConsumer.h:28: error: ‘mpz_ptr’ has not been declared
1071src/Scanner.h:70: error: ‘mpz_class’ does not name a type
1072src/BigIdeal.h:87: error: ‘mpz_class’ was not declared in this scope
1073src/BigIdeal.h:87: error: template argument 1 is invalid
1074src/BigIdeal.h:87: error: template argument 2 is invalid
1075src/BigIdeal.h:87: error: template argument 1 is invalid
1076src/BigIdeal.h:87: error: template argument 2 is invalid
1077In file included from src/IrreducibleDecomAction.cpp:21:
1078src/IrreducibleDecomFacade.h:52: error: ‘mpz_class’ was not declared in this scope
1079src/IrreducibleDecomFacade.h:52: error: template argument 1 is invalid
1080src/IrreducibleDecomFacade.h:52: error: template argument 2 is invalid
1081src/IrreducibleDecomFacade.h:55: error: ‘mpz_class’ was not declared in this scope
1082src/IrreducibleDecomFacade.h:55: error: template argument 1 is invalid
1083src/IrreducibleDecomFacade.h:55: error: template argument 2 is invalid
1084src/IrreducibleDecomFacade.h:57: error: ‘mpz_class’ has not been declared
1085src/IrreducibleDecomFacade.h:58: error: ‘mpz_class’ was not declared in this scope
1086src/IrreducibleDecomFacade.h:58: error: template argument 1 is invalid
1087src/IrreducibleDecomFacade.h:58: error: template argument 2 is invalid
1088In file included from src/BigIdeal.cpp:21:
1089src/TermTranslator.h:51: error: ISO C++ forbids declaration of ‘mpz_class’ with no type
1090src/TermTranslator.h:51: error: expected ‘;’ before ‘&’ token
1091In file included from src/IOHandler.cpp:21:
1092src/BigIdeal.h:39: error: ISO C++ forbids declaration of ‘mpz_class’ with no type
1093src/TermTranslator.h:52: error: ISO C++ forbids declaration of ‘mpz_class’ with no type
1094src/TermTranslator.h:52: error: expected ‘;’ before ‘&’ token
1095src/BigIdeal.h:39: error: expected ‘;’ before ‘&’ token
1096src/BigIdeal.h:40: error: ‘mpz_class’ was not declared in this scope
1097src/BigIdeal.h:40: error: template argument 1 is invalid
1098src/BigIdeal.h:40: error: template argument 2 is invalid
1099src/BigIdeal.h:41: error: ‘mpz_class’ was not declared in this scope
1100src/BigIdeal.h:41: error: template argument 1 is invalid
1101src/BigIdeal.h:41: error: template argument 2 is invalid
1102src/TermTranslator.h:79: error: ‘mpz_class’ was not declared in this scope
1103src/BigIdeal.h:43: error: ‘mpz_class’ was not declared in this scopesrc/TermTranslator.h:79: error: template argument 1 is invalid
1104
1105src/TermTranslator.h:79: error: template argument 2 is invalidsrc/BigIdeal.h:43: error: template argument 1 is invalid
1106
1107src/BigIdeal.h:43: error: template argument 2 is invalid
1108In file included from src/randomDataGenerators.cpp:20:
1109src/BigIdeal.h: At global scope:
1110src/BigIdeal.h:39: error: ISO C++ forbids declaration of ‘mpz_class’ with no type
1111src/BigIdeal.h:45: error: ISO C++ forbids declaration of ‘mpz_class’ with no type
1112src/BigIdeal.h:39: error: expected ‘;’ before ‘&’ token
1113src/BigIdeal.h:45: error: expected ‘;’ before ‘&’ token
1114src/BigIdeal.h:46: error: ISO C++ forbids declaration of ‘mpz_class’ with no type
1115src/BigIdeal.h:40: error: ‘mpz_class’ was not declared in this scope
1116src/BigIdeal.h:46: error: expected ‘;’ before ‘&’ token
1117src/BigIdeal.h:40: error: template argument 1 is invalid
1118src/BigIdeal.h:40: error: template argument 2 is invalid
1119src/BigIdeal.h:47: error: ISO C++ forbids declaration of ‘mpz_class’ with no type
1120src/BigIdeal.h:47: error: expected ‘,’ or ‘...’ before ‘&’ token
1121src/BigIdeal.h:41: error: ‘mpz_class’ was not declared in this scope
1122src/BigIdeal.h:41: error: template argument 1 is invalid
1123src/BigIdeal.h:41: error: template argument 2 is invalid
1124In file included from src/IrreducibleDecomAction.cpp:22:
1125src/IOFacade.h:36: error: ‘mpz_class’ was not declared in this scope
1126src/BigIdeal.h:51: error: ‘mpz_class’ was not declared in this scopesrc/IOFacade.h:36: error: template argument 1 is invalid
1127
1128src/TermTranslator.h:92: error: ISO C++ forbids declaration of ‘mpz_class’ with no type
1129src/IOFacade.h:36: error: template argument 2 is invalidsrc/BigIdeal.h:51: error: template argument 1 is invalid
1130
1131src/BigIdeal.h:43: error: ‘mpz_class’ was not declared in this scopesrc/TermTranslator.h:92: error: expected ‘,’ or ‘...’ before ‘&’ token
1132
1133src/BigIdeal.h:51: error: template argument 2 is invalid
1134src/BigIdeal.h:43: error: template argument 1 is invalid
1135src/BigIdeal.h:43: error: template argument 2 is invalid
1136In file included from src/fplllIO.cpp:20:
1137src/BigIdeal.h: At global scope:
1138src/BigIdeal.h:39: error: ISO C++ forbids declaration of ‘mpz_class’ with no type
1139src/TermTranslator.h:94: error: ‘mpz_class’ was not declared in this scopesrc/IOFacade.h:38: error: ‘mpz_class’ was not declared in this scope
1140
1141src/BigIdeal.h:52: error: ‘mpz_class’ was not declared in this scope
1142src/BigIdeal.h:45: error: ISO C++ forbids declaration of ‘mpz_class’ with no typesrc/BigIdeal.h:39: error: expected ‘;’ before ‘&’ tokensrc/TermTranslator.h:94: error: template argument 1 is invalidsrc/BigIdeal.h:52: error: template argument 1 is invalid
1143src/IOFacade.h:38: error: template argument 1 is invalid
1144
1145
1146
1147src/BigIdeal.h:45: error: expected ‘;’ before ‘&’ tokensrc/BigIdeal.h:52: error: template argument 2 is invalidsrc/IOFacade.h:38: error: template argument 2 is invalid
1148
1149
1150src/TermTranslator.h:94: error: template argument 2 is invalid
1151src/BigIdeal.h:46: error: ISO C++ forbids declaration of ‘mpz_class’ with no typesrc/TermTranslator.h:94: error: template argument 1 is invalidsrc/BigIdeal.h:40: error: ‘mpz_class’ was not declared in this scope
1152
1153
1154src/TermTranslator.h:94: error: template argument 2 is invalidsrc/BigIdeal.h:46: error: expected ‘;’ before ‘&’ token
1155src/BigIdeal.h:40: error: template argument 1 is invalid
1156
1157src/BigIdeal.h:40: error: template argument 2 is invalid
1158src/IOFacade.h:39: error: ‘mpz_class’ was not declared in this scope
1159src/BigIdeal.h:47: error: ISO C++ forbids declaration of ‘mpz_class’ with no type
1160src/IOFacade.h:39: error: template argument 1 is invalid
1161src/BigIdeal.h:47: error: expected ‘,’ or ‘...’ before ‘&’ tokensrc/IOFacade.h:39: error: template argument 2 is invalid
1162
1163src/BigIdeal.h:41: error: ‘mpz_class’ was not declared in this scope
1164src/BigIdeal.h:41: error: template argument 1 is invalid
1165src/BigIdeal.h:41: error: template argument 2 is invalid
1166src/IOFacade.h:42: error: ‘mpz_class’ was not declared in this scope
1167src/BigIdeal.h:51: error: ‘mpz_class’ was not declared in this scopesrc/IOFacade.h:42: error: template argument 1 is invalid
1168
1169src/IOFacade.h:42: error: template argument 2 is invalidsrc/BigIdeal.h:51: error: template argument 1 is invalid
1170
1171src/BigIdeal.h:43: error: ‘mpz_class’ was not declared in this scope
1172src/BigIdeal.h:51: error: template argument 2 is invalid
1173src/BigIdeal.h:43: error: template argument 1 is invalid
1174In file included from src/Macaulay2IOHandler.h:20,
1175                 from src/Macaulay2IOHandler.cpp:18:
1176src/IOHandler.h: At global scope:
1177src/IOHandler.h:39: error: ‘mpz_class’ was not declared in this scopesrc/BigIdeal.h:43: error: template argument 2 is invalid
1178
1179src/IOHandler.h:39: error: template argument 1 is invalid
1180src/BigIdeal.h:83: error: ‘mpz_class’ was not declared in this scope
1181src/IOHandler.h:39: error: template argument 2 is invalid
1182src/BigIdeal.h:83: error: template argument 1 is invalid
1183src/BigIdeal.h:45: error: ISO C++ forbids declaration of ‘mpz_class’ with no type
1184src/BigIdeal.h:83: error: template argument 2 is invalid
1185src/BigIdeal.h:52: error: ‘mpz_class’ was not declared in this scope
1186src/BigIdeal.h:45: error: expected ‘;’ before ‘&’ token
1187src/BigIdeal.h:52: error: template argument 1 is invalid
1188src/BigIdeal.h:52: error: template argument 2 is invalid
1189src/BigIdeal.h:46: error: ISO C++ forbids declaration of ‘mpz_class’ with no typesrc/BigIdeal.h:84: error: ‘mpz_class’ was not declared in this scope
1190
1191src/BigIdeal.h:84: error: template argument 1 is invalidsrc/BigIdeal.h:46: error: expected ‘;’ before ‘&’ token
1192
1193src/BigIdeal.h:84: error: template argument 2 is invalid
1194src/BigIdeal.h:47: error: ISO C++ forbids declaration of ‘mpz_class’ with no type
1195src/BigIdeal.h:47: error: expected ‘,’ or ‘...’ before ‘&’ token
1196src/BigIdeal.h:51: error: ‘mpz_class’ was not declared in this scope
1197src/BigIdeal.h:51: error: template argument 1 is invalid
1198src/BigIdeal.h:51: error: template argument 2 is invalid
1199src/BigIdeal.h:83: error: ‘mpz_class’ was not declared in this scope
1200src/BigIdeal.h:83: error: template argument 1 is invalidsrc/BigIdeal.h:52: error: ‘mpz_class’ was not declared in this scope
1201
1202src/BigIdeal.h:83: error: template argument 2 is invalidsrc/BigIdeal.h:52: error: template argument 1 is invalid
1203
1204src/BigIdeal.h:52: error: template argument 2 is invalid
1205src/IOHandler.h:59: error: ‘mpz_class’ was not declared in this scope
1206src/IOHandler.h:59: error: template argument 1 is invalid
1207src/BigIdeal.h:84: error: ‘mpz_class’ was not declared in this scope
1208src/IOHandler.h:59: error: template argument 2 is invalid
1209src/BigIdeal.h:84: error: template argument 1 is invalid
1210In file included from src/IrreducibleDecomAction.cpp:23:
1211src/Scanner.h:40: error: ‘mpz_class’ has not been declared
1212src/BigIdeal.h:84: error: template argument 2 is invalid
1213src/Scanner.h:41: error: ‘mpz_class’ has not been declared
1214src/BigIdeal.h:87: error: ‘mpz_class’ was not declared in this scope
1215src/BigIdeal.h:87: error: template argument 1 is invalid
1216src/BigIdeal.h:87: error: template argument 2 is invalid
1217src/BigIdeal.h:87: error: template argument 1 is invalid
1218src/BigIdeal.h:87: error: template argument 2 is invalid
1219src/Scanner.h:62: error: ‘mpz_class’ has not been declaredsrc/BigIdeal.h:83: error: ‘mpz_class’ was not declared in this scope
1220
1221src/BigIdeal.h:83: error: template argument 1 is invalid
1222src/BigIdeal.h:83: error: template argument 2 is invalid
1223src/BigIdeal.h:84: error: ‘mpz_class’ was not declared in this scope
1224In file included from src/IOHandler.h:63,
1225                 from src/Macaulay2IOHandler.h:20,
1226                 from src/Macaulay2IOHandler.cpp:18:
1227src/BigTermConsumer.h:28: error: ‘mpz_ptr’ has not been declared
1228src/BigIdeal.h:84: error: template argument 1 is invalid
1229src/BigIdeal.h:84: error: template argument 2 is invalid
1230src/Scanner.h:70: error: ‘mpz_class’ does not name a type
1231In file included from src/MonosIOHandler.cpp:21:
1232src/Scanner.h:40: error: ‘mpz_class’ has not been declared
1233src/Scanner.h:41: error: ‘mpz_class’ has not been declared
1234In file included from src/Macaulay2IOHandler.h:20,
1235                 from src/Macaulay2IOHandler.cpp:18:
1236src/IOHandler.h:72: error: ‘mpz_class’ was not declared in this scope
1237src/IOHandler.h:72: error: template argument 1 is invalid
1238src/IOHandler.h:72: error: template argument 2 is invalid
1239src/IOHandler.h:86: error: ‘mpz_ptr’ has not been declared
1240src/Scanner.h:62: error: ‘mpz_class’ has not been declared
1241src/Scanner.h:70: error: ‘mpz_class’ does not name a type
1242src/IOHandler.h:100: error: ‘mpz_class’ was not declared in this scope
1243src/IOHandler.h:100: error: template argument 1 is invalid
1244src/IOHandler.h:100: error: template argument 2 is invalid
1245In file included from src/IrreducibleDecomAction.cpp:24:
1246src/IOHandler.h:39: error: ‘mpz_class’ was not declared in this scope
1247src/IOHandler.h:39: error: template argument 1 is invalid
1248src/IOHandler.h:39: error: template argument 2 is invalid
1249src/IOHandler.h:59: error: ‘mpz_class’ was not declared in this scope
1250src/IOHandler.h:59: error: template argument 1 is invalid
1251src/IOHandler.h:59: error: template argument 2 is invalid
1252src/IOHandler.h:72: error: ‘mpz_class’ was not declared in this scope
1253src/IOHandler.h:72: error: template argument 1 is invalid
1254src/IOHandler.h:72: error: template argument 2 is invalid
1255src/IOHandler.h:86: error: ‘mpz_ptr’ has not been declared
1256src/IOHandler.h: In member function ‘virtual void IdealWriter::consume(int*)’:
1257src/IOHandler.h:87: error: ‘mpz_class’ was not declared in this scope
1258src/IOHandler.h:87: error: template argument 1 is invalid
1259src/IOHandler.h:87: error: template argument 2 is invalid
1260src/IOHandler.h:87: error: invalid type in declaration before ‘(’ token
1261src/IOHandler.h:100: error: ‘mpz_class’ was not declared in this scope
1262src/IOHandler.h:100: error: template argument 1 is invalid
1263src/IOHandler.h:100: error: template argument 2 is invalid
1264src/IOHandler.h:89: error: invalid types ‘int[size_t]’ for array subscript
1265src/IOHandler.h: At global scope:
1266src/IOHandler.h:109: error: ‘mpz_class’ was not declared in this scope
1267src/IOHandler.h:109: error: template argument 1 is invalid
1268src/IOHandler.h:109: error: template argument 2 is invalid
1269src/IOHandler.h: In member function ‘virtual void IdealWriter::consume(int*)’:
1270src/IOHandler.h:87: error: ‘mpz_class’ was not declared in this scope
1271src/IOHandler.h:87: error: template argument 1 is invalid
1272src/IOHandler.h:87: error: template argument 2 is invalid
1273src/IOHandler.h:87: error: invalid type in declaration before ‘(’ token
1274src/IOHandler.h:89: error: invalid types ‘int[size_t]’ for array subscript
1275src/IOHandler.h: At global scope:
1276src/IOHandler.h:109: error: ‘mpz_class’ was not declared in this scope
1277src/IOHandler.h:109: error: template argument 1 is invalid
1278src/IOHandler.h:109: error: template argument 2 is invalid
1279src/BigIdeal.h:87: error: ‘mpz_class’ was not declared in this scope
1280src/BigIdeal.h:87: error: template argument 1 is invalid
1281src/BigIdeal.h:87: error: template argument 2 is invalid
1282src/BigIdeal.h:87: error: template argument 1 is invalid
1283src/BigIdeal.h:87: error: template argument 2 is invalid
1284src/BigIdeal.h:87: error: ‘mpz_class’ was not declared in this scope
1285src/BigIdeal.h:87: error: template argument 1 is invalid
1286src/BigIdeal.h:87: error: template argument 2 is invalid
1287src/BigIdeal.h:87: error: template argument 1 is invalid
1288src/BigIdeal.h:87: error: template argument 2 is invalid
1289In file included from src/Macaulay2IOHandler.cpp:20:
1290src/Scanner.h:40: error: ‘mpz_class’ has not been declared
1291src/Scanner.h:41: error: ‘mpz_class’ has not been declared
1292In file included from src/IOHandler.cpp:22:
1293src/TermTranslator.h:51: error: ISO C++ forbids declaration of ‘mpz_class’ with no type
1294src/TermTranslator.h:51: error: expected ‘;’ before ‘&’ token
1295src/TermTranslator.h:52: error: ISO C++ forbids declaration of ‘mpz_class’ with no type
1296src/TermTranslator.h:52: error: expected ‘;’ before ‘&’ token
1297src/Scanner.h:62: error: ‘mpz_class’ has not been declared
1298src/TermTranslator.h:79: error: ‘mpz_class’ was not declared in this scope
1299src/TermTranslator.h:79: error: template argument 1 is invalid
1300src/Scanner.h:70: error: ‘mpz_class’ does not name a type
1301src/TermTranslator.h:79: error: template argument 2 is invalid
1302src/TermTranslator.h:92: error: ISO C++ forbids declaration of ‘mpz_class’ with no type
1303src/TermTranslator.h:92: error: expected ‘,’ or ‘...’ before ‘&’ token
1304src/TermTranslator.h:94: error: ‘mpz_class’ was not declared in this scope
1305In file included from src/Macaulay2IOHandler.cpp:21:
1306src/BigIdeal.h:39: error: ISO C++ forbids declaration of ‘mpz_class’ with no typesrc/TermTranslator.h:94: error: template argument 1 is invalid
1307
1308src/TermTranslator.h:94: error: template argument 2 is invalid
1309src/BigIdeal.h:39: error: expected ‘;’ before ‘&’ token
1310src/TermTranslator.h:94: error: template argument 1 is invalid
1311src/TermTranslator.h:94: error: template argument 2 is invalid
1312src/BigIdeal.h:40: error: ‘mpz_class’ was not declared in this scope
1313src/BigIdeal.h:40: error: template argument 1 is invalid
1314src/BigIdeal.h:40: error: template argument 2 is invalid
1315src/BigIdeal.h:41: error: ‘mpz_class’ was not declared in this scope
1316src/BigIdeal.h:41: error: template argument 1 is invalid
1317src/BigIdeal.h:41: error: template argument 2 is invalid
1318src/BigIdeal.h:43: error: ‘mpz_class’ was not declared in this scope
1319src/BigIdeal.h:43: error: template argument 1 is invalid
1320src/BigIdeal.h:43: error: template argument 2 is invalid
1321src/BigIdeal.h:45: error: ISO C++ forbids declaration of ‘mpz_class’ with no type
1322src/BigIdeal.h:45: error: expected ‘;’ before ‘&’ token
1323src/BigIdeal.h:46: error: ISO C++ forbids declaration of ‘mpz_class’ with no type
1324src/BigIdeal.h:46: error: expected ‘;’ before ‘&’ token
1325src/BigIdeal.h:47: error: ISO C++ forbids declaration of ‘mpz_class’ with no type
1326src/BigIdeal.h:47: error: expected ‘,’ or ‘...’ before ‘&’ token
1327src/BigIdeal.h:51: error: ‘mpz_class’ was not declared in this scope
1328src/BigIdeal.h:51: error: template argument 1 is invalid
1329src/BigIdeal.h:51: error: template argument 2 is invalid
1330src/BigIdeal.h:87: error: ‘mpz_class’ was not declared in this scope
1331src/BigIdeal.h:87: error: template argument 1 is invalidsrc/BigIdeal.h:52: error: ‘mpz_class’ was not declared in this scope
1332
1333src/BigIdeal.h:52: error: template argument 1 is invalidsrc/BigIdeal.h:87: error: template argument 2 is invalid
1334
1335src/BigIdeal.h:52: error: template argument 2 is invalid
1336src/BigIdeal.h:87: error: template argument 1 is invalid
1337src/BigIdeal.h:87: error: template argument 2 is invalid
1338src/BigIdeal.h:83: error: ‘mpz_class’ was not declared in this scope
1339src/BigIdeal.h:83: error: template argument 1 is invalid
1340src/BigIdeal.h:83: error: template argument 2 is invalid
1341src/BigIdeal.h:84: error: ‘mpz_class’ was not declared in this scope
1342src/BigIdeal.h:84: error: template argument 1 is invalid
1343src/BigIdeal.h:84: error: template argument 2 is invalid
1344In file included from src/fplllIO.cpp:21:
1345src/Scanner.h:40: error: ‘mpz_class’ has not been declared
1346src/Scanner.h:41: error: ‘mpz_class’ has not been declared
1347src/Scanner.h:62: error: ‘mpz_class’ has not been declared
1348src/Scanner.h:70: error: ‘mpz_class’ does not name a type
1349src/IrreducibleDecomAction.cpp: In member function ‘virtual void IrreducibleDecomAction::perform()’:
1350src/IrreducibleDecomAction.cpp:53: error: ‘class IOParameters’ has no member named ‘getInputFormat’
1351src/IrreducibleDecomAction.cpp:53: error: ‘stdin’ was not declared in this scope
1352src/fplllIO.cpp: In function ‘void fplll::readLatticeBasis(Scanner&, BigIdeal&)’:
1353src/fplllIO.cpp:25: error: ‘mpz_class’ was not declared in this scope
1354src/fplllIO.cpp:25: error: template argument 1 is invalid
1355src/fplllIO.cpp:25: error: template argument 2 is invalid
1356src/fplllIO.cpp:25: error: template argument 1 is invalid
1357src/fplllIO.cpp:25: error: template argument 2 is invalid
1358src/fplllIO.cpp:25: error: invalid type in declaration before ‘;’ token
1359src/fplllIO.cpp:30: error: request for member ‘resize’ in ‘tmp’, which is of non-class type ‘int’
1360src/fplllIO.cpp:30: error: request for member ‘size’ in ‘tmp’, which is of non-class type ‘int’
1361src/fplllIO.cpp:32: error: expected ‘;’ before ‘integer’
1362src/fplllIO.cpp:33: error: ‘integer’ was not declared in this scope
1363src/fplllIO.cpp:34: error: request for member ‘back’ in ‘tmp’, which is of non-class type ‘int’
1364src/fplllIO.cpp:37: error: request for member ‘front’ in ‘tmp’, which is of non-class type ‘int’
1365src/fplllIO.cpp:37: error: request for member ‘back’ in ‘tmp’, which is of non-class type ‘int’
1366src/IrreducibleDecomAction.cpp:64: error: ‘class IOParameters’ has no member named ‘getOutputFormat’
1367src/fplllIO.cpp:39: error: ‘stderr’ was not declared in this scope
1368src/IrreducibleDecomAction.cpp:64: error: ‘stdout’ was not declared in this scope
1369src/fplllIO.cpp:41: error: request for member ‘front’ in ‘tmp’, which is of non-class type ‘int’
1370src/fplllIO.cpp:42: error: request for member ‘size’ in ‘tmp’, which is of non-class type ‘int’
1371src/fplllIO.cpp:43: error: request for member ‘back’ in ‘tmp’, which is of non-class type ‘int’
1372src/fplllIO.cpp:43: error: ‘fprintf’ was not declared in this scope
1373src/fplllIO.cpp:48: error: request for member ‘empty’ in ‘tmp’, which is of non-class type ‘int’
1374src/fplllIO.cpp:48: error: request for member ‘front’ in ‘tmp’, which is of non-class type ‘int’
1375src/fplllIO.cpp:51: error: request for member ‘size’ in ‘tmp’, which is of non-class type ‘int’
1376src/fplllIO.cpp:53: error: invalid types ‘int[unsigned int]’ for array subscript
1377src/fplllIO.cpp:54: error: ‘class BigIdeal’ has no member named ‘getLastTermExponentRef’
1378src/fplllIO.cpp:54: error: invalid types ‘int[unsigned int]’ for array subscript
1379src/fplllIO.cpp: In function ‘void fplll::writeLatticeBasis(FILE*, const BigIdeal&)’:
1380src/fplllIO.cpp:59: error: ‘fputs’ was not declared in this scope
1381src/fplllIO.cpp:63: error: request for member ‘size’ in ‘((const BigIdeal*)basis)->BigIdeal::operator[](((size_t)i))’, which is of non-class type ‘const int’
1382src/fplllIO.cpp:64: error: invalid types ‘const int[unsigned int]’ for array subscript
1383src/fplllIO.cpp:64: error: ‘gmp_fprintf’ was not declared in this scope
1384src/BigIdeal.h:87: error: ‘mpz_class’ was not declared in this scope
1385src/BigIdeal.h:87: error: template argument 1 is invalid
1386src/BigIdeal.h:87: error: template argument 2 is invalid
1387src/BigIdeal.h:87: error: template argument 1 is invalid
1388src/BigIdeal.h:87: error: template argument 2 is invalid
1389src/BigIdeal.cpp: In member function ‘bool OffsetTermCompare::operator()(size_t, size_t) const’:
1390src/BigIdeal.cpp:30: error: ‘mpz_class’ was not declared in this scope
1391src/BigIdeal.cpp:30: error: template argument 1 is invalid
1392src/BigIdeal.cpp:30: error: template argument 2 is invalid
1393src/BigIdeal.cpp:30: error: invalid type in declaration before ‘=’ token
1394src/Macaulay2IOHandler.cpp:47: error: ‘mpz_class’ was not declared in this scope
1395src/Macaulay2IOHandler.cpp:47: error: template argument 1 is invalid
1396src/Macaulay2IOHandler.cpp:47: error: template argument 2 is invalid
1397src/BigIdeal.cpp:31: error: ‘mpz_class’ cannot appear in a constant-expression
1398src/BigIdeal.cpp:31: error: template argument 1 is invalid
1399src/BigIdeal.cpp:31: error: template argument 2 is invalid
1400src/BigIdeal.cpp:31: error: invalid type in declaration before ‘=’ token
1401src/BigIdeal.cpp:33: error: request for member ‘size’ in ‘a’, which is of non-class type ‘const int’
1402src/BigIdeal.cpp:33: error: request for member ‘size’ in ‘b’, which is of non-class type ‘const int’
1403src/BigIdeal.cpp:34: error: request for member ‘size’ in ‘a’, which is of non-class type ‘const int’
1404src/BigIdeal.cpp:35: error: invalid types ‘const int[size_t]’ for array subscript
1405src/BigIdeal.cpp:35: error: invalid types ‘const int[size_t]’ for array subscript
1406src/BigIdeal.cpp:37: error: invalid types ‘const int[size_t]’ for array subscript
1407src/BigIdeal.cpp:37: error: invalid types ‘const int[size_t]’ for array subscript
1408make: *** [bin/debug/TransformAction.o] Error 1
1409src/BigIdeal.cpp: In member function ‘void BigIdeal::insert(const Ideal&)’:
1410src/BigIdeal.cpp:55: error: request for member ‘reserve’ in ‘((BigIdeal*)this)->BigIdeal::_terms’, which is of non-class type ‘int’
1411src/BigIdeal.cpp:55: error: request for member ‘size’ in ‘((BigIdeal*)this)->BigIdeal::_terms’, which is of non-class type ‘int’
1412src/Macaulay2IOHandler.cpp: In destructor ‘virtual Macaulay2IdealWriter::~Macaulay2IdealWriter()’:
1413src/Macaulay2IOHandler.cpp:39: error: ‘fputs’ was not declared in this scope
1414src/BigIdeal.cpp:62: error: ‘getLastTermExponentRef’ was not declared in this scope
1415src/BigIdeal.cpp: In member function ‘void BigIdeal::insert(const Ideal&, const TermTranslator&)’:
1416src/BigIdeal.cpp:68: error: request for member ‘reserve’ in ‘((BigIdeal*)this)->BigIdeal::_terms’, which is of non-class type ‘int’
1417src/BigIdeal.cpp:68: error: request for member ‘size’ in ‘((BigIdeal*)this)->BigIdeal::_terms’, which is of non-class type ‘int’
1418src/Macaulay2IOHandler.cpp: In member function ‘void Macaulay2IdealWriter::writeHeader()’:
1419src/Macaulay2IOHandler.cpp:59: error: ‘fputs’ was not declared in this scope
1420In file included from src/IOHandler.cpp:23:
1421src/Term.h: In function ‘void print(FILE*, const Exponent*, size_t)’:
1422src/Term.h:204: error: ‘fputc’ was not declared in this scope
1423src/BigIdeal.cpp:75: error: ‘getLastTermExponentRef’ was not declared in this scope
1424src/BigIdeal.cpp:75: error: ‘const class TermTranslator’ has no member named ‘getExponent’
1425src/Term.h:208: error: ‘fputs’ was not declared in this scope
1426src/Term.h:209: error: ‘fprintf’ was not declared in this scope
1427src/Macaulay2IOHandler.cpp: In member function ‘void Macaulay2IdealWriter::writeSeparator()’:
1428src/Macaulay2IOHandler.cpp:74: error: ‘fputs’ was not declared in this scope
1429src/Macaulay2IOHandler.cpp:77: error: ‘fputs’ was not declared in this scope
1430src/BigIdeal.cpp: In member function ‘void BigIdeal::newLastTerm()’:
1431src/BigIdeal.cpp:84: error: request for member ‘size’ in ‘((BigIdeal*)this)->BigIdeal::_terms’, which is of non-class type ‘int’
1432src/BigIdeal.cpp:84: error: request for member ‘capacity’ in ‘((BigIdeal*)this)->BigIdeal::_terms’, which is of non-class type ‘int’
1433src/BigIdeal.cpp:85: error: request for member ‘size’ in ‘((BigIdeal*)this)->BigIdeal::_terms’, which is of non-class type ‘int’
1434src/BigIdeal.cpp:87: error: request for member ‘resize’ in ‘((BigIdeal*)this)->BigIdeal::_terms’, which is of non-class type ‘int’
1435src/BigIdeal.cpp:87: error: request for member ‘size’ in ‘((BigIdeal*)this)->BigIdeal::_terms’, which is of non-class type ‘int’
1436src/BigIdeal.cpp:88: error: request for member ‘back’ in ‘((BigIdeal*)this)->BigIdeal::_terms’, which is of non-class type ‘int’
1437src/BigIdeal.cpp: In member function ‘void BigIdeal::reserve(size_t)’:
1438src/BigIdeal.cpp:94: error: request for member ‘capacity’ in ‘((BigIdeal*)this)->BigIdeal::_terms’, which is of non-class type ‘int’
1439src/BigIdeal.cpp:108: error: ‘mpz_class’ was not declared in this scope
1440src/BigIdeal.cpp:108: error: template argument 1 is invalid
1441src/BigIdeal.cpp:108: error: template argument 2 is invalid
1442src/BigIdeal.cpp:108: error: template argument 1 is invalid
1443src/BigIdeal.cpp:108: error: template argument 2 is invalid
1444src/BigIdeal.cpp:108: error: invalid type in declaration before ‘;’ token
1445src/BigIdeal.cpp:109: error: request for member ‘size’ in ‘((BigIdeal*)this)->BigIdeal::_terms’, which is of non-class type ‘int’
1446src/BigIdeal.cpp:113: error: request for member ‘reserve’ in ‘tmp’, which is of non-class type ‘int’
1447src/BigIdeal.cpp:114: error: request for member ‘resize’ in ‘tmp’, which is of non-class type ‘int’
1448src/BigIdeal.cpp:114: error: request for member ‘size’ in ‘((BigIdeal*)this)->BigIdeal::_terms’, which is of non-class type ‘int’
1449src/BigIdeal.cpp:116: error: request for member ‘size’ in ‘((BigIdeal*)this)->BigIdeal::_terms’, which is of non-class type ‘int’
1450src/BigIdeal.cpp:118: error: invalid types ‘int[size_t]’ for array subscript
1451src/BigIdeal.cpp:118: error: invalid types ‘int[size_t]’ for array subscript
1452src/BigIdeal.cpp:119: error: request for member ‘swap’ in ‘tmp’, which is of non-class type ‘int’
1453src/BigIdeal.cpp: At global scope:
1454src/BigIdeal.cpp:122: error: expected constructor, destructor, or type conversion before ‘&’ token
1455src/BigIdeal.cpp:129: error: ‘mpz_class’ was not declared in this scope
1456src/BigIdeal.cpp:129: error: template argument 1 is invalid
1457src/BigIdeal.cpp:129: error: template argument 2 is invalid
1458src/BigIdeal.cpp: In member function ‘int& BigIdeal::getLastTermRef()’:
1459src/BigIdeal.cpp:132: error: request for member ‘back’ in ‘((BigIdeal*)this)->BigIdeal::_terms’, which is of non-class type ‘int’
1460src/BigIdeal.cpp: At global scope:
1461src/BigIdeal.cpp:135: error: ‘mpz_class’ was not declared in this scope
1462src/BigIdeal.cpp:135: error: template argument 1 is invalid
1463src/BigIdeal.cpp:135: error: template argument 2 is invalid
1464src/BigIdeal.cpp: In member function ‘const int& BigIdeal::getTerm(size_t) const’:
1465src/BigIdeal.cpp:137: error: invalid types ‘const int[size_t]’ for array subscript
1466src/BigIdeal.cpp: At global scope:
1467src/BigIdeal.cpp:140: error: ‘mpz_class’ was not declared in this scope
1468src/BigIdeal.cpp:140: error: template argument 1 is invalid
1469src/BigIdeal.cpp:140: error: template argument 2 is invalid
1470src/BigIdeal.cpp: In member function ‘void BigIdeal::getLcm(int&) const’:
1471src/BigIdeal.cpp:141: error: request for member ‘clear’ in ‘lcm’, which is of non-class type ‘int’
1472src/BigIdeal.cpp:142: error: request for member ‘resize’ in ‘lcm’, which is of non-class type ‘int’
1473src/BigIdeal.cpp:144: error: ‘mpz_class’ was not declared in this scope
1474src/BigIdeal.cpp:144: error: template argument 1 is invalid
1475src/BigIdeal.cpp:144: error: template argument 2 is invalid
1476src/BigIdeal.cpp:144: error: template argument 1 is invalid
1477src/BigIdeal.cpp:144: error: template argument 2 is invalid
1478src/BigIdeal.cpp:144: error: expected initializer before ‘it’
1479src/BigIdeal.cpp:145: error: ‘it’ was not declared in this scope
1480src/BigIdeal.cpp:145: error: request for member ‘end’ in ‘((const BigIdeal*)this)->BigIdeal::_terms’, which is of non-class type ‘const int’
1481src/BigIdeal.cpp:147: error: invalid types ‘int[size_t]’ for array subscript
1482src/BigIdeal.cpp:148: error: invalid types ‘int[size_t]’ for array subscript
1483In file included from src/randomDataGenerators.cpp:22:
1484src/Term.h: In function ‘void print(FILE*, const Exponent*, size_t)’:
1485src/Term.h:204: error: ‘fputc’ was not declared in this scope
1486src/Term.h:208: error: ‘fputs’ was not declared in this scope
1487src/Term.h:209: error: ‘fprintf’ was not declared in this scope
1488src/BigIdeal.cpp: At global scope:
1489src/BigIdeal.cpp:155: error: ‘mpz_class’ was not declared in this scope
1490src/BigIdeal.cpp:155: error: template argument 1 is invalid
1491src/BigIdeal.cpp:155: error: template argument 2 is invalid
1492src/BigIdeal.cpp: In member function ‘int& BigIdeal::operator[](size_t)’:
1493src/BigIdeal.cpp:156: error: request for member ‘size’ in ‘((BigIdeal*)this)->BigIdeal::_terms’, which is of non-class type ‘int’
1494src/BigIdeal.cpp:157: error: invalid types ‘int[size_t]’ for array subscript
1495src/BigIdeal.cpp: At global scope:
1496src/BigIdeal.cpp:160: error: ‘mpz_class’ was not declared in this scope
1497src/BigIdeal.cpp:160: error: template argument 1 is invalid
1498src/BigIdeal.cpp:160: error: template argument 2 is invalid
1499src/BigIdeal.cpp: In member function ‘const int& BigIdeal::operator[](size_t) const’:
1500src/BigIdeal.cpp:161: error: request for member ‘size’ in ‘((const BigIdeal*)this)->BigIdeal::_terms’, which is of non-class type ‘const int’
1501src/Macaulay2IOHandler.cpp: In member function ‘void Macaulay2IOHandler::readVarsAndClearIdeal(BigIdeal&, Scanner&)’:
1502src/Macaulay2IOHandler.cpp:165: error: ‘stderr’ was not declared in this scopesrc/BigIdeal.cpp:162: error: invalid types ‘const int[size_t]’ for array subscript
1503
1504src/Macaulay2IOHandler.cpp:165: error: ‘fprintf’ was not declared in this scope
1505src/BigIdeal.cpp: In member function ‘bool BigIdeal::empty() const’:
1506src/BigIdeal.cpp:166: error: request for member ‘empty’ in ‘((const BigIdeal*)this)->BigIdeal::_terms’, which is of non-class type ‘const int’
1507src/BigIdeal.cpp: In member function ‘void BigIdeal::clear()’:
1508src/BigIdeal.cpp:170: error: request for member ‘clear’ in ‘((BigIdeal*)this)->BigIdeal::_terms’, which is of non-class type ‘int’
1509src/BigIdeal.cpp: In member function ‘size_t BigIdeal::getGeneratorCount() const’:
1510src/BigIdeal.cpp:174: error: request for member ‘size’ in ‘((const BigIdeal*)this)->BigIdeal::_terms’, which is of non-class type ‘const int’
1511src/BigIdeal.cpp: In member function ‘void BigIdeal::deform()’:
1512src/BigIdeal.cpp:193: error: invalid types ‘int[size_t]’ for array subscript
1513src/BigIdeal.cpp:194: error: invalid types ‘int[size_t]’ for array subscript
1514src/BigIdeal.cpp:194: error: invalid types ‘int[size_t]’ for array subscript
1515src/BigIdeal.cpp: In member function ‘void BigIdeal::takeRadical()’:
1516src/BigIdeal.cpp:198: error: ‘mpz_class’ was not declared in this scope
1517src/BigIdeal.cpp:198: error: template argument 1 is invalid
1518src/BigIdeal.cpp:198: error: template argument 2 is invalid
1519src/BigIdeal.cpp:198: error: template argument 1 is invalid
1520src/BigIdeal.cpp:198: error: template argument 2 is invalid
1521src/BigIdeal.cpp:198: error: expected initializer before ‘end’
1522src/BigIdeal.cpp:199: error: ‘mpz_class’ cannot appear in a constant-expression
1523src/BigIdeal.cpp:199: error: template argument 1 is invalid
1524src/BigIdeal.cpp:199: error: template argument 2 is invalid
1525src/BigIdeal.cpp:199: error: template argument 1 is invalid
1526src/BigIdeal.cpp:199: error: template argument 2 is invalid
1527src/BigIdeal.cpp:199: error: expected initializer before ‘it’
1528src/BigIdeal.cpp:200: error: ‘it’ was not declared in this scope
1529src/BigIdeal.cpp:200: error: ‘end’ was not declared in this scope
1530src/MonosIOHandler.cpp:48: error: ‘mpz_class’ was not declared in this scope
1531src/MonosIOHandler.cpp:48: error: template argument 1 is invalid
1532src/MonosIOHandler.cpp:48: error: template argument 2 is invalid
1533src/BigIdeal.cpp: In member function ‘void BigIdeal::sortGeneratorsUnique()’:
1534src/BigIdeal.cpp:208: error: ‘mpz_class’ was not declared in this scope
1535src/BigIdeal.cpp:208: error: template argument 1 is invalid
1536src/BigIdeal.cpp:208: error: template argument 2 is invalid
1537src/BigIdeal.cpp:208: error: template argument 1 is invalid
1538src/BigIdeal.cpp:208: error: template argument 2 is invalid
1539src/BigIdeal.cpp:208: error: expected initializer before ‘newEnd’
1540src/BigIdeal.cpp:210: error: request for member ‘erase’ in ‘((BigIdeal*)this)->BigIdeal::_terms’, which is of non-class type ‘int’
1541src/BigIdeal.cpp:210: error: ‘newEnd’ was not declared in this scope
1542src/BigIdeal.cpp:210: error: request for member ‘end’ in ‘((BigIdeal*)this)->BigIdeal::_terms’, which is of non-class type ‘int’
1543src/BigIdeal.cpp: In member function ‘void BigIdeal::sortGenerators()’:
1544src/BigIdeal.cpp:214: error: request for member ‘size’ in ‘((BigIdeal*)this)->BigIdeal::_terms’, which is of non-class type ‘int’
1545make: *** [bin/debug/fplllIO.o] Error 1
1546src/BigIdeal.cpp:222: error: ‘mpz_class’ was not declared in this scope
1547src/BigIdeal.cpp:222: error: template argument 1 is invalid
1548src/BigIdeal.cpp:222: error: template argument 2 is invalid
1549src/BigIdeal.cpp:222: error: template argument 1 is invalid
1550src/BigIdeal.cpp:222: error: template argument 2 is invalid
1551src/BigIdeal.cpp:222: error: invalid type in declaration before ‘;’ token
1552src/BigIdeal.cpp:223: error: request for member ‘reserve’ in ‘sorted’, which is of non-class type ‘int’
1553src/BigIdeal.cpp:223: error: request for member ‘capacity’ in ‘((BigIdeal*)this)->BigIdeal::_terms’, which is of non-class type ‘int’
1554src/BigIdeal.cpp:224: error: request for member ‘resize’ in ‘sorted’, which is of non-class type ‘int’
1555src/BigIdeal.cpp:226: error: invalid types ‘int[size_t]’ for array subscript
1556src/BigIdeal.cpp:226: error: invalid types ‘int[long unsigned int]’ for array subscript
1557src/BigIdeal.cpp:228: error: request for member ‘swap’ in ‘((BigIdeal*)this)->BigIdeal::_terms’, which is of non-class type ‘int’
1558src/BigIdeal.cpp: At global scope:
1559src/BigIdeal.cpp:253: error: ‘mpz_class’ was not declared in this scope
1560src/BigIdeal.cpp:253: error: template argument 1 is invalid
1561src/BigIdeal.cpp:253: error: template argument 2 is invalid
1562src/BigIdeal.cpp:263: error: ‘mpz_class’ was not declared in this scope
1563src/BigIdeal.cpp:263: error: template argument 1 is invalid
1564src/BigIdeal.cpp:263: error: template argument 2 is invalid
1565src/BigIdeal.cpp: In member function ‘void VarSorter::permute(int&)’:
1566src/BigIdeal.cpp:254: error: request for member ‘size’ in ‘term’, which is of non-class type ‘int’
1567src/BigIdeal.cpp:254: error: request for member ‘size’ in ‘((VarSorter*)this)->VarSorter::_tmp’, which is of non-class type ‘int’
1568src/BigIdeal.cpp:255: error: request for member ‘swap’ in ‘((VarSorter*)this)->VarSorter::_tmp’, which is of non-class type ‘int’
1569src/BigIdeal.cpp:257: error: invalid types ‘int[size_t]’ for array subscript
1570src/BigIdeal.cpp:257: error: invalid types ‘int[long unsigned int]’ for array subscript
1571src/BigIdeal.cpp:257: error: ‘mpz_swap’ was not declared in this scope
1572src/BigIdeal.cpp: In member function ‘void BigIdeal::sortVariables()’:
1573src/BigIdeal.cpp:269: error: request for member ‘size’ in ‘((BigIdeal*)this)->BigIdeal::_terms’, which is of non-class type ‘int’
1574src/BigIdeal.cpp:270: error: invalid types ‘int[size_t]’ for array subscript
1575src/BigIdeal.cpp: In member function ‘void BigIdeal::print(FILE*) const’:
1576src/BigIdeal.cpp:274: error: ‘stderr’ was not declared in this scope
1577src/BigIdeal.cpp:275: error: request for member ‘size’ in ‘((const BigIdeal*)this)->BigIdeal::_terms’, which is of non-class type ‘const int’
1578src/BigIdeal.cpp:275: error: ‘fprintf’ was not declared in this scope
1579src/BigIdeal.cpp:276: error: ‘mpz_class’ was not declared in this scope
1580src/BigIdeal.cpp:276: error: template argument 1 is invalid
1581src/BigIdeal.cpp:276: error: template argument 2 is invalid
1582src/BigIdeal.cpp:276: error: template argument 1 is invalid
1583src/BigIdeal.cpp:276: error: template argument 2 is invalid
1584src/BigIdeal.cpp:276: error: expected initializer before ‘it’
1585src/BigIdeal.cpp:277: error: ‘it’ was not declared in this scope
1586src/BigIdeal.cpp:277: error: request for member ‘end’ in ‘((const BigIdeal*)this)->BigIdeal::_terms’, which is of non-class type ‘const int’
1587src/BigIdeal.cpp:278: error: ‘mpz_class’ cannot appear in a constant-expression
1588src/BigIdeal.cpp:278: error: template argument 1 is invalid
1589src/BigIdeal.cpp:278: error: template argument 2 is invalid
1590src/BigIdeal.cpp:278: error: expected initializer before ‘entry’
1591src/BigIdeal.cpp:279: error: ‘entry’ was not declared in this scope
1592src/BigIdeal.cpp:280: error: ‘gmp_fprintf’ was not declared in this scope
1593src/BigIdeal.cpp:281: error: ‘fputc’ was not declared in this scope
1594src/BigIdeal.cpp:283: error: ‘fputs’ was not declared in this scope
1595make: src/BigIdeal.cpp: At global scope:
1596src/BigIdeal.cpp:286: error: expected initializer before ‘&’ token
1597*** [bin/debug/IrreducibleDecomAction.o] Error 1
1598src/BigIdeal.cpp:293: error: expected constructor, destructor, or type conversion before ‘&’ token
1599src/BigIdeal.cpp:300: error: ISO C++ forbids declaration of ‘mpz_class’ with no type
1600src/BigIdeal.cpp:300: error: expected ‘,’ or ‘...’ before ‘&’ token
1601src/BigIdeal.cpp: In member function ‘void BigIdeal::setExponent(size_t, size_t, int)’:
1602src/BigIdeal.cpp:301: error: request for member ‘size’ in ‘((BigIdeal*)this)->BigIdeal::_terms’, which is of non-class type ‘int’
1603src/BigIdeal.cpp:304: error: invalid types ‘int[size_t]’ for array subscript
1604src/BigIdeal.cpp:304: error: ‘exp’ was not declared in this scope
1605src/BigIdeal.cpp: At global scope:
1606src/BigIdeal.cpp:307: error: ‘mpz_class’ was not declared in this scope
1607src/BigIdeal.cpp:307: error: template argument 1 is invalid
1608src/BigIdeal.cpp:307: error: template argument 2 is invalid
1609src/BigIdeal.cpp:308: error: ‘mpz_class’ was not declared in this scope
1610src/BigIdeal.cpp:308: error: template argument 1 is invalid
1611src/BigIdeal.cpp:308: error: template argument 2 is invalid
1612src/BigIdeal.cpp: In static member function ‘static bool BigIdeal::bigTermCompare(const int&, const int&)’:
1613src/BigIdeal.cpp:309: error: request for member ‘size’ in ‘a’, which is of non-class type ‘const int’
1614src/BigIdeal.cpp:309: error: request for member ‘size’ in ‘b’, which is of non-class type ‘const int’
1615src/BigIdeal.cpp:310: error: request for member ‘size’ in ‘a’, which is of non-class type ‘const int’
1616src/BigIdeal.cpp:311: error: invalid types ‘const int[size_t]’ for array subscript
1617src/BigIdeal.cpp:311: error: invalid types ‘const int[size_t]’ for array subscript
1618src/BigIdeal.cpp:313: error: invalid types ‘const int[size_t]’ for array subscript
1619src/BigIdeal.cpp:313: error: invalid types ‘const int[size_t]’ for array subscript
1620make: *** [bin/debug/Macaulay2IOHandler.o] Error 1
1621make: *** [bin/debug/MonosIOHandler.o] Error 1
1622In file included from src/IOHandler.cpp:29:
1623src/Fourti2IOHandler.h: At global scope:
1624src/Fourti2IOHandler.h:31: error: ‘mpz_class’ was not declared in this scope
1625src/Fourti2IOHandler.h:31: error: template argument 1 is invalid
1626src/Fourti2IOHandler.h:31: error: template argument 2 is invalid
1627src/IOHandler.cpp:56: error: ‘mpz_class’ was not declared in this scope
1628src/IOHandler.cpp:56: error: template argument 1 is invalid
1629src/IOHandler.cpp:56: error: template argument 2 is invalid
1630src/IOHandler.cpp: In static member function ‘static void IdealWriter::writeTerm(const std::vector<const char*, std::allocator<const char*> >&, FILE*)’:
1631src/IOHandler.cpp:74: error: ‘putc’ was not declared in this scope
1632src/IOHandler.cpp:77: error: ‘fputs’ was not declared in this scope
1633src/IOHandler.cpp:81: error: ‘fputs’ was not declared in this scope
1634src/IOHandler.cpp: In static member function ‘static void IdealWriter::writeTerm(const Term&, const TermTranslator*, FILE*)’:
1635src/IOHandler.cpp:94: error: ‘putc’ was not declared in this scope
1636src/IOHandler.cpp:97: error: ‘fputs’ was not declared in this scope
1637src/IOHandler.cpp:101: error: ‘fputs’ was not declared in this scope
1638src/IOHandler.cpp: At global scope:
1639src/IOHandler.cpp:104: error: ‘mpz_class’ was not declared in this scope
1640src/IOHandler.cpp:104: error: template argument 1 is invalid
1641src/IOHandler.cpp:104: error: template argument 2 is invalid
1642src/IOHandler.cpp: In static member function ‘static void IdealWriter::writeTerm(const int&, const VarNames&, FILE*)’:
1643src/IOHandler.cpp:108: error: request for member ‘size’ in ‘term’, which is of non-class type ‘const int’
1644src/IOHandler.cpp:110: error: invalid types ‘const int[size_t]’ for array subscript
1645src/IOHandler.cpp:113: error: ‘putc’ was not declared in this scope
1646src/IOHandler.cpp:116: error: ‘fputs’ was not declared in this scope
1647src/IOHandler.cpp:117: error: invalid types ‘const int[size_t]’ for array subscript
1648src/IOHandler.cpp:118: error: invalid types ‘const int[size_t]’ for array subscript
1649src/IOHandler.cpp:118: error: ‘gmp_printf’ was not declared in this scope
1650src/IOHandler.cpp:122: error: ‘fputs’ was not declared in this scope
1651src/IOHandler.cpp: At global scope:
1652src/IOHandler.cpp:159: error: ‘mpz_class’ was not declared in this scope
1653src/IOHandler.cpp:159: error: template argument 1 is invalid
1654src/IOHandler.cpp:159: error: template argument 2 is invalid
1655src/IOHandler.cpp: In member function ‘void IOHandler::readVarPower(int&, const VarNames&, Scanner&)’:
1656src/IOHandler.cpp:172: error: invalid types ‘int[size_t]’ for array subscript
1657src/IOHandler.cpp:174: error: ‘stderr’ was not declared in this scope
1658src/IOHandler.cpp:174: error: ‘fputs’ was not declared in this scope
1659src/IOHandler.cpp:179: error: invalid types ‘int[size_t]’ for array subscript
1660src/IOHandler.cpp:180: error: invalid types ‘int[size_t]’ for array subscript
1661src/IOHandler.cpp:183: error: ‘stderr’ was not declared in this scope
1662src/IOHandler.cpp:184: error: invalid types ‘int[size_t]’ for array subscript
1663src/IOHandler.cpp:184: error: ‘gmp_fprintf’ was not declared in this scope
1664src/IOHandler.cpp:188: error: invalid types ‘int[size_t]’ for array subscript
1665src/randomDataGenerators.cpp: In function ‘void generateLinkedListIdeal(BigIdeal&, unsigned int)’:
1666src/randomDataGenerators.cpp:33: error: ‘class BigIdeal’ has no member named ‘getLastTermExponentRef’
1667src/randomDataGenerators.cpp:34: error: ‘class BigIdeal’ has no member named ‘getLastTermExponentRef’
1668src/randomDataGenerators.cpp: In function ‘void generateChessIdeal(BigIdeal&, unsigned int, unsigned int, int*, int*, size_t)’:
1669src/randomDataGenerators.cpp:44: error: ‘mpz_class’ was not declared in this scope
1670src/randomDataGenerators.cpp:47: error: ‘stderr’ was not declared in this scope
1671src/randomDataGenerators.cpp:47: error: ‘fputs’ was not declared in this scope
1672src/IOHandler.cpp: At global scope:
1673src/IOHandler.cpp:215: error: ‘mpz_class’ was not declared in this scope
1674src/IOHandler.cpp:215: error: template argument 1 is invalid
1675src/IOHandler.cpp:215: error: template argument 2 is invalid
1676src/IOHandler.cpp: In function ‘void readFrobeniusInstance(Scanner&, int&)’:
1677src/IOHandler.cpp:216: error: request for member ‘clear’ in ‘numbers’, which is of non-class type ‘int’
1678src/IOHandler.cpp:219: error: ‘mpz_class’ was not declared in this scope
1679src/IOHandler.cpp:219: error: expected ‘;’ before ‘n’
1680src/IOHandler.cpp:221: error: ‘n’ was not declared in this scope
1681src/IOHandler.cpp:225: error: ‘stderr’ was not declared in this scope
1682src/IOHandler.cpp:228: error: ‘gmp_fprintf’ was not declared in this scope
1683src/IOHandler.cpp:232: error: request for member ‘push_back’ in ‘numbers’, which is of non-class type ‘int’
1684src/IOHandler.cpp:235: error: request for member ‘empty’ in ‘numbers’, which is of non-class type ‘int’
1685src/IOHandler.cpp:237: error: ‘stderr’ was not declared in this scope
1686src/IOHandler.cpp:237: error: ‘fputs’ was not declared in this scope
1687src/IOHandler.cpp:241: error: expected ‘;’ before ‘gcd’
1688src/IOHandler.cpp:242: error: request for member ‘size’ in ‘numbers’, which is of non-class type ‘int’
1689src/IOHandler.cpp:243: error: request for member ‘get_mpz_t’ in ‘gcd’, which is of non-class type ‘void(Exponent*, const Exponent*, const Exponent*, size_t)’
1690src/IOHandler.cpp:243: error: request for member ‘get_mpz_t’ in ‘gcd’, which is of non-class type ‘void(Exponent*, const Exponent*, const Exponent*, size_t)’
1691src/IOHandler.cpp:243: error: invalid types ‘int[size_t]’ for array subscript
1692src/IOHandler.cpp:243: error: ‘mpz_gcd’ was not declared in this scope
1693src/IOHandler.cpp:245: error: ISO C++ forbids comparison between pointer and integer
1694src/IOHandler.cpp:246: error: ‘stderr’ was not declared in this scope
1695src/IOHandler.cpp:249: error: request for member ‘get_mpz_t’ in ‘gcd’, which is of non-class type ‘void(Exponent*, const Exponent*, const Exponent*, size_t)’
1696src/IOHandler.cpp:249: error: ‘gmp_fprintf’ was not declared in this scope
1697src/randomDataGenerators.cpp: At global scope:
1698src/randomDataGenerators.cpp:157: error: ‘Degree’ was not declared in this scope
1699src/randomDataGenerators.cpp:157: error: template argument 1 is invalid
1700src/randomDataGenerators.cpp:157: error: template argument 2 is invalid
1701src/randomDataGenerators.cpp: In function ‘void generateRandomFrobeniusInstance(int&)’:
1702src/randomDataGenerators.cpp:161: error: request for member ‘resize’ in ‘degrees’, which is of non-class type ‘int’
1703src/randomDataGenerators.cpp:163: error: ‘Degree’ was not declared in this scope
1704src/randomDataGenerators.cpp:163: error: expected ‘;’ before ‘totalGcd’
1705src/randomDataGenerators.cpp:165: error: expected ‘;’ before ‘number’
1706src/randomDataGenerators.cpp:166: error: ‘totalGcd’ was not declared in this scope
1707src/randomDataGenerators.cpp:167: error: ‘number’ was not declared in this scope
1708src/randomDataGenerators.cpp:171: error: ‘number’ was not declared in this scope
1709src/randomDataGenerators.cpp:171: error: ‘mpz_gcd’ was not declared in this scope
1710src/randomDataGenerators.cpp:173: error: invalid types ‘int[int]’ for array subscript
1711src/randomDataGenerators.cpp:173: error: ‘number’ was not declared in this scope
1712src/randomDataGenerators.cpp:177: error: invalid types ‘int[int]’ for array subscript
1713src/randomDataGenerators.cpp:178: error: ‘totalGcd’ was not declared in this scope
1714src/randomDataGenerators.cpp:180: error: request for member ‘begin’ in ‘degrees’, which is of non-class type ‘int’
1715src/randomDataGenerators.cpp:180: error: request for member ‘end’ in ‘degrees’, which is of non-class type ‘int’
1716make: *** [bin/debug/IOHandler.o] Error 1
1717make: *** [bin/debug/BigIdeal.o] Error 1
1718make: *** [bin/debug/randomDataGenerators.o] Error 1
1719mkdir -p bin/release/
1720cd bin; rm -f frobby; link ../bin/release/frobby frobby; cd ..
1721export frobby=bin/frobby; ./test/runtests
1722decom      ..........................
1723frob       ..............................
1724intersect  ..........
1725assoprimes ............
1726minimize   ..........
1727transform  .....
1728latformat  .....
1729alexdual   ...............
1730radical    .........
1731Now cleaning up tmp files.
1732Making Sage/Python scripts relocatable...
1733Making script relocatable
1734Finished installing frobby-0.7.6.p1.spkg