Ticket #6453: config.log

File config.log, 55.1 KB (added by drkirkby, 10 years ago)

config.log showing no optimisation on the command line. Still 20 tests fail

Line 
1This file contains any messages produced by compilers while
2running configure, to aid debugging if configure makes a mistake.
3
4It was created by MPFR configure 2.4.1, which was
5generated by GNU Autoconf 2.63.  Invocation command line was
6
7  $ ./configure --prefix=/tmp/tmp/sage-4.1.alpha2/local --with-gmp=/tmp/tmp/sage-4.1.alpha2/local CFLAGS=   CXX=g++ CXXFLAGS=   LDFLAGS= GMP_PREFIX=/tmp/tmp/sage-4.1.alpha2/local
8
9## --------- ##
10## Platform. ##
11## --------- ##
12
13hostname = t2
14uname -m = sun4v
15uname -r = 5.10
16uname -s = SunOS
17uname -v = Generic_127111-09
18
19/usr/bin/uname -p = sparc
20/bin/uname -X     = System = SunOS
21Node = t2
22Release = 5.10
23KernelID = Generic_127111-09
24Machine = sun4v
25BusType = <unknown>
26Serial = <unknown>
27Users = <unknown>
28OEM# = 0
29Origin# = 1
30NumCPU = 128
31
32/bin/arch              = sun4
33/usr/bin/arch -k       = sun4v
34/usr/convex/getsysinfo = unknown
35/usr/bin/hostinfo      = unknown
36/bin/machine           = unknown
37/usr/bin/oslevel       = unknown
38/bin/universe          = unknown
39
40PATH: /tmp/tmp/sage-4.1.alpha2
41PATH: /tmp/tmp/sage-4.1.alpha2/local/bin
42PATH: /tmp/tmp/sage-4.1.alpha2
43PATH: /tmp/tmp/sage-4.1.alpha2/local/bin
44PATH: /usr/local/gcc-4.4.0-sun-linker/bin
45PATH: /usr/local/bin2
46PATH: /usr/bin
47PATH: /usr/ccs/bin
48PATH: /usr/local/bin
49PATH: /usr/sfw/bin
50
51
52## ----------- ##
53## Core tests. ##
54## ----------- ##
55
56configure:2162: checking for a BSD-compatible install
57configure:2230: result: ./install-sh -c
58configure:2241: checking whether build environment is sane
59configure:2284: result: yes
60configure:2309: checking for a thread-safe mkdir -p
61configure:2348: result: ./install-sh -c -d
62configure:2361: checking for gawk
63configure:2391: result: no
64configure:2361: checking for mawk
65configure:2391: result: no
66configure:2361: checking for nawk
67configure:2377: found /usr/bin/nawk
68configure:2388: result: nawk
69configure:2399: checking whether make sets $(MAKE)
70configure:2421: result: yes
71configure:2597: checking whether to disable maintainer-specific portions of Makefiles
72configure:2606: result: yes
73configure:2631: checking build system type
74configure:2649: result: sparc-sun-solaris2.10
75configure:2671: checking host system type
76configure:2686: result: sparc-sun-solaris2.10
77configure:2926: checking for gcc
78configure:2953: result: gcc
79configure:3185: checking for C compiler version
80configure:3193: gcc --version >&5
81gcc (GCC) 4.4.0
82Copyright (C) 2009 Free Software Foundation, Inc.
83This is free software; see the source for copying conditions.  There is NO
84warranty; not even for MERCHANTABILITY or FITNESS FOR A PARTICULAR PURPOSE.
85
86configure:3197: $? = 0
87configure:3204: gcc -v >&5
88Using built-in specs.
89Target: sparc-sun-solaris2.10
90Configured with: /home/kirkby/gcc-4.4.0/configure CC=/usr/sfw/bin/gcc --prefix=/usr/local/gcc-4.4.0-sun-linker --without-gnu-as --without-gnu-ld --with-as=/usr/ccs/bin/as --with-ld=/usr/ccs/bin/ld --enable-languages=c,c++,fortran --with-mpfr-lib=/usr/local/lib --with-mpfr-include=/usr/local/include --with-gmp-include=/usr/local/include --with-gmp-lib=/usr/local/lib --with-libiconv-prefix=/usr/lib/iconv
91Thread model: posix
92gcc version 4.4.0 (GCC)
93configure:3208: $? = 0
94configure:3215: gcc -V >&5
95gcc: '-V' option must have argument
96configure:3219: $? = 1
97configure:3242: checking for C compiler default output file name
98configure:3264: gcc     -I/tmp/tmp/sage-4.1.alpha2/local/include  -L/tmp/tmp/sage-4.1.alpha2/local/lib conftest.c  >&5
99configure:3268: $? = 0
100configure:3306: result: a.out
101configure:3325: checking whether the C compiler works
102configure:3335: ./a.out
103configure:3339: $? = 0
104configure:3358: result: yes
105configure:3365: checking whether we are cross compiling
106configure:3367: result: no
107configure:3370: checking for suffix of executables
108configure:3377: gcc -o conftest     -I/tmp/tmp/sage-4.1.alpha2/local/include  -L/tmp/tmp/sage-4.1.alpha2/local/lib conftest.c  >&5
109configure:3381: $? = 0
110configure:3407: result:
111configure:3413: checking for suffix of object files
112configure:3439: gcc -c     -I/tmp/tmp/sage-4.1.alpha2/local/include conftest.c >&5
113configure:3443: $? = 0
114configure:3468: result: o
115configure:3472: checking whether we are using the GNU C compiler
116configure:3501: gcc -c     -I/tmp/tmp/sage-4.1.alpha2/local/include conftest.c >&5
117configure:3508: $? = 0
118configure:3525: result: yes
119configure:3534: checking whether gcc accepts -g
120configure:3564: gcc -c -g  -I/tmp/tmp/sage-4.1.alpha2/local/include conftest.c >&5
121configure:3571: $? = 0
122configure:3672: result: yes
123configure:3689: checking for gcc option to accept ISO C89
124configure:3763: gcc  -c     -I/tmp/tmp/sage-4.1.alpha2/local/include conftest.c >&5
125configure:3770: $? = 0
126configure:3793: result: none needed
127configure:3822: checking for style of include used by make
128configure:3850: result: GNU
129configure:3875: checking dependency style of gcc
130configure:3966: result: gcc3
131configure:3986: checking how to run the C preprocessor
132configure:4026: gcc -E  -I/tmp/tmp/sage-4.1.alpha2/local/include conftest.c
133configure:4033: $? = 0
134configure:4064: gcc -E  -I/tmp/tmp/sage-4.1.alpha2/local/include conftest.c
135conftest.c:8:28: error: ac_nonexistent.h: No such file or directory
136configure:4071: $? = 1
137configure: failed program was:
138| /* confdefs.h.  */
139| #define PACKAGE_NAME "MPFR"
140| #define PACKAGE_TARNAME "mpfr"
141| #define PACKAGE_VERSION "2.4.1"
142| #define PACKAGE_STRING "MPFR 2.4.1"
143| #define PACKAGE_BUGREPORT ""
144| /* end confdefs.h.  */
145| #include <ac_nonexistent.h>
146configure:4104: result: gcc -E
147configure:4133: gcc -E  -I/tmp/tmp/sage-4.1.alpha2/local/include conftest.c
148configure:4140: $? = 0
149configure:4171: gcc -E  -I/tmp/tmp/sage-4.1.alpha2/local/include conftest.c
150conftest.c:8:28: error: ac_nonexistent.h: No such file or directory
151configure:4178: $? = 1
152configure: failed program was:
153| /* confdefs.h.  */
154| #define PACKAGE_NAME "MPFR"
155| #define PACKAGE_TARNAME "mpfr"
156| #define PACKAGE_VERSION "2.4.1"
157| #define PACKAGE_STRING "MPFR 2.4.1"
158| #define PACKAGE_BUGREPORT ""
159| /* end confdefs.h.  */
160| #include <ac_nonexistent.h>
161configure:4217: checking for grep that handles long lines and -e
162configure:4277: result: /usr/sfw/bin/ggrep
163configure:4282: checking for egrep
164configure:4346: result: /usr/sfw/bin/ggrep -E
165configure:4351: checking for a sed that does not truncate output
166configure:4417: result: /usr/bin/sed
167configure:4782: checking for ICC
168configure:4810: gcc -c     -I/tmp/tmp/sage-4.1.alpha2/local/include conftest.c >&5
169conftest.c:10:3: error: #error "ICC Not Found"
170conftest.c:14: error: expected '=', ',', ';', 'asm' or '__attribute__' before 'int'
171configure:4817: $? = 1
172configure: failed program was:
173| /* confdefs.h.  */
174| #define PACKAGE_NAME "MPFR"
175| #define PACKAGE_TARNAME "mpfr"
176| #define PACKAGE_VERSION "2.4.1"
177| #define PACKAGE_STRING "MPFR 2.4.1"
178| #define PACKAGE_BUGREPORT ""
179| /* end confdefs.h.  */
180|
181| #if !defined(__ICC)
182| # error "ICC Not Found"
183| error
184| #endif
185|
186| int
187| main ()
188| {
189|
190|   ;
191|   return 0;
192| }
193configure:4831: result: no
194configure:4845: checking whether gcc and cc understand -c and -o together
195configure:4880: gcc -c conftest.c -o conftest2.o >&5
196configure:4884: $? = 0
197configure:4890: gcc -c conftest.c -o conftest2.o >&5
198configure:4894: $? = 0
199configure:4905: cc -c conftest.c >&5
200configure:4909: $? = 0
201configure:4917: cc -c conftest.c -o conftest2.o >&5
202configure:4921: $? = 0
203configure:4927: cc -c conftest.c -o conftest2.o >&5
204configure:4931: $? = 0
205configure:4949: result: yes
206configure:4975: checking for function prototypes
207configure:4978: result: yes
208configure:4996: checking for ANSI C header files
209configure:5026: gcc -c     -I/tmp/tmp/sage-4.1.alpha2/local/include conftest.c >&5
210configure:5033: $? = 0
211configure:5132: gcc -o conftest     -I/tmp/tmp/sage-4.1.alpha2/local/include  -L/tmp/tmp/sage-4.1.alpha2/local/lib conftest.c  >&5
212configure:5136: $? = 0
213configure:5142: ./conftest
214configure:5146: $? = 0
215configure:5164: result: yes
216configure:5188: checking for sys/types.h
217configure:5209: gcc -c     -I/tmp/tmp/sage-4.1.alpha2/local/include conftest.c >&5
218configure:5216: $? = 0
219configure:5233: result: yes
220configure:5188: checking for sys/stat.h
221configure:5209: gcc -c     -I/tmp/tmp/sage-4.1.alpha2/local/include conftest.c >&5
222configure:5216: $? = 0
223configure:5233: result: yes
224configure:5188: checking for stdlib.h
225configure:5209: gcc -c     -I/tmp/tmp/sage-4.1.alpha2/local/include conftest.c >&5
226configure:5216: $? = 0
227configure:5233: result: yes
228configure:5188: checking for string.h
229configure:5209: gcc -c     -I/tmp/tmp/sage-4.1.alpha2/local/include conftest.c >&5
230configure:5216: $? = 0
231configure:5233: result: yes
232configure:5188: checking for memory.h
233configure:5209: gcc -c     -I/tmp/tmp/sage-4.1.alpha2/local/include conftest.c >&5
234configure:5216: $? = 0
235configure:5233: result: yes
236configure:5188: checking for strings.h
237configure:5209: gcc -c     -I/tmp/tmp/sage-4.1.alpha2/local/include conftest.c >&5
238configure:5216: $? = 0
239configure:5233: result: yes
240configure:5188: checking for inttypes.h
241configure:5209: gcc -c     -I/tmp/tmp/sage-4.1.alpha2/local/include conftest.c >&5
242configure:5216: $? = 0
243configure:5233: result: yes
244configure:5188: checking for stdint.h
245configure:5209: gcc -c     -I/tmp/tmp/sage-4.1.alpha2/local/include conftest.c >&5
246configure:5216: $? = 0
247configure:5233: result: yes
248configure:5188: checking for unistd.h
249configure:5209: gcc -c     -I/tmp/tmp/sage-4.1.alpha2/local/include conftest.c >&5
250configure:5216: $? = 0
251configure:5233: result: yes
252configure:5260: checking for string.h
253configure:5267: result: yes
254configure:5466: checking for an ANSI C-conforming const
255configure:5541: gcc -c     -I/tmp/tmp/sage-4.1.alpha2/local/include conftest.c >&5
256configure:5548: $? = 0
257configure:5563: result: yes
258configure:5573: checking for working volatile
259configure:5602: gcc -c     -I/tmp/tmp/sage-4.1.alpha2/local/include conftest.c >&5
260configure:5609: $? = 0
261configure:5624: result: yes
262configure:5712: checking for main in -lm9x
263configure:5741: gcc -o conftest     -I/tmp/tmp/sage-4.1.alpha2/local/include  -L/tmp/tmp/sage-4.1.alpha2/local/lib conftest.c -lm9x   >&5
264ld: fatal: library -lm9x: not found
265ld: fatal: File processing errors. No output written to conftest
266collect2: ld returned 1 exit status
267configure:5748: $? = 1
268configure: failed program was:
269| /* confdefs.h.  */
270| #define PACKAGE_NAME "MPFR"
271| #define PACKAGE_TARNAME "mpfr"
272| #define PACKAGE_VERSION "2.4.1"
273| #define PACKAGE_STRING "MPFR 2.4.1"
274| #define PACKAGE_BUGREPORT ""
275| #define PROTOTYPES 1
276| #define __PROTOTYPES 1
277| #define STDC_HEADERS 1
278| #define HAVE_SYS_TYPES_H 1
279| #define HAVE_SYS_STAT_H 1
280| #define HAVE_STDLIB_H 1
281| #define HAVE_STRING_H 1
282| #define HAVE_MEMORY_H 1
283| #define HAVE_STRINGS_H 1
284| #define HAVE_INTTYPES_H 1
285| #define HAVE_STDINT_H 1
286| #define HAVE_UNISTD_H 1
287| #define HAVE_STRING_H 1
288| /* end confdefs.h.  */
289|
290|
291| int
292| main ()
293| {
294| return main ();
295|   ;
296|   return 0;
297| }
298configure:5769: result: no
299configure:5775: checking for main in -lm
300configure:5804: gcc -o conftest     -I/tmp/tmp/sage-4.1.alpha2/local/include  -L/tmp/tmp/sage-4.1.alpha2/local/lib conftest.c -lm   >&5
301configure:5811: $? = 0
302configure:5832: result: yes
303configure:6041: checking whether time.h and sys/time.h may both be included
304configure:6071: gcc -c     -I/tmp/tmp/sage-4.1.alpha2/local/include conftest.c >&5
305configure:6078: $? = 0
306configure:6093: result: yes
307configure:6119: checking limits.h usability
308configure:6136: gcc -c     -I/tmp/tmp/sage-4.1.alpha2/local/include conftest.c >&5
309configure:6143: $? = 0
310configure:6157: result: yes
311configure:6161: checking limits.h presence
312configure:6176: gcc -E  -I/tmp/tmp/sage-4.1.alpha2/local/include conftest.c
313configure:6183: $? = 0
314configure:6197: result: yes
315configure:6225: checking for limits.h
316configure:6232: result: yes
317configure:6255: checking float.h usability
318configure:6272: gcc -c     -I/tmp/tmp/sage-4.1.alpha2/local/include conftest.c >&5
319configure:6279: $? = 0
320configure:6293: result: yes
321configure:6297: checking float.h presence
322configure:6312: gcc -E  -I/tmp/tmp/sage-4.1.alpha2/local/include conftest.c
323configure:6319: $? = 0
324configure:6333: result: yes
325configure:6361: checking for float.h
326configure:6368: result: yes
327configure:6382: checking for string.h
328configure:6387: result: yes
329configure:6534: checking locale.h usability
330configure:6551: gcc -c     -I/tmp/tmp/sage-4.1.alpha2/local/include conftest.c >&5
331configure:6558: $? = 0
332configure:6572: result: yes
333configure:6576: checking locale.h presence
334configure:6591: gcc -E  -I/tmp/tmp/sage-4.1.alpha2/local/include conftest.c
335configure:6598: $? = 0
336configure:6612: result: yes
337configure:6640: checking for locale.h
338configure:6649: result: yes
339configure:6681: checking wchar.h usability
340configure:6698: gcc -c     -I/tmp/tmp/sage-4.1.alpha2/local/include conftest.c >&5
341configure:6705: $? = 0
342configure:6719: result: yes
343configure:6723: checking wchar.h presence
344configure:6738: gcc -E  -I/tmp/tmp/sage-4.1.alpha2/local/include conftest.c
345configure:6745: $? = 0
346configure:6759: result: yes
347configure:6787: checking for wchar.h
348configure:6796: result: yes
349configure:6822: checking stdarg.h usability
350configure:6839: gcc -c     -I/tmp/tmp/sage-4.1.alpha2/local/include conftest.c >&5
351configure:6846: $? = 0
352configure:6860: result: yes
353configure:6864: checking stdarg.h presence
354configure:6879: gcc -E  -I/tmp/tmp/sage-4.1.alpha2/local/include conftest.c
355configure:6886: $? = 0
356configure:6900: result: yes
357configure:6928: checking for stdarg.h
358configure:6935: result: yes
359configure:7103: checking sys/time.h usability
360configure:7120: gcc -c     -I/tmp/tmp/sage-4.1.alpha2/local/include conftest.c >&5
361configure:7127: $? = 0
362configure:7141: result: yes
363configure:7145: checking sys/time.h presence
364configure:7160: gcc -E  -I/tmp/tmp/sage-4.1.alpha2/local/include conftest.c
365configure:7167: $? = 0
366configure:7181: result: yes
367configure:7209: checking for sys/time.h
368configure:7218: result: yes
369configure:7103: checking sys/fpu.h usability
370configure:7120: gcc -c     -I/tmp/tmp/sage-4.1.alpha2/local/include conftest.c >&5
371conftest.c:59:21: error: sys/fpu.h: No such file or directory
372configure:7127: $? = 1
373configure: failed program was:
374| /* confdefs.h.  */
375| #define PACKAGE_NAME "MPFR"
376| #define PACKAGE_TARNAME "mpfr"
377| #define PACKAGE_VERSION "2.4.1"
378| #define PACKAGE_STRING "MPFR 2.4.1"
379| #define PACKAGE_BUGREPORT ""
380| #define PROTOTYPES 1
381| #define __PROTOTYPES 1
382| #define STDC_HEADERS 1
383| #define HAVE_SYS_TYPES_H 1
384| #define HAVE_SYS_STAT_H 1
385| #define HAVE_STDLIB_H 1
386| #define HAVE_STRING_H 1
387| #define HAVE_MEMORY_H 1
388| #define HAVE_STRINGS_H 1
389| #define HAVE_INTTYPES_H 1
390| #define HAVE_STDINT_H 1
391| #define HAVE_UNISTD_H 1
392| #define HAVE_STRING_H 1
393| #define TIME_WITH_SYS_TIME 1
394| #define HAVE_LOCALE_H 1
395| #define HAVE_WCHAR_H 1
396| #define HAVE_STDARG 1
397| #define HAVE_SYS_TIME_H 1
398| /* end confdefs.h.  */
399| #include <stdio.h>
400| #ifdef HAVE_SYS_TYPES_H
401| # include <sys/types.h>
402| #endif
403| #ifdef HAVE_SYS_STAT_H
404| # include <sys/stat.h>
405| #endif
406| #ifdef STDC_HEADERS
407| # include <stdlib.h>
408| # include <stddef.h>
409| #else
410| # ifdef HAVE_STDLIB_H
411| #  include <stdlib.h>
412| # endif
413| #endif
414| #ifdef HAVE_STRING_H
415| # if !defined STDC_HEADERS && defined HAVE_MEMORY_H
416| #  include <memory.h>
417| # endif
418| # include <string.h>
419| #endif
420| #ifdef HAVE_STRINGS_H
421| # include <strings.h>
422| #endif
423| #ifdef HAVE_INTTYPES_H
424| # include <inttypes.h>
425| #endif
426| #ifdef HAVE_STDINT_H
427| # include <stdint.h>
428| #endif
429| #ifdef HAVE_UNISTD_H
430| # include <unistd.h>
431| #endif
432| #include <sys/fpu.h>
433configure:7141: result: no
434configure:7145: checking sys/fpu.h presence
435configure:7160: gcc -E  -I/tmp/tmp/sage-4.1.alpha2/local/include conftest.c
436conftest.c:26:21: error: sys/fpu.h: No such file or directory
437configure:7167: $? = 1
438configure: failed program was:
439| /* confdefs.h.  */
440| #define PACKAGE_NAME "MPFR"
441| #define PACKAGE_TARNAME "mpfr"
442| #define PACKAGE_VERSION "2.4.1"
443| #define PACKAGE_STRING "MPFR 2.4.1"
444| #define PACKAGE_BUGREPORT ""
445| #define PROTOTYPES 1
446| #define __PROTOTYPES 1
447| #define STDC_HEADERS 1
448| #define HAVE_SYS_TYPES_H 1
449| #define HAVE_SYS_STAT_H 1
450| #define HAVE_STDLIB_H 1
451| #define HAVE_STRING_H 1
452| #define HAVE_MEMORY_H 1
453| #define HAVE_STRINGS_H 1
454| #define HAVE_INTTYPES_H 1
455| #define HAVE_STDINT_H 1
456| #define HAVE_UNISTD_H 1
457| #define HAVE_STRING_H 1
458| #define TIME_WITH_SYS_TIME 1
459| #define HAVE_LOCALE_H 1
460| #define HAVE_WCHAR_H 1
461| #define HAVE_STDARG 1
462| #define HAVE_SYS_TIME_H 1
463| /* end confdefs.h.  */
464| #include <sys/fpu.h>
465configure:7181: result: no
466configure:7209: checking for sys/fpu.h
467configure:7218: result: no
468configure:7240: checking for stdint.h
469configure:7247: result: yes
470configure:7381: checking for SIZE_MAX
471configure:8115: result: yes
472configure:8126: checking how to copy va_list
473configure:8154: gcc -o conftest     -I/tmp/tmp/sage-4.1.alpha2/local/include  -L/tmp/tmp/sage-4.1.alpha2/local/lib conftest.c  >&5
474configure:8161: $? = 0
475configure:8169: result: va_copy
476configure:8251: checking for memmove
477configure:8307: gcc -o conftest     -I/tmp/tmp/sage-4.1.alpha2/local/include  -L/tmp/tmp/sage-4.1.alpha2/local/lib conftest.c  >&5
478conftest.c:50: warning: conflicting types for built-in function 'memmove'
479configure:8314: $? = 0
480configure:8336: result: yes
481configure:8251: checking for memset
482configure:8307: gcc -o conftest     -I/tmp/tmp/sage-4.1.alpha2/local/include  -L/tmp/tmp/sage-4.1.alpha2/local/lib conftest.c  >&5
483conftest.c:51: warning: conflicting types for built-in function 'memset'
484configure:8314: $? = 0
485configure:8336: result: yes
486configure:8251: checking for setlocale
487configure:8307: gcc -o conftest     -I/tmp/tmp/sage-4.1.alpha2/local/include  -L/tmp/tmp/sage-4.1.alpha2/local/lib conftest.c  >&5
488configure:8314: $? = 0
489configure:8336: result: yes
490configure:8251: checking for strtol
491configure:8307: gcc -o conftest     -I/tmp/tmp/sage-4.1.alpha2/local/include  -L/tmp/tmp/sage-4.1.alpha2/local/lib conftest.c  >&5
492configure:8314: $? = 0
493configure:8336: result: yes
494configure:8251: checking for gettimeofday
495configure:8307: gcc -o conftest     -I/tmp/tmp/sage-4.1.alpha2/local/include  -L/tmp/tmp/sage-4.1.alpha2/local/lib conftest.c  >&5
496configure:8314: $? = 0
497configure:8336: result: yes
498configure:8428: checking for long long int
499configure:8456: gcc -c     -I/tmp/tmp/sage-4.1.alpha2/local/include conftest.c >&5
500configure:8463: $? = 0
501configure:8490: gcc -c     -I/tmp/tmp/sage-4.1.alpha2/local/include conftest.c >&5
502conftest.c: In function 'main':
503conftest.c:68: error: expected expression before ')' token
504configure:8497: $? = 1
505configure: failed program was:
506| /* confdefs.h.  */
507| #define PACKAGE_NAME "MPFR"
508| #define PACKAGE_TARNAME "mpfr"
509| #define PACKAGE_VERSION "2.4.1"
510| #define PACKAGE_STRING "MPFR 2.4.1"
511| #define PACKAGE_BUGREPORT ""
512| #define PROTOTYPES 1
513| #define __PROTOTYPES 1
514| #define STDC_HEADERS 1
515| #define HAVE_SYS_TYPES_H 1
516| #define HAVE_SYS_STAT_H 1
517| #define HAVE_STDLIB_H 1
518| #define HAVE_STRING_H 1
519| #define HAVE_MEMORY_H 1
520| #define HAVE_STRINGS_H 1
521| #define HAVE_INTTYPES_H 1
522| #define HAVE_STDINT_H 1
523| #define HAVE_UNISTD_H 1
524| #define HAVE_STRING_H 1
525| #define TIME_WITH_SYS_TIME 1
526| #define HAVE_LOCALE_H 1
527| #define HAVE_WCHAR_H 1
528| #define HAVE_STDARG 1
529| #define HAVE_SYS_TIME_H 1
530| #define HAVE_STDINT_H 1
531| #define HAVE_MEMMOVE 1
532| #define HAVE_MEMSET 1
533| #define HAVE_SETLOCALE 1
534| #define HAVE_STRTOL 1
535| #define HAVE_GETTIMEOFDAY 1
536| /* end confdefs.h.  */
537| #include <stdio.h>
538| #ifdef HAVE_SYS_TYPES_H
539| # include <sys/types.h>
540| #endif
541| #ifdef HAVE_SYS_STAT_H
542| # include <sys/stat.h>
543| #endif
544| #ifdef STDC_HEADERS
545| # include <stdlib.h>
546| # include <stddef.h>
547| #else
548| # ifdef HAVE_STDLIB_H
549| #  include <stdlib.h>
550| # endif
551| #endif
552| #ifdef HAVE_STRING_H
553| # if !defined STDC_HEADERS && defined HAVE_MEMORY_H
554| #  include <memory.h>
555| # endif
556| # include <string.h>
557| #endif
558| #ifdef HAVE_STRINGS_H
559| # include <strings.h>
560| #endif
561| #ifdef HAVE_INTTYPES_H
562| # include <inttypes.h>
563| #endif
564| #ifdef HAVE_STDINT_H
565| # include <stdint.h>
566| #endif
567| #ifdef HAVE_UNISTD_H
568| # include <unistd.h>
569| #endif
570| int
571| main ()
572| {
573| if (sizeof ((long long int)))
574|         return 0;
575|   ;
576|   return 0;
577| }
578configure:8520: result: yes
579configure:8531: checking for intmax_t
580configure:8559: gcc -c     -I/tmp/tmp/sage-4.1.alpha2/local/include conftest.c >&5
581configure:8566: $? = 0
582configure:8593: gcc -c     -I/tmp/tmp/sage-4.1.alpha2/local/include conftest.c >&5
583conftest.c: In function 'main':
584conftest.c:69: error: expected expression before ')' token
585configure:8600: $? = 1
586configure: failed program was:
587| /* confdefs.h.  */
588| #define PACKAGE_NAME "MPFR"
589| #define PACKAGE_TARNAME "mpfr"
590| #define PACKAGE_VERSION "2.4.1"
591| #define PACKAGE_STRING "MPFR 2.4.1"
592| #define PACKAGE_BUGREPORT ""
593| #define PROTOTYPES 1
594| #define __PROTOTYPES 1
595| #define STDC_HEADERS 1
596| #define HAVE_SYS_TYPES_H 1
597| #define HAVE_SYS_STAT_H 1
598| #define HAVE_STDLIB_H 1
599| #define HAVE_STRING_H 1
600| #define HAVE_MEMORY_H 1
601| #define HAVE_STRINGS_H 1
602| #define HAVE_INTTYPES_H 1
603| #define HAVE_STDINT_H 1
604| #define HAVE_UNISTD_H 1
605| #define HAVE_STRING_H 1
606| #define TIME_WITH_SYS_TIME 1
607| #define HAVE_LOCALE_H 1
608| #define HAVE_WCHAR_H 1
609| #define HAVE_STDARG 1
610| #define HAVE_SYS_TIME_H 1
611| #define HAVE_STDINT_H 1
612| #define HAVE_MEMMOVE 1
613| #define HAVE_MEMSET 1
614| #define HAVE_SETLOCALE 1
615| #define HAVE_STRTOL 1
616| #define HAVE_GETTIMEOFDAY 1
617| #define HAVE_LONG_LONG 1
618| /* end confdefs.h.  */
619| #include <stdio.h>
620| #ifdef HAVE_SYS_TYPES_H
621| # include <sys/types.h>
622| #endif
623| #ifdef HAVE_SYS_STAT_H
624| # include <sys/stat.h>
625| #endif
626| #ifdef STDC_HEADERS
627| # include <stdlib.h>
628| # include <stddef.h>
629| #else
630| # ifdef HAVE_STDLIB_H
631| #  include <stdlib.h>
632| # endif
633| #endif
634| #ifdef HAVE_STRING_H
635| # if !defined STDC_HEADERS && defined HAVE_MEMORY_H
636| #  include <memory.h>
637| # endif
638| # include <string.h>
639| #endif
640| #ifdef HAVE_STRINGS_H
641| # include <strings.h>
642| #endif
643| #ifdef HAVE_INTTYPES_H
644| # include <inttypes.h>
645| #endif
646| #ifdef HAVE_STDINT_H
647| # include <stdint.h>
648| #endif
649| #ifdef HAVE_UNISTD_H
650| # include <unistd.h>
651| #endif
652| int
653| main ()
654| {
655| if (sizeof ((intmax_t)))
656|         return 0;
657|   ;
658|   return 0;
659| }
660configure:8623: result: yes
661configure:8635: checking for union fpc_csr
662configure:8668: gcc -c     -I/tmp/tmp/sage-4.1.alpha2/local/include conftest.c >&5
663conftest.c: In function 'main':
664conftest.c:43: error: invalid application of 'sizeof' to incomplete type 'union fpc_csr'
665configure:8675: $? = 1
666configure: failed program was:
667| /* confdefs.h.  */
668| #define PACKAGE_NAME "MPFR"
669| #define PACKAGE_TARNAME "mpfr"
670| #define PACKAGE_VERSION "2.4.1"
671| #define PACKAGE_STRING "MPFR 2.4.1"
672| #define PACKAGE_BUGREPORT ""
673| #define PROTOTYPES 1
674| #define __PROTOTYPES 1
675| #define STDC_HEADERS 1
676| #define HAVE_SYS_TYPES_H 1
677| #define HAVE_SYS_STAT_H 1
678| #define HAVE_STDLIB_H 1
679| #define HAVE_STRING_H 1
680| #define HAVE_MEMORY_H 1
681| #define HAVE_STRINGS_H 1
682| #define HAVE_INTTYPES_H 1
683| #define HAVE_STDINT_H 1
684| #define HAVE_UNISTD_H 1
685| #define HAVE_STRING_H 1
686| #define TIME_WITH_SYS_TIME 1
687| #define HAVE_LOCALE_H 1
688| #define HAVE_WCHAR_H 1
689| #define HAVE_STDARG 1
690| #define HAVE_SYS_TIME_H 1
691| #define HAVE_STDINT_H 1
692| #define HAVE_MEMMOVE 1
693| #define HAVE_MEMSET 1
694| #define HAVE_SETLOCALE 1
695| #define HAVE_STRTOL 1
696| #define HAVE_GETTIMEOFDAY 1
697| #define HAVE_LONG_LONG 1
698| #define HAVE_INTMAX_T 1
699| /* end confdefs.h.  */
700|
701| #if HAVE_SYS_FPU_H
702| #  include <sys/fpu.h>
703| #endif
704|
705|
706| int
707| main ()
708| {
709| if (sizeof (union fpc_csr))
710|        return 0;
711|   ;
712|   return 0;
713| }
714configure:8737: result: no
715configure:8748: checking for fesetround
716configure:8777: gcc -o conftest     -I/tmp/tmp/sage-4.1.alpha2/local/include  -L/tmp/tmp/sage-4.1.alpha2/local/lib conftest.c   -lm >&5
717configure:8784: $? = 0
718configure:8806: result: yes
719configure:8817: checking for gcc float-conversion bug
720configure:8866: gcc -o conftest     -I/tmp/tmp/sage-4.1.alpha2/local/include  -L/tmp/tmp/sage-4.1.alpha2/local/lib conftest.c   -lm >&5
721configure:8870: $? = 0
722configure:8876: ./conftest
723configure:8880: $? = 0
724configure:8899: result: no
725configure:8906: checking for denormalized numbers
726configure:8937: gcc -o conftest     -I/tmp/tmp/sage-4.1.alpha2/local/include  -L/tmp/tmp/sage-4.1.alpha2/local/lib conftest.c  >&5
727configure:8941: $? = 0
728configure:8947: ./conftest
7291.112537e-308
730configure:8951: $? = 0
731configure:8969: result: yes
732configure:8979: checking if NAN == NAN
733configure:9013: gcc -o conftest     -I/tmp/tmp/sage-4.1.alpha2/local/include  -L/tmp/tmp/sage-4.1.alpha2/local/lib conftest.c  >&5
734configure:9017: $? = 0
735configure:9023: ./conftest
736configure:9027: $? = 1
737configure: program exited with status 1
738configure: failed program was:
739| /* confdefs.h.  */
740| #define PACKAGE_NAME "MPFR"
741| #define PACKAGE_TARNAME "mpfr"
742| #define PACKAGE_VERSION "2.4.1"
743| #define PACKAGE_STRING "MPFR 2.4.1"
744| #define PACKAGE_BUGREPORT ""
745| #define PROTOTYPES 1
746| #define __PROTOTYPES 1
747| #define STDC_HEADERS 1
748| #define HAVE_SYS_TYPES_H 1
749| #define HAVE_SYS_STAT_H 1
750| #define HAVE_STDLIB_H 1
751| #define HAVE_STRING_H 1
752| #define HAVE_MEMORY_H 1
753| #define HAVE_STRINGS_H 1
754| #define HAVE_INTTYPES_H 1
755| #define HAVE_STDINT_H 1
756| #define HAVE_UNISTD_H 1
757| #define HAVE_STRING_H 1
758| #define TIME_WITH_SYS_TIME 1
759| #define HAVE_LOCALE_H 1
760| #define HAVE_WCHAR_H 1
761| #define HAVE_STDARG 1
762| #define HAVE_SYS_TIME_H 1
763| #define HAVE_STDINT_H 1
764| #define HAVE_MEMMOVE 1
765| #define HAVE_MEMSET 1
766| #define HAVE_SETLOCALE 1
767| #define HAVE_STRTOL 1
768| #define HAVE_GETTIMEOFDAY 1
769| #define HAVE_LONG_LONG 1
770| #define HAVE_INTMAX_T 1
771| #define MPFR_HAVE_FESETROUND 1
772| #define HAVE_DENORMS 1
773| /* end confdefs.h.  */
774|
775| #include <stdio.h>
776| #include <math.h>
777| #ifndef NAN
778| # define NAN (0.0/0.0)
779| #endif
780| int main() {
781|   double d;
782|   d = NAN;
783|   return d != d;
784| }
785|
786configure:9045: result: no
787configure:9075: checking if charset has consecutive values
788configure:9115: gcc -o conftest     -I/tmp/tmp/sage-4.1.alpha2/local/include  -L/tmp/tmp/sage-4.1.alpha2/local/lib conftest.c  >&5
789configure:9119: $? = 0
790configure:9125: ./conftest
791configure:9129: $? = 0
792configure:9131: result: yes
793configure:9157: checking for math/round
794configure:9187: gcc -o conftest     -I/tmp/tmp/sage-4.1.alpha2/local/include  -L/tmp/tmp/sage-4.1.alpha2/local/lib conftest.c   -lm >&5
795configure:9194: $? = 0
796configure:9203: result: yes
797configure:9223: checking for math/trunc
798configure:9253: gcc -o conftest     -I/tmp/tmp/sage-4.1.alpha2/local/include  -L/tmp/tmp/sage-4.1.alpha2/local/lib conftest.c   -lm >&5
799configure:9260: $? = 0
800configure:9269: result: yes
801configure:9289: checking for math/floor
802configure:9319: gcc -o conftest     -I/tmp/tmp/sage-4.1.alpha2/local/include  -L/tmp/tmp/sage-4.1.alpha2/local/lib conftest.c   -lm >&5
803configure:9326: $? = 0
804configure:9335: result: yes
805configure:9355: checking for math/ceil
806configure:9385: gcc -o conftest     -I/tmp/tmp/sage-4.1.alpha2/local/include  -L/tmp/tmp/sage-4.1.alpha2/local/lib conftest.c   -lm >&5
807configure:9392: $? = 0
808configure:9401: result: yes
809configure:9421: checking for math/rint
810configure:9451: gcc -o conftest     -I/tmp/tmp/sage-4.1.alpha2/local/include  -L/tmp/tmp/sage-4.1.alpha2/local/lib conftest.c   -lm >&5
811configure:9458: $? = 0
812configure:9467: result: yes
813configure:9492: checking for long double
814configure:9520: gcc -c     -I/tmp/tmp/sage-4.1.alpha2/local/include conftest.c >&5
815configure:9527: $? = 0
816configure:9554: gcc -c     -I/tmp/tmp/sage-4.1.alpha2/local/include conftest.c >&5
817conftest.c: In function 'main':
818conftest.c:77: error: expected expression before ')' token
819configure:9561: $? = 1
820configure: failed program was:
821| /* confdefs.h.  */
822| #define PACKAGE_NAME "MPFR"
823| #define PACKAGE_TARNAME "mpfr"
824| #define PACKAGE_VERSION "2.4.1"
825| #define PACKAGE_STRING "MPFR 2.4.1"
826| #define PACKAGE_BUGREPORT ""
827| #define PROTOTYPES 1
828| #define __PROTOTYPES 1
829| #define STDC_HEADERS 1
830| #define HAVE_SYS_TYPES_H 1
831| #define HAVE_SYS_STAT_H 1
832| #define HAVE_STDLIB_H 1
833| #define HAVE_STRING_H 1
834| #define HAVE_MEMORY_H 1
835| #define HAVE_STRINGS_H 1
836| #define HAVE_INTTYPES_H 1
837| #define HAVE_STDINT_H 1
838| #define HAVE_UNISTD_H 1
839| #define HAVE_STRING_H 1
840| #define TIME_WITH_SYS_TIME 1
841| #define HAVE_LOCALE_H 1
842| #define HAVE_WCHAR_H 1
843| #define HAVE_STDARG 1
844| #define HAVE_SYS_TIME_H 1
845| #define HAVE_STDINT_H 1
846| #define HAVE_MEMMOVE 1
847| #define HAVE_MEMSET 1
848| #define HAVE_SETLOCALE 1
849| #define HAVE_STRTOL 1
850| #define HAVE_GETTIMEOFDAY 1
851| #define HAVE_LONG_LONG 1
852| #define HAVE_INTMAX_T 1
853| #define MPFR_HAVE_FESETROUND 1
854| #define HAVE_DENORMS 1
855| #define HAVE_ROUND 1
856| #define HAVE_TRUNC 1
857| #define HAVE_FLOOR 1
858| #define HAVE_CEIL 1
859| #define HAVE_NEARBYINT 1
860| /* end confdefs.h.  */
861| #include <stdio.h>
862| #ifdef HAVE_SYS_TYPES_H
863| # include <sys/types.h>
864| #endif
865| #ifdef HAVE_SYS_STAT_H
866| # include <sys/stat.h>
867| #endif
868| #ifdef STDC_HEADERS
869| # include <stdlib.h>
870| # include <stddef.h>
871| #else
872| # ifdef HAVE_STDLIB_H
873| #  include <stdlib.h>
874| # endif
875| #endif
876| #ifdef HAVE_STRING_H
877| # if !defined STDC_HEADERS && defined HAVE_MEMORY_H
878| #  include <memory.h>
879| # endif
880| # include <string.h>
881| #endif
882| #ifdef HAVE_STRINGS_H
883| # include <strings.h>
884| #endif
885| #ifdef HAVE_INTTYPES_H
886| # include <inttypes.h>
887| #endif
888| #ifdef HAVE_STDINT_H
889| # include <stdint.h>
890| #endif
891| #ifdef HAVE_UNISTD_H
892| # include <unistd.h>
893| #endif
894| int
895| main ()
896| {
897| if (sizeof ((long double)))
898|         return 0;
899|   ;
900|   return 0;
901| }
902configure:9584: result: yes
903configure:9595: checking format of `long double' floating point
904configure:9622: gcc     -I/tmp/tmp/sage-4.1.alpha2/local/include -c conftest.c >&5 2>&1
905configure:9625: $? = 0
906configure:9784: result: IEEE quad, big endian
907configure:10869: checking for gmp.h
908configure:10887: gcc -c     -I/tmp/tmp/sage-4.1.alpha2/local/include conftest.c >&5
909configure:10894: $? = 0
910configure:10899: result: yes
911configure:11363: checking for a sed that does not truncate output
912configure:11429: result: /usr/bin/sed
913configure:11447: checking for fgrep
914configure:11511: result: /usr/sfw/bin/ggrep -F
915configure:11546: checking for ld used by gcc
916configure:11613: result: ld
917configure:11622: checking if the linker (ld) is GNU ld
918configure:11637: result: no
919configure:11649: checking for BSD- or MS-compatible name lister (nm)
920configure:11698: result: /usr/ccs/bin/nm -p
921configure:11816: checking the name lister (/usr/ccs/bin/nm -p) interface
922configure:11823: gcc -c     -I/tmp/tmp/sage-4.1.alpha2/local/include conftest.c >&5
923configure:11826: /usr/ccs/bin/nm -p "conftest.o"
924configure:11829: output
925
926
927conftest.o:
9280000000000 b
9290000000000 f conftest.c
9300000000000 B some_variable
931configure:11836: result: BSD nm
932configure:11839: checking whether ln -s works
933configure:11843: result: yes
934configure:11851: checking the maximum length of command line arguments
935configure:11971: result: 786240
936configure:11989: checking whether the shell understands some XSI constructs
937configure:11997: result: yes
938configure:12001: checking whether the shell understands "+="
939configure:12007: result: no
940configure:12042: checking for ld option to reload object files
941configure:12049: result: -r
942configure:12076: checking how to recognize dependent libraries
943configure:12266: result: pass_all
944configure:12326: checking for ar
945configure:12353: result: ar
946configure:12431: checking for strip
947configure:12447: found /usr/ccs/bin/strip
948configure:12458: result: strip
949configure:12530: checking for ranlib
950configure:12557: result: ranlib
951configure:12647: checking command to parse /usr/ccs/bin/nm -p output from gcc object
952configure:12765: gcc -c     -I/tmp/tmp/sage-4.1.alpha2/local/include conftest.c >&5
953configure:12768: $? = 0
954configure:12772: /usr/ccs/bin/nm -p conftest.o \| sed -n -e 's/^.*[      ]\([BDRT][BDRT]*\)[     ][      ]*\([_A-Za-z][_A-Za-z0-9]*\)$/\1 \2 \2/p' \> conftest.nm
955configure:12775: $? = 0
956configure:12829: gcc -o conftest     -I/tmp/tmp/sage-4.1.alpha2/local/include  -L/tmp/tmp/sage-4.1.alpha2/local/lib conftest.c conftstm.o >&5
957configure:12832: $? = 0
958configure:12870: result: ok
959configure:13093: gcc -c     -I/tmp/tmp/sage-4.1.alpha2/local/include conftest.c >&5
960configure:13096: $? = 0
961configure:13438: checking for dlfcn.h
962configure:13459: gcc -c     -I/tmp/tmp/sage-4.1.alpha2/local/include conftest.c >&5
963configure:13466: $? = 0
964configure:13483: result: yes
965configure:13610: checking for C++ compiler version
966configure:13618: g++ --version >&5
967g++ (GCC) 4.4.0
968Copyright (C) 2009 Free Software Foundation, Inc.
969This is free software; see the source for copying conditions.  There is NO
970warranty; not even for MERCHANTABILITY or FITNESS FOR A PARTICULAR PURPOSE.
971
972configure:13622: $? = 0
973configure:13629: g++ -v >&5
974Using built-in specs.
975Target: sparc-sun-solaris2.10
976Configured with: /home/kirkby/gcc-4.4.0/configure CC=/usr/sfw/bin/gcc --prefix=/usr/local/gcc-4.4.0-sun-linker --without-gnu-as --without-gnu-ld --with-as=/usr/ccs/bin/as --with-ld=/usr/ccs/bin/ld --enable-languages=c,c++,fortran --with-mpfr-lib=/usr/local/lib --with-mpfr-include=/usr/local/include --with-gmp-include=/usr/local/include --with-gmp-lib=/usr/local/lib --with-libiconv-prefix=/usr/lib/iconv
977Thread model: posix
978gcc version 4.4.0 (GCC)
979configure:13633: $? = 0
980configure:13640: g++ -V >&5
981g++: '-V' option must have argument
982configure:13644: $? = 1
983configure:13647: checking whether we are using the GNU C++ compiler
984configure:13676: g++ -c     -I/tmp/tmp/sage-4.1.alpha2/local/include conftest.cpp >&5
985configure:13683: $? = 0
986configure:13700: result: yes
987configure:13709: checking whether g++ accepts -g
988configure:13739: g++ -c -g  -I/tmp/tmp/sage-4.1.alpha2/local/include conftest.cpp >&5
989configure:13746: $? = 0
990configure:13847: result: yes
991configure:13872: checking dependency style of g++
992configure:13963: result: gcc3
993configure:13986: checking how to run the C++ preprocessor
994configure:14022: g++ -E  -I/tmp/tmp/sage-4.1.alpha2/local/include conftest.cpp
995configure:14029: $? = 0
996configure:14060: g++ -E  -I/tmp/tmp/sage-4.1.alpha2/local/include conftest.cpp
997conftest.cpp:44:28: error: ac_nonexistent.h: No such file or directory
998configure:14067: $? = 1
999configure: failed program was:
1000| /* confdefs.h.  */
1001| #define PACKAGE_NAME "MPFR"
1002| #define PACKAGE_TARNAME "mpfr"
1003| #define PACKAGE_VERSION "2.4.1"
1004| #define PACKAGE_STRING "MPFR 2.4.1"
1005| #define PACKAGE_BUGREPORT ""
1006| #define PROTOTYPES 1
1007| #define __PROTOTYPES 1
1008| #define STDC_HEADERS 1
1009| #define HAVE_SYS_TYPES_H 1
1010| #define HAVE_SYS_STAT_H 1
1011| #define HAVE_STDLIB_H 1
1012| #define HAVE_STRING_H 1
1013| #define HAVE_MEMORY_H 1
1014| #define HAVE_STRINGS_H 1
1015| #define HAVE_INTTYPES_H 1
1016| #define HAVE_STDINT_H 1
1017| #define HAVE_UNISTD_H 1
1018| #define HAVE_STRING_H 1
1019| #define TIME_WITH_SYS_TIME 1
1020| #define HAVE_LOCALE_H 1
1021| #define HAVE_WCHAR_H 1
1022| #define HAVE_STDARG 1
1023| #define HAVE_SYS_TIME_H 1
1024| #define HAVE_STDINT_H 1
1025| #define HAVE_MEMMOVE 1
1026| #define HAVE_MEMSET 1
1027| #define HAVE_SETLOCALE 1
1028| #define HAVE_STRTOL 1
1029| #define HAVE_GETTIMEOFDAY 1
1030| #define HAVE_LONG_LONG 1
1031| #define HAVE_INTMAX_T 1
1032| #define MPFR_HAVE_FESETROUND 1
1033| #define HAVE_DENORMS 1
1034| #define HAVE_ROUND 1
1035| #define HAVE_TRUNC 1
1036| #define HAVE_FLOOR 1
1037| #define HAVE_CEIL 1
1038| #define HAVE_NEARBYINT 1
1039| #define HAVE_LONG_DOUBLE 1
1040| #define HAVE_LDOUBLE_IEEE_QUAD_BIG 1
1041| #define HAVE_DLFCN_H 1
1042| /* end confdefs.h.  */
1043| #include <ac_nonexistent.h>
1044configure:14100: result: g++ -E
1045configure:14129: g++ -E  -I/tmp/tmp/sage-4.1.alpha2/local/include conftest.cpp
1046configure:14136: $? = 0
1047configure:14167: g++ -E  -I/tmp/tmp/sage-4.1.alpha2/local/include conftest.cpp
1048conftest.cpp:44:28: error: ac_nonexistent.h: No such file or directory
1049configure:14174: $? = 1
1050configure: failed program was:
1051| /* confdefs.h.  */
1052| #define PACKAGE_NAME "MPFR"
1053| #define PACKAGE_TARNAME "mpfr"
1054| #define PACKAGE_VERSION "2.4.1"
1055| #define PACKAGE_STRING "MPFR 2.4.1"
1056| #define PACKAGE_BUGREPORT ""
1057| #define PROTOTYPES 1
1058| #define __PROTOTYPES 1
1059| #define STDC_HEADERS 1
1060| #define HAVE_SYS_TYPES_H 1
1061| #define HAVE_SYS_STAT_H 1
1062| #define HAVE_STDLIB_H 1
1063| #define HAVE_STRING_H 1
1064| #define HAVE_MEMORY_H 1
1065| #define HAVE_STRINGS_H 1
1066| #define HAVE_INTTYPES_H 1
1067| #define HAVE_STDINT_H 1
1068| #define HAVE_UNISTD_H 1
1069| #define HAVE_STRING_H 1
1070| #define TIME_WITH_SYS_TIME 1
1071| #define HAVE_LOCALE_H 1
1072| #define HAVE_WCHAR_H 1
1073| #define HAVE_STDARG 1
1074| #define HAVE_SYS_TIME_H 1
1075| #define HAVE_STDINT_H 1
1076| #define HAVE_MEMMOVE 1
1077| #define HAVE_MEMSET 1
1078| #define HAVE_SETLOCALE 1
1079| #define HAVE_STRTOL 1
1080| #define HAVE_GETTIMEOFDAY 1
1081| #define HAVE_LONG_LONG 1
1082| #define HAVE_INTMAX_T 1
1083| #define MPFR_HAVE_FESETROUND 1
1084| #define HAVE_DENORMS 1
1085| #define HAVE_ROUND 1
1086| #define HAVE_TRUNC 1
1087| #define HAVE_FLOOR 1
1088| #define HAVE_CEIL 1
1089| #define HAVE_NEARBYINT 1
1090| #define HAVE_LONG_DOUBLE 1
1091| #define HAVE_LDOUBLE_IEEE_QUAD_BIG 1
1092| #define HAVE_DLFCN_H 1
1093| /* end confdefs.h.  */
1094| #include <ac_nonexistent.h>
1095configure:14270: checking for g77
1096configure:14286: found /usr/local/gcc-4.4.0-sun-linker/bin/g77
1097configure:14297: result: g77
1098configure:14323: checking for Fortran 77 compiler version
1099configure:14331: g77 --version >&5
1100GNU Fortran (GCC) 4.4.0
1101Copyright (C) 2009 Free Software Foundation, Inc.
1102
1103GNU Fortran comes with NO WARRANTY, to the extent permitted by law.
1104You may redistribute copies of GNU Fortran
1105under the terms of the GNU General Public License.
1106For more information about these matters, see the file named COPYING
1107
1108configure:14335: $? = 0
1109configure:14342: g77 -v >&5
1110Using built-in specs.
1111Target: sparc-sun-solaris2.10
1112Configured with: /home/kirkby/gcc-4.4.0/configure CC=/usr/sfw/bin/gcc --prefix=/usr/local/gcc-4.4.0-sun-linker --without-gnu-as --without-gnu-ld --with-as=/usr/ccs/bin/as --with-ld=/usr/ccs/bin/ld --enable-languages=c,c++,fortran --with-mpfr-lib=/usr/local/lib --with-mpfr-include=/usr/local/include --with-gmp-include=/usr/local/include --with-gmp-lib=/usr/local/lib --with-libiconv-prefix=/usr/lib/iconv
1113Thread model: posix
1114gcc version 4.4.0 (GCC)
1115configure:14346: $? = 0
1116configure:14353: g77 -V >&5
1117g77: '-V' option must have argument
1118configure:14357: $? = 1
1119configure:14365: checking whether we are using the GNU Fortran 77 compiler
1120configure:14384: g77 -c  conftest.F >&5
1121configure:14391: $? = 0
1122configure:14408: result: yes
1123configure:14414: checking whether g77 accepts -g
1124configure:14431: g77 -c -g conftest.f >&5
1125configure:14438: $? = 0
1126configure:14454: result: yes
1127configure:14660: checking for objdir
1128configure:14675: result: .libs
1129configure:14971: checking if gcc supports -fno-rtti -fno-exceptions
1130configure:14989: gcc -c     -I/tmp/tmp/sage-4.1.alpha2/local/include -fno-rtti -fno-exceptions conftest.c >&5
1131cc1: warning: command line option "-fno-rtti" is valid for C++/ObjC++ but not for C
1132configure:14993: $? = 0
1133configure:15006: result: no
1134configure:15026: checking for gcc option to produce PIC
1135configure:15277: result: -fPIC -DPIC
1136configure:15289: checking if gcc PIC flag -fPIC -DPIC works
1137configure:15307: gcc -c     -I/tmp/tmp/sage-4.1.alpha2/local/include -fPIC -DPIC -DPIC conftest.c >&5
1138configure:15311: $? = 0
1139configure:15324: result: yes
1140configure:15348: checking if gcc static flag -static works
1141configure:15376: result: no
1142configure:15391: checking if gcc supports -c -o file.o
1143configure:15412: gcc -c     -I/tmp/tmp/sage-4.1.alpha2/local/include -o out/conftest2.o conftest.c >&5
1144configure:15416: $? = 0
1145configure:15438: result: yes
1146configure:15446: checking if gcc supports -c -o file.o
1147configure:15493: result: yes
1148configure:15526: checking whether the gcc linker (ld) supports shared libraries
1149configure:16588: result: yes
1150configure:16625: checking whether -lc should be explicitly linked in
1151configure:16630: gcc -c     -I/tmp/tmp/sage-4.1.alpha2/local/include conftest.c >&5
1152configure:16633: $? = 0
1153configure:16648: gcc -shared -Wl,-z -Wl,text -Wl,-h -Wl,conftest -o conftest conftest.o  -v 2\>\&1 \| /usr/sfw/bin/ggrep  -lc  \>/dev/null 2\>\&1
1154configure:16651: $? = 1
1155configure:16663: result: yes
1156configure:16827: checking dynamic linker characteristics
1157configure:17505: result: solaris2.10 ld.so
1158configure:17607: checking how to hardcode library paths into programs
1159configure:17632: result: immediate
1160configure:18473: checking whether stripping libraries is possible
1161configure:18495: result: no
1162configure:18513: checking if libtool supports shared libraries
1163configure:18515: result: yes
1164configure:18518: checking whether to build shared libraries
1165configure:18539: result: yes
1166configure:18542: checking whether to build static libraries
1167configure:18546: result: yes
1168configure:18696: checking for ld used by g++
1169configure:18763: result: ld
1170configure:18772: checking if the linker (ld) is GNU ld
1171configure:18787: result: no
1172configure:18842: checking whether the g++ linker (ld) supports shared libraries
1173configure:19812: result: yes
1174configure:19840: g++ -c     -I/tmp/tmp/sage-4.1.alpha2/local/include conftest.cpp >&5
1175configure:19843: $? = 0
1176configure:20025: checking for g++ option to produce PIC
1177configure:20326: result: -fPIC -DPIC
1178configure:20335: checking if g++ PIC flag -fPIC -DPIC works
1179configure:20353: g++ -c     -I/tmp/tmp/sage-4.1.alpha2/local/include -fPIC -DPIC -DPIC conftest.cpp >&5
1180configure:20357: $? = 0
1181configure:20370: result: yes
1182configure:20391: checking if g++ static flag -static works
1183configure:20419: result: no
1184configure:20431: checking if g++ supports -c -o file.o
1185configure:20452: g++ -c     -I/tmp/tmp/sage-4.1.alpha2/local/include -o out/conftest2.o conftest.cpp >&5
1186configure:20456: $? = 0
1187configure:20478: result: yes
1188configure:20483: checking if g++ supports -c -o file.o
1189configure:20530: result: yes
1190configure:20560: checking whether the g++ linker (ld) supports shared libraries
1191configure:20586: result: yes
1192configure:20723: checking dynamic linker characteristics
1193configure:21349: result: solaris2.10 ld.so
1194configure:21400: checking how to hardcode library paths into programs
1195configure:21425: result: immediate
1196configure:21566: checking if libtool supports shared libraries
1197configure:21568: result: yes
1198configure:21571: checking whether to build shared libraries
1199configure:21591: result: yes
1200configure:21594: checking whether to build static libraries
1201configure:21598: result: yes
1202configure:21612: checking for g77 option to produce PIC
1203configure:21863: result: -fPIC
1204configure:21872: checking if g77 PIC flag -fPIC works
1205configure:21890: g77 -c -g -O2 -fPIC conftest.f >&5
1206configure:21894: $? = 0
1207configure:21907: result: yes
1208configure:21928: checking if g77 static flag -static works
1209configure:21956: result: no
1210configure:21968: checking if g77 supports -c -o file.o
1211configure:21989: g77 -c -g -O2 -o out/conftest2.o conftest.f >&5
1212configure:21993: $? = 0
1213configure:22015: result: yes
1214configure:22020: checking if g77 supports -c -o file.o
1215configure:22067: result: yes
1216configure:22097: checking whether the g77 linker (ld) supports shared libraries
1217configure:23139: result: yes
1218configure:23276: checking dynamic linker characteristics
1219configure:23892: result: solaris2.10 ld.so
1220configure:23943: checking how to hardcode library paths into programs
1221configure:23968: result: immediate
1222configure:24020: checking whether gcc __attribute__ ((mode (XX))) works
1223configure:24046: gcc -c     -I/tmp/tmp/sage-4.1.alpha2/local/include conftest.c >&5
1224configure:24053: $? = 0
1225configure:24069: result: yes
1226configure:24082: checking for recent GMP
1227configure:24104: gcc -c     -I/tmp/tmp/sage-4.1.alpha2/local/include conftest.c >&5
1228configure:24111: $? = 0
1229configure:24116: result: yes
1230configure:24133: checking for gmp internal files
1231configure:24153: gcc -c     -I/tmp/tmp/sage-4.1.alpha2/local/include conftest.c >&5
1232conftest.c:48:22: error: gmp-impl.h: No such file or directory
1233conftest.c:49:22: error: longlong.h: No such file or directory
1234configure:24160: $? = 1
1235configure: failed program was:
1236| /* confdefs.h.  */
1237| #define PACKAGE_NAME "MPFR"
1238| #define PACKAGE_TARNAME "mpfr"
1239| #define PACKAGE_VERSION "2.4.1"
1240| #define PACKAGE_STRING "MPFR 2.4.1"
1241| #define PACKAGE_BUGREPORT ""
1242| #define PROTOTYPES 1
1243| #define __PROTOTYPES 1
1244| #define STDC_HEADERS 1
1245| #define HAVE_SYS_TYPES_H 1
1246| #define HAVE_SYS_STAT_H 1
1247| #define HAVE_STDLIB_H 1
1248| #define HAVE_STRING_H 1
1249| #define HAVE_MEMORY_H 1
1250| #define HAVE_STRINGS_H 1
1251| #define HAVE_INTTYPES_H 1
1252| #define HAVE_STDINT_H 1
1253| #define HAVE_UNISTD_H 1
1254| #define HAVE_STRING_H 1
1255| #define TIME_WITH_SYS_TIME 1
1256| #define HAVE_LOCALE_H 1
1257| #define HAVE_WCHAR_H 1
1258| #define HAVE_STDARG 1
1259| #define HAVE_SYS_TIME_H 1
1260| #define HAVE_STDINT_H 1
1261| #define HAVE_MEMMOVE 1
1262| #define HAVE_MEMSET 1
1263| #define HAVE_SETLOCALE 1
1264| #define HAVE_STRTOL 1
1265| #define HAVE_GETTIMEOFDAY 1
1266| #define HAVE_LONG_LONG 1
1267| #define HAVE_INTMAX_T 1
1268| #define MPFR_HAVE_FESETROUND 1
1269| #define HAVE_DENORMS 1
1270| #define HAVE_ROUND 1
1271| #define HAVE_TRUNC 1
1272| #define HAVE_FLOOR 1
1273| #define HAVE_CEIL 1
1274| #define HAVE_NEARBYINT 1
1275| #define HAVE_LONG_DOUBLE 1
1276| #define HAVE_LDOUBLE_IEEE_QUAD_BIG 1
1277| #define HAVE_DLFCN_H 1
1278| #define LT_OBJDIR ".libs/"
1279| #define HAVE_ATTRIBUTE_MODE 1
1280| /* end confdefs.h.  */
1281|
1282| #include "gmp.h"
1283| #include "gmp-impl.h"
1284| #include "longlong.h"
1285|
1286configure:24180: result: no
1287configure:24184: checking for working alloca.h
1288configure:24211: gcc -o conftest     -I/tmp/tmp/sage-4.1.alpha2/local/include  -L/tmp/tmp/sage-4.1.alpha2/local/lib conftest.c  >&5
1289configure:24218: $? = 0
1290configure:24238: result: yes
1291configure:24248: checking for alloca
1292configure:24295: gcc -o conftest     -I/tmp/tmp/sage-4.1.alpha2/local/include  -L/tmp/tmp/sage-4.1.alpha2/local/lib conftest.c  >&5
1293configure:24302: $? = 0
1294configure:24322: result: yes
1295configure:24644: checking for __gmpz_init in -lgmp
1296configure:24679: gcc -o conftest     -I/tmp/tmp/sage-4.1.alpha2/local/include  -L/tmp/tmp/sage-4.1.alpha2/local/lib conftest.c -lgmp   >&5
1297configure:24686: $? = 0
1298configure:24707: result: yes
1299configure:24720: checking if gmp.h version and libgmp version are the same
1300configure:24766: gcc -o conftest     -I/tmp/tmp/sage-4.1.alpha2/local/include  -L/tmp/tmp/sage-4.1.alpha2/local/lib conftest.c -lgmp  >&5
1301configure:24770: $? = 0
1302configure:24776: ./conftest
1303configure:24780: $? = 0
1304configure:24782: result: yes
1305configure:24787: checking if gmp_printf supports "%jd"
1306configure:24835: gcc -o conftest     -I/tmp/tmp/sage-4.1.alpha2/local/include  -L/tmp/tmp/sage-4.1.alpha2/local/lib conftest.c -lgmp  >&5
1307configure:24839: $? = 0
1308configure:24845: ./conftest
1309configure:24849: $? = 0
1310configure:24851: result: yes
1311configure:24877: checking if gmp_printf supports "%hhd"
1312configure:24918: gcc -o conftest     -I/tmp/tmp/sage-4.1.alpha2/local/include  -L/tmp/tmp/sage-4.1.alpha2/local/lib conftest.c -lgmp  >&5
1313configure:24922: $? = 0
1314configure:24928: ./conftest
1315configure:24932: $? = 0
1316configure:24934: result: yes
1317configure:24959: checking if gmp_printf supports "%lld"
1318configure:25000: gcc -o conftest     -I/tmp/tmp/sage-4.1.alpha2/local/include  -L/tmp/tmp/sage-4.1.alpha2/local/lib conftest.c -lgmp  >&5
1319configure:25004: $? = 0
1320configure:25010: ./conftest
1321configure:25014: $? = 0
1322configure:25016: result: yes
1323configure:25041: checking if gmp_printf supports "%.0Lf"
1324configure:25082: gcc -o conftest     -I/tmp/tmp/sage-4.1.alpha2/local/include  -L/tmp/tmp/sage-4.1.alpha2/local/lib conftest.c -lgmp  >&5
1325configure:25086: $? = 0
1326configure:25092: ./conftest
1327configure:25096: $? = 0
1328configure:25098: result: yes
1329configure:25123: checking if gmp_printf supports "%td"
1330configure:25169: gcc -o conftest     -I/tmp/tmp/sage-4.1.alpha2/local/include  -L/tmp/tmp/sage-4.1.alpha2/local/lib conftest.c -lgmp  >&5
1331configure:25173: $? = 0
1332configure:25179: ./conftest
1333configure:25183: $? = 0
1334configure:25185: result: yes
1335configure:25433: creating ./config.status
1336
1337## ---------------------- ##
1338## Running config.status. ##
1339## ---------------------- ##
1340
1341This file was extended by MPFR config.status 2.4.1, which was
1342generated by GNU Autoconf 2.63.  Invocation command line was
1343
1344  CONFIG_FILES    =
1345  CONFIG_HEADERS  =
1346  CONFIG_LINKS    =
1347  CONFIG_COMMANDS =
1348  $ ./config.status
1349
1350on t2
1351
1352config.status:1022: creating Makefile
1353config.status:1022: creating tests/Makefile
1354config.status:1022: creating mparam.h
1355config.status:1233: executing depfiles commands
1356config.status:1233: executing libtool commands
1357
1358## ---------------- ##
1359## Cache variables. ##
1360## ---------------- ##
1361
1362ac_cv_build=sparc-sun-solaris2.10
1363ac_cv_c_compiler_gnu=yes
1364ac_cv_c_const=yes
1365ac_cv_c_volatile=yes
1366ac_cv_cxx_compiler_gnu=yes
1367ac_cv_env_CCC_set=
1368ac_cv_env_CCC_value=
1369ac_cv_env_CC_set=set
1370ac_cv_env_CC_value=gcc
1371ac_cv_env_CFLAGS_set=set
1372ac_cv_env_CFLAGS_value='  '
1373ac_cv_env_CPPFLAGS_set=
1374ac_cv_env_CPPFLAGS_value=
1375ac_cv_env_CPP_set=
1376ac_cv_env_CPP_value=
1377ac_cv_env_CXXCPP_set=
1378ac_cv_env_CXXCPP_value=
1379ac_cv_env_CXXFLAGS_set=set
1380ac_cv_env_CXXFLAGS_value='  '
1381ac_cv_env_CXX_set=set
1382ac_cv_env_CXX_value=g++
1383ac_cv_env_F77_set=
1384ac_cv_env_F77_value=
1385ac_cv_env_FFLAGS_set=
1386ac_cv_env_FFLAGS_value=
1387ac_cv_env_LDFLAGS_set=set
1388ac_cv_env_LDFLAGS_value=
1389ac_cv_env_LIBS_set=
1390ac_cv_env_LIBS_value=
1391ac_cv_env_build_alias_set=
1392ac_cv_env_build_alias_value=
1393ac_cv_env_host_alias_set=
1394ac_cv_env_host_alias_value=
1395ac_cv_env_target_alias_set=
1396ac_cv_env_target_alias_value=
1397ac_cv_f77_compiler_gnu=yes
1398ac_cv_func_alloca_works=yes
1399ac_cv_func_gettimeofday=yes
1400ac_cv_func_memmove=yes
1401ac_cv_func_memset=yes
1402ac_cv_func_setlocale=yes
1403ac_cv_func_strtol=yes
1404ac_cv_header_dlfcn_h=yes
1405ac_cv_header_float_h=yes
1406ac_cv_header_inttypes_h=yes
1407ac_cv_header_limits_h=yes
1408ac_cv_header_locale_h=yes
1409ac_cv_header_memory_h=yes
1410ac_cv_header_stdarg_h=yes
1411ac_cv_header_stdc=yes
1412ac_cv_header_stdint_h=yes
1413ac_cv_header_stdlib_h=yes
1414ac_cv_header_string_h=yes
1415ac_cv_header_strings_h=yes
1416ac_cv_header_sys_fpu_h=no
1417ac_cv_header_sys_stat_h=yes
1418ac_cv_header_sys_time_h=yes
1419ac_cv_header_sys_types_h=yes
1420ac_cv_header_time=yes
1421ac_cv_header_unistd_h=yes
1422ac_cv_header_wchar_h=yes
1423ac_cv_host=sparc-sun-solaris2.10
1424ac_cv_lib_gmp___gmpz_init=yes
1425ac_cv_lib_m9x_main=no
1426ac_cv_lib_m_main=yes
1427ac_cv_objext=o
1428ac_cv_path_EGREP='/usr/sfw/bin/ggrep -E'
1429ac_cv_path_FGREP='/usr/sfw/bin/ggrep -F'
1430ac_cv_path_GREP=/usr/sfw/bin/ggrep
1431ac_cv_path_SED=/usr/bin/sed
1432ac_cv_prog_AWK=nawk
1433ac_cv_prog_CPP='gcc -E'
1434ac_cv_prog_CXXCPP='g++ -E'
1435ac_cv_prog_ac_ct_AR=ar
1436ac_cv_prog_ac_ct_CC=gcc
1437ac_cv_prog_ac_ct_F77=g77
1438ac_cv_prog_ac_ct_RANLIB=ranlib
1439ac_cv_prog_ac_ct_STRIP=strip
1440ac_cv_prog_cc_c89=
1441ac_cv_prog_cc_g=yes
1442ac_cv_prog_cc_gcc_c_o=yes
1443ac_cv_prog_cxx_g=yes
1444ac_cv_prog_f77_g=yes
1445ac_cv_prog_make_make_set=yes
1446ac_cv_type_intmax_t=yes
1447ac_cv_type_long_double=yes
1448ac_cv_type_long_long_int=yes
1449ac_cv_type_union_fpc_csr=no
1450ac_cv_working_alloca_h=yes
1451am_cv_CC_dependencies_compiler_type=gcc3
1452am_cv_CXX_dependencies_compiler_type=gcc3
1453gl_cv_size_max=yes
1454gmp_cv_c_attribute_mode=yes
1455lt_cv_deplibs_check_method=pass_all
1456lt_cv_file_magic_cmd='$MAGIC_CMD'
1457lt_cv_file_magic_test_file=
1458lt_cv_ld_reload_flag=-r
1459lt_cv_nm_interface='BSD nm'
1460lt_cv_objdir=.libs
1461lt_cv_path_LD=ld
1462lt_cv_path_LDCXX=ld
1463lt_cv_path_NM='/usr/ccs/bin/nm -p'
1464lt_cv_prog_compiler_c_o=yes
1465lt_cv_prog_compiler_c_o_CXX=yes
1466lt_cv_prog_compiler_c_o_F77=yes
1467lt_cv_prog_compiler_pic_works=yes
1468lt_cv_prog_compiler_pic_works_CXX=yes
1469lt_cv_prog_compiler_pic_works_F77=yes
1470lt_cv_prog_compiler_rtti_exceptions=no
1471lt_cv_prog_compiler_static_works=no
1472lt_cv_prog_compiler_static_works_CXX=no
1473lt_cv_prog_compiler_static_works_F77=no
1474lt_cv_prog_gnu_ld=no
1475lt_cv_prog_gnu_ldcxx=no
1476lt_cv_sys_global_symbol_pipe='sed -n -e '\''s/^.*[       ]\([BDRT][BDRT]*\)[     ][      ]*\([_A-Za-z][_A-Za-z0-9]*\)$/\1 \2 \2/p'\'''
1477lt_cv_sys_global_symbol_to_c_name_address='sed -n -e '\''s/^: \([^ ]*\) $/  {\"\1\", (void *) 0},/p'\'' -e '\''s/^[BDRT]* \([^ ]*\) \([^ ]*\)$/  {"\2", (void *) \&\2},/p'\'''
1478lt_cv_sys_global_symbol_to_c_name_address_lib_prefix='sed -n -e '\''s/^: \([^ ]*\) $/  {\"\1\", (void *) 0},/p'\'' -e '\''s/^[BDRT]* \([^ ]*\) \(lib[^ ]*\)$/  {"\2", (void *) \&\2},/p'\'' -e '\''s/^[BDRT]* \([^ ]*\) \([^ ]*\)$/  {"lib\2", (void *) \&\2},/p'\'''
1479lt_cv_sys_global_symbol_to_cdecl='sed -n -e '\''s/^T .* \(.*\)$/extern int \1();/p'\'' -e '\''s/^[BDRT]* .* \(.*\)$/extern char \1;/p'\'''
1480lt_cv_sys_max_cmd_len=786240
1481mpfr_cv_c_long_double_format='IEEE quad, big endian'
1482mpfr_cv_gcc_floatconv_bug=no
1483mpfr_cv_have_denorms=yes
1484mpfr_cv_have_fesetround=yes
1485mpfr_cv_nanisnan=no
1486
1487## ----------------- ##
1488## Output variables. ##
1489## ----------------- ##
1490
1491ACLOCAL='${SHELL} /tmp/tmp/sage-4.1.alpha2/spkg/build/mpfr-2.4.1p0/src/missing --run aclocal-1.10'
1492ALLOCA=''
1493AMDEPBACKSLASH='\'
1494AMDEP_FALSE='#'
1495AMDEP_TRUE=''
1496AMTAR='${SHELL} /tmp/tmp/sage-4.1.alpha2/spkg/build/mpfr-2.4.1p0/src/missing --run tar'
1497ANSI2KNR=''
1498AR='ar'
1499AS='as'
1500AUTOCONF='${SHELL} /tmp/tmp/sage-4.1.alpha2/spkg/build/mpfr-2.4.1p0/src/missing --run autoconf'
1501AUTOHEADER='${SHELL} /tmp/tmp/sage-4.1.alpha2/spkg/build/mpfr-2.4.1p0/src/missing --run autoheader'
1502AUTOMAKE='${SHELL} /tmp/tmp/sage-4.1.alpha2/spkg/build/mpfr-2.4.1p0/src/missing --run automake-1.10'
1503AWK='nawk'
1504CC='gcc'
1505CCDEPMODE='depmode=gcc3'
1506CFLAGS='  '
1507CPP='gcc -E'
1508CPPFLAGS=' -I/tmp/tmp/sage-4.1.alpha2/local/include'
1509CXX='g++'
1510CXXCPP='g++ -E'
1511CXXDEPMODE='depmode=gcc3'
1512CXXFLAGS='  '
1513CYGPATH_W='echo'
1514DEFS='-DHAVE_INTTYPES_H=1 -DHAVE_STDINT_H=1 -DTIME_WITH_SYS_TIME=1 -DHAVE_LOCALE_H=1 -DHAVE_WCHAR_H=1 -DHAVE_STDARG=1 -DHAVE_SYS_TIME_H=1 -DHAVE_STDINT_H=1 -DHAVE_SETLOCALE=1 -DHAVE_GETTIMEOFDAY=1 -DHAVE_LONG_LONG=1 -DHAVE_INTMAX_T=1 -DMPFR_HAVE_FESETROUND=1 -DHAVE_DENORMS=1 -DHAVE_ROUND=1 -DHAVE_TRUNC=1 -DHAVE_FLOOR=1 -DHAVE_CEIL=1 -DHAVE_NEARBYINT=1 -DHAVE_LDOUBLE_IEEE_QUAD_BIG=1 -DLT_OBJDIR=\".libs/\" -DHAVE_ATTRIBUTE_MODE=1 -DHAVE_ALLOCA_H=1'
1515DEPDIR='.deps'
1516DLLTOOL='dlltool'
1517DSYMUTIL=''
1518DUMPBIN=''
1519ECHO_C=''
1520ECHO_N='-n'
1521ECHO_T=''
1522EGREP='/usr/sfw/bin/ggrep -E'
1523EXEEXT=''
1524F77='g77'
1525FFLAGS='-g -O2'
1526FGREP='/usr/sfw/bin/ggrep -F'
1527GREP='/usr/sfw/bin/ggrep'
1528INSTALL_DATA='${INSTALL} -m 644'
1529INSTALL_PROGRAM='${INSTALL}'
1530INSTALL_SCRIPT='${INSTALL}'
1531INSTALL_STRIP_PROGRAM='$(install_sh) -c -s'
1532LD='ld'
1533LDFLAGS=' -L/tmp/tmp/sage-4.1.alpha2/local/lib'
1534LIBOBJS=''
1535LIBS='-lgmp '
1536LIBTOOL='$(SHELL) $(top_builddir)/libtool'
1537LN_S='ln -s'
1538LTLIBOBJS=''
1539MAINT=''
1540MAINTAINER_MODE_FALSE='#'
1541MAINTAINER_MODE_TRUE=''
1542MAKEINFO='${SHELL} /tmp/tmp/sage-4.1.alpha2/spkg/build/mpfr-2.4.1p0/src/missing --run makeinfo'
1543MKDIR_P='./install-sh -c -d'
1544MPFR_LIBM=' -lm'
1545NM='/usr/ccs/bin/nm -p'
1546NMEDIT=''
1547OBJDUMP='objdump'
1548OBJEXT='o'
1549PACKAGE='mpfr'
1550PACKAGE_BUGREPORT=''
1551PACKAGE_NAME='MPFR'
1552PACKAGE_STRING='MPFR 2.4.1'
1553PACKAGE_TARNAME='mpfr'
1554PACKAGE_VERSION='2.4.1'
1555PATH_SEPARATOR=':'
1556RANLIB='ranlib'
1557SED='/usr/bin/sed'
1558SET_MAKE=''
1559SHELL='/bin/bash'
1560STRIP='strip'
1561U=''
1562VERSION='2.4.1'
1563ac_ct_CC='gcc'
1564ac_ct_CXX=''
1565ac_ct_DUMPBIN=''
1566ac_ct_F77='g77'
1567am__fastdepCC_FALSE='#'
1568am__fastdepCC_TRUE=''
1569am__fastdepCXX_FALSE='#'
1570am__fastdepCXX_TRUE=''
1571am__include='include'
1572am__isrc=''
1573am__leading_dot='.'
1574am__quote=''
1575am__tar='${AMTAR} chof - "$$tardir"'
1576am__untar='${AMTAR} xf -'
1577bindir='${exec_prefix}/bin'
1578build='sparc-sun-solaris2.10'
1579build_alias=''
1580build_cpu='sparc'
1581build_os='solaris2.10'
1582build_vendor='sun'
1583datadir='${datarootdir}'
1584datarootdir='${prefix}/share'
1585docdir='${datarootdir}/doc/${PACKAGE_TARNAME}'
1586dvidir='${docdir}'
1587exec_prefix='${prefix}'
1588host='sparc-sun-solaris2.10'
1589host_alias=''
1590host_cpu='sparc'
1591host_os='solaris2.10'
1592host_vendor='sun'
1593htmldir='${docdir}'
1594includedir='${prefix}/include'
1595infodir='${datarootdir}/info'
1596install_sh='$(SHELL) /tmp/tmp/sage-4.1.alpha2/spkg/build/mpfr-2.4.1p0/src/install-sh'
1597libdir='${exec_prefix}/lib'
1598libexecdir='${exec_prefix}/libexec'
1599localedir='${datarootdir}/locale'
1600localstatedir='${prefix}/var'
1601lt_ECHO='echo'
1602mandir='${datarootdir}/man'
1603mkdir_p='$(top_builddir)/./install-sh -c -d'
1604oldincludedir='/usr/include'
1605pdfdir='${docdir}'
1606prefix='/tmp/tmp/sage-4.1.alpha2/local'
1607program_transform_name='s,x,x,'
1608psdir='${docdir}'
1609sbindir='${exec_prefix}/sbin'
1610sharedstatedir='${prefix}/com'
1611sysconfdir='${prefix}/etc'
1612target_alias=''
1613
1614## ----------- ##
1615## confdefs.h. ##
1616## ----------- ##
1617
1618#define HAVE_INTTYPES_H 1
1619#define HAVE_STDINT_H 1
1620#define TIME_WITH_SYS_TIME 1
1621#define HAVE_LOCALE_H 1
1622#define HAVE_WCHAR_H 1
1623#define HAVE_STDARG 1
1624#define HAVE_SYS_TIME_H 1
1625#define HAVE_STDINT_H 1
1626#define HAVE_SETLOCALE 1
1627#define HAVE_GETTIMEOFDAY 1
1628#define HAVE_LONG_LONG 1
1629#define HAVE_INTMAX_T 1
1630#define MPFR_HAVE_FESETROUND 1
1631#define HAVE_DENORMS 1
1632#define HAVE_ROUND 1
1633#define HAVE_TRUNC 1
1634#define HAVE_FLOOR 1
1635#define HAVE_CEIL 1
1636#define HAVE_NEARBYINT 1
1637#define HAVE_LDOUBLE_IEEE_QUAD_BIG 1
1638#define LT_OBJDIR ".libs/"
1639#define HAVE_ATTRIBUTE_MODE 1
1640#define HAVE_ALLOCA_H 1
1641
1642configure: exit 0