Ticket #6352: permgroup.log

File permgroup.log, 32.2 KB (added by awebb, 12 years ago)
Line 
1sage -t -long --optional "devel/sage/sage/groups/perm_gps/permgroup.py"
2**********************************************************************
3File "/home/adamwebb/local/sage/devel/sage/sage/groups/perm_gps/permgroup.py", line 976:
4    sage: G.group_id()    # optional - database_gap
5Exception raised:
6    Traceback (most recent call last):
7      File "/home/adamwebb/local/sage/local/bin/ncadoctest.py", line 1231, in run_one_test
8        self.run_one_example(test, example, filename, compileflags)
9      File "/home/adamwebb/local/sage/local/bin/sagedoctest.py", line 38, in run_one_example
10        OrigDocTestRunner.run_one_example(self, test, example, filename, compileflags)
11      File "/home/adamwebb/local/sage/local/bin/ncadoctest.py", line 1172, in run_one_example
12        compileflags, 1) in test.globs
13      File "<doctest __main__.example_31[3]>", line 1, in <module>
14        G.group_id()    # optional - database_gap###line 976:
15    sage: G.group_id()    # optional - database_gap
16      File "/home/adamwebb/local/sage/local/lib/python/site-packages/sage/groups/perm_gps/permgroup.py", line 979, in group_id
17        return [Integer(n) for n in eval(str(self._gap_().IdGroup()))]
18      File "/home/adamwebb/local/sage/local/lib/python/site-packages/sage/interfaces/expect.py", line 1382, in __call__
19        return self._obj.parent().function_call(self._name, [self._obj] + list(args), kwds)
20      File "/home/adamwebb/local/sage/local/lib/python/site-packages/sage/interfaces/gap.py", line 885, in function_call
21        ['%s=%s'%(key,value.name()) for key, value in kwds.items()])))
22      File "/home/adamwebb/local/sage/local/lib/python/site-packages/sage/interfaces/gap.py", line 480, in eval
23        result = Expect.eval(self, input_line, **kwds)
24      File "/home/adamwebb/local/sage/local/lib/python/site-packages/sage/interfaces/expect.py", line 972, in eval
25        return '\n'.join([self._eval_line(L, **kwds) for L in code.split('\n') if L != ''])
26      File "/home/adamwebb/local/sage/local/lib/python/site-packages/sage/interfaces/gap.py", line 722, in _eval_line
27        raise RuntimeError, message
28    RuntimeError: Gap produced error output
29    Error, the Small Groups identification is required but not installed
30
31       executing IdGroup($sage18);
32**********************************************************************
33File "/home/adamwebb/local/sage/devel/sage/sage/groups/perm_gps/permgroup.py", line 990:
34    sage: G.group_id()    # optional - database_gap
35Exception raised:
36    Traceback (most recent call last):
37      File "/home/adamwebb/local/sage/local/bin/ncadoctest.py", line 1231, in run_one_test
38        self.run_one_example(test, example, filename, compileflags)
39      File "/home/adamwebb/local/sage/local/bin/sagedoctest.py", line 38, in run_one_example
40        OrigDocTestRunner.run_one_example(self, test, example, filename, compileflags)
41      File "/home/adamwebb/local/sage/local/bin/ncadoctest.py", line 1172, in run_one_example
42        compileflags, 1) in test.globs
43      File "<doctest __main__.example_32[3]>", line 1, in <module>
44        G.group_id()    # optional - database_gap###line 990:
45    sage: G.group_id()    # optional - database_gap
46      File "/home/adamwebb/local/sage/local/lib/python/site-packages/sage/groups/perm_gps/permgroup.py", line 979, in group_id
47        return [Integer(n) for n in eval(str(self._gap_().IdGroup()))]
48      File "/home/adamwebb/local/sage/local/lib/python/site-packages/sage/interfaces/expect.py", line 1382, in __call__
49        return self._obj.parent().function_call(self._name, [self._obj] + list(args), kwds)
50      File "/home/adamwebb/local/sage/local/lib/python/site-packages/sage/interfaces/gap.py", line 885, in function_call
51        ['%s=%s'%(key,value.name()) for key, value in kwds.items()])))
52      File "/home/adamwebb/local/sage/local/lib/python/site-packages/sage/interfaces/gap.py", line 480, in eval
53        result = Expect.eval(self, input_line, **kwds)
54      File "/home/adamwebb/local/sage/local/lib/python/site-packages/sage/interfaces/expect.py", line 972, in eval
55        return '\n'.join([self._eval_line(L, **kwds) for L in code.split('\n') if L != ''])
56      File "/home/adamwebb/local/sage/local/lib/python/site-packages/sage/interfaces/gap.py", line 722, in _eval_line
57        raise RuntimeError, message
58    RuntimeError: Gap produced error output
59    Error, the Small Groups identification is required but not installed
60
61       executing IdGroup($sage6);
62**********************************************************************
63File "/home/adamwebb/local/sage/devel/sage/sage/groups/perm_gps/permgroup.py", line 1144:
64    sage: G.cohomology(1,2)                            # optional - gap_packages
65Exception raised:
66    Traceback (most recent call last):
67      File "/home/adamwebb/local/sage/local/bin/ncadoctest.py", line 1231, in run_one_test
68        self.run_one_example(test, example, filename, compileflags)
69      File "/home/adamwebb/local/sage/local/bin/sagedoctest.py", line 38, in run_one_example
70        OrigDocTestRunner.run_one_example(self, test, example, filename, compileflags)
71      File "/home/adamwebb/local/sage/local/bin/ncadoctest.py", line 1172, in run_one_example
72        compileflags, 1) in test.globs
73      File "<doctest __main__.example_37[3]>", line 1, in <module>
74        G.cohomology(Integer(1),Integer(2))                            # optional - gap_packages###line 1144:
75    sage: G.cohomology(1,2)                            # optional - gap_packages
76      File "/home/adamwebb/local/sage/local/lib/python/site-packages/sage/groups/perm_gps/permgroup.py", line 1183, in cohomology
77        L = eval(gap.eval("GroupCohomology(%s,%s,%s)"%(GG,n,p)))
78      File "/home/adamwebb/local/sage/local/lib/python/site-packages/sage/interfaces/gap.py", line 480, in eval
79        result = Expect.eval(self, input_line, **kwds)
80      File "/home/adamwebb/local/sage/local/lib/python/site-packages/sage/interfaces/expect.py", line 972, in eval
81        return '\n'.join([self._eval_line(L, **kwds) for L in code.split('\n') if L != ''])
82      File "/home/adamwebb/local/sage/local/lib/python/site-packages/sage/interfaces/gap.py", line 722, in _eval_line
83        raise RuntimeError, message
84    RuntimeError: Gap produced error output
85    Variable: 'GroupCohomology' must have a value
86
87
88       executing GroupCohomology(SymmetricGroup(4),1,2);
89**********************************************************************
90File "/home/adamwebb/local/sage/devel/sage/sage/groups/perm_gps/permgroup.py", line 1147:
91    sage: G.cohomology(5)                              # optional - gap_packages
92Exception raised:
93    Traceback (most recent call last):
94      File "/home/adamwebb/local/sage/local/bin/ncadoctest.py", line 1231, in run_one_test
95        self.run_one_example(test, example, filename, compileflags)
96      File "/home/adamwebb/local/sage/local/bin/sagedoctest.py", line 38, in run_one_example
97        OrigDocTestRunner.run_one_example(self, test, example, filename, compileflags)
98      File "/home/adamwebb/local/sage/local/bin/ncadoctest.py", line 1172, in run_one_example
99        compileflags, 1) in test.globs
100      File "<doctest __main__.example_37[5]>", line 1, in <module>
101        G.cohomology(Integer(5))                              # optional - gap_packages###line 1147:
102    sage: G.cohomology(5)                              # optional - gap_packages
103      File "/home/adamwebb/local/sage/local/lib/python/site-packages/sage/groups/perm_gps/permgroup.py", line 1181, in cohomology
104        L = eval(gap.eval("GroupCohomology(%s,%s)"%(GG,n)))
105      File "/home/adamwebb/local/sage/local/lib/python/site-packages/sage/interfaces/gap.py", line 480, in eval
106        result = Expect.eval(self, input_line, **kwds)
107      File "/home/adamwebb/local/sage/local/lib/python/site-packages/sage/interfaces/expect.py", line 972, in eval
108        return '\n'.join([self._eval_line(L, **kwds) for L in code.split('\n') if L != ''])
109      File "/home/adamwebb/local/sage/local/lib/python/site-packages/sage/interfaces/gap.py", line 722, in _eval_line
110        raise RuntimeError, message
111    RuntimeError: Gap produced error output
112    Variable: 'GroupCohomology' must have a value
113
114
115       executing GroupCohomology(SymmetricGroup(3),5);
116**********************************************************************
117File "/home/adamwebb/local/sage/devel/sage/sage/groups/perm_gps/permgroup.py", line 1149:
118    sage: G.cohomology(5,2)                            # optional - gap_packages
119Exception raised:
120    Traceback (most recent call last):
121      File "/home/adamwebb/local/sage/local/bin/ncadoctest.py", line 1231, in run_one_test
122        self.run_one_example(test, example, filename, compileflags)
123      File "/home/adamwebb/local/sage/local/bin/sagedoctest.py", line 38, in run_one_example
124        OrigDocTestRunner.run_one_example(self, test, example, filename, compileflags)
125      File "/home/adamwebb/local/sage/local/bin/ncadoctest.py", line 1172, in run_one_example
126        compileflags, 1) in test.globs
127      File "<doctest __main__.example_37[6]>", line 1, in <module>
128        G.cohomology(Integer(5),Integer(2))                            # optional - gap_packages###line 1149:
129    sage: G.cohomology(5,2)                            # optional - gap_packages
130      File "/home/adamwebb/local/sage/local/lib/python/site-packages/sage/groups/perm_gps/permgroup.py", line 1183, in cohomology
131        L = eval(gap.eval("GroupCohomology(%s,%s,%s)"%(GG,n,p)))
132      File "/home/adamwebb/local/sage/local/lib/python/site-packages/sage/interfaces/gap.py", line 480, in eval
133        result = Expect.eval(self, input_line, **kwds)
134      File "/home/adamwebb/local/sage/local/lib/python/site-packages/sage/interfaces/expect.py", line 972, in eval
135        return '\n'.join([self._eval_line(L, **kwds) for L in code.split('\n') if L != ''])
136      File "/home/adamwebb/local/sage/local/lib/python/site-packages/sage/interfaces/gap.py", line 722, in _eval_line
137        raise RuntimeError, message
138    RuntimeError: Gap produced error output
139    Variable: 'GroupCohomology' must have a value
140
141
142       executing GroupCohomology(SymmetricGroup(3),5,2);
143**********************************************************************
144File "/home/adamwebb/local/sage/devel/sage/sage/groups/perm_gps/permgroup.py", line 1151:
145    sage: G.homology(5,3)                              # optional - gap_packages
146Exception raised:
147    Traceback (most recent call last):
148      File "/home/adamwebb/local/sage/local/bin/ncadoctest.py", line 1231, in run_one_test
149        self.run_one_example(test, example, filename, compileflags)
150      File "/home/adamwebb/local/sage/local/bin/sagedoctest.py", line 38, in run_one_example
151        OrigDocTestRunner.run_one_example(self, test, example, filename, compileflags)
152      File "/home/adamwebb/local/sage/local/bin/ncadoctest.py", line 1172, in run_one_example
153        compileflags, 1) in test.globs
154      File "<doctest __main__.example_37[7]>", line 1, in <module>
155        G.homology(Integer(5),Integer(3))                              # optional - gap_packages###line 1151:
156    sage: G.homology(5,3)                              # optional - gap_packages
157      File "/home/adamwebb/local/sage/local/lib/python/site-packages/sage/groups/perm_gps/permgroup.py", line 1274, in homology
158        L = eval(gap.eval("GroupHomology(%s,%s,%s)"%(GG,n,p)))
159      File "/home/adamwebb/local/sage/local/lib/python/site-packages/sage/interfaces/gap.py", line 480, in eval
160        result = Expect.eval(self, input_line, **kwds)
161      File "/home/adamwebb/local/sage/local/lib/python/site-packages/sage/interfaces/expect.py", line 972, in eval
162        return '\n'.join([self._eval_line(L, **kwds) for L in code.split('\n') if L != ''])
163      File "/home/adamwebb/local/sage/local/lib/python/site-packages/sage/interfaces/gap.py", line 722, in _eval_line
164        raise RuntimeError, message
165    RuntimeError: Gap produced error output
166    Variable: 'GroupHomology' must have a value
167
168
169       executing GroupHomology(SymmetricGroup(3),5,3);
170**********************************************************************
171File "/home/adamwebb/local/sage/devel/sage/sage/groups/perm_gps/permgroup.py", line 1199:
172    sage: G.cohomology_part(7,2)                   # optional - gap_packages
173Exception raised:
174    Traceback (most recent call last):
175      File "/home/adamwebb/local/sage/local/bin/ncadoctest.py", line 1231, in run_one_test
176        self.run_one_example(test, example, filename, compileflags)
177      File "/home/adamwebb/local/sage/local/bin/sagedoctest.py", line 38, in run_one_example
178        OrigDocTestRunner.run_one_example(self, test, example, filename, compileflags)
179      File "/home/adamwebb/local/sage/local/bin/ncadoctest.py", line 1172, in run_one_example
180        compileflags, 1) in test.globs
181      File "<doctest __main__.example_38[3]>", line 1, in <module>
182        G.cohomology_part(Integer(7),Integer(2))                   # optional - gap_packages###line 1199:
183    sage: G.cohomology_part(7,2)                   # optional - gap_packages
184      File "/home/adamwebb/local/sage/local/lib/python/site-packages/sage/groups/perm_gps/permgroup.py", line 1219, in cohomology_part
185        gap.eval("R:=ResolutionFiniteGroup(S,%s)"%(n+1))
186      File "/home/adamwebb/local/sage/local/lib/python/site-packages/sage/interfaces/gap.py", line 480, in eval
187        result = Expect.eval(self, input_line, **kwds)
188      File "/home/adamwebb/local/sage/local/lib/python/site-packages/sage/interfaces/expect.py", line 972, in eval
189        return '\n'.join([self._eval_line(L, **kwds) for L in code.split('\n') if L != ''])
190      File "/home/adamwebb/local/sage/local/lib/python/site-packages/sage/interfaces/gap.py", line 722, in _eval_line
191        raise RuntimeError, message
192    RuntimeError: Gap produced error output
193    Variable: 'ResolutionFiniteGroup' must have a value
194
195
196       executing R:=ResolutionFiniteGroup(S,8);
197**********************************************************************
198File "/home/adamwebb/local/sage/devel/sage/sage/groups/perm_gps/permgroup.py", line 1202:
199    sage: G.cohomology_part(2,3)                   # optional - gap_packages
200Exception raised:
201    Traceback (most recent call last):
202      File "/home/adamwebb/local/sage/local/bin/ncadoctest.py", line 1231, in run_one_test
203        self.run_one_example(test, example, filename, compileflags)
204      File "/home/adamwebb/local/sage/local/bin/sagedoctest.py", line 38, in run_one_example
205        OrigDocTestRunner.run_one_example(self, test, example, filename, compileflags)
206      File "/home/adamwebb/local/sage/local/bin/ncadoctest.py", line 1172, in run_one_example
207        compileflags, 1) in test.globs
208      File "<doctest __main__.example_38[5]>", line 1, in <module>
209        G.cohomology_part(Integer(2),Integer(3))                   # optional - gap_packages###line 1202:
210    sage: G.cohomology_part(2,3)                   # optional - gap_packages
211      File "/home/adamwebb/local/sage/local/lib/python/site-packages/sage/groups/perm_gps/permgroup.py", line 1219, in cohomology_part
212        gap.eval("R:=ResolutionFiniteGroup(S,%s)"%(n+1))
213      File "/home/adamwebb/local/sage/local/lib/python/site-packages/sage/interfaces/gap.py", line 480, in eval
214        result = Expect.eval(self, input_line, **kwds)
215      File "/home/adamwebb/local/sage/local/lib/python/site-packages/sage/interfaces/expect.py", line 972, in eval
216        return '\n'.join([self._eval_line(L, **kwds) for L in code.split('\n') if L != ''])
217      File "/home/adamwebb/local/sage/local/lib/python/site-packages/sage/interfaces/gap.py", line 722, in _eval_line
218        raise RuntimeError, message
219    RuntimeError: Gap produced error output
220    Variable: 'ResolutionFiniteGroup' must have a value
221
222
223       executing R:=ResolutionFiniteGroup(S,3);
224**********************************************************************
225File "/home/adamwebb/local/sage/devel/sage/sage/groups/perm_gps/permgroup.py", line 1247:
226    sage: G.homology(7)                              # optional - gap_packages
227Exception raised:
228    Traceback (most recent call last):
229      File "/home/adamwebb/local/sage/local/bin/ncadoctest.py", line 1231, in run_one_test
230        self.run_one_example(test, example, filename, compileflags)
231      File "/home/adamwebb/local/sage/local/bin/sagedoctest.py", line 38, in run_one_example
232        OrigDocTestRunner.run_one_example(self, test, example, filename, compileflags)
233      File "/home/adamwebb/local/sage/local/bin/ncadoctest.py", line 1172, in run_one_example
234        compileflags, 1) in test.globs
235      File "<doctest __main__.example_39[3]>", line 1, in <module>
236        G.homology(Integer(7))                              # optional - gap_packages###line 1247:
237    sage: G.homology(7)                              # optional - gap_packages
238      File "/home/adamwebb/local/sage/local/lib/python/site-packages/sage/groups/perm_gps/permgroup.py", line 1272, in homology
239        L = eval(gap.eval("GroupHomology(%s,%s)"%(GG,n)))
240      File "/home/adamwebb/local/sage/local/lib/python/site-packages/sage/interfaces/gap.py", line 480, in eval
241        result = Expect.eval(self, input_line, **kwds)
242      File "/home/adamwebb/local/sage/local/lib/python/site-packages/sage/interfaces/expect.py", line 972, in eval
243        return '\n'.join([self._eval_line(L, **kwds) for L in code.split('\n') if L != ''])
244      File "/home/adamwebb/local/sage/local/lib/python/site-packages/sage/interfaces/gap.py", line 722, in _eval_line
245        raise RuntimeError, message
246    RuntimeError: Gap produced error output
247    Variable: 'GroupHomology' must have a value
248
249
250       executing GroupHomology(SymmetricGroup(5),7);
251**********************************************************************
252File "/home/adamwebb/local/sage/devel/sage/sage/groups/perm_gps/permgroup.py", line 1249:
253    sage: G.homology(7,2)                              # optional - gap_packages
254Exception raised:
255    Traceback (most recent call last):
256      File "/home/adamwebb/local/sage/local/bin/ncadoctest.py", line 1231, in run_one_test
257        self.run_one_example(test, example, filename, compileflags)
258      File "/home/adamwebb/local/sage/local/bin/sagedoctest.py", line 38, in run_one_example
259        OrigDocTestRunner.run_one_example(self, test, example, filename, compileflags)
260      File "/home/adamwebb/local/sage/local/bin/ncadoctest.py", line 1172, in run_one_example
261        compileflags, 1) in test.globs
262      File "<doctest __main__.example_39[4]>", line 1, in <module>
263        G.homology(Integer(7),Integer(2))                              # optional - gap_packages###line 1249:
264    sage: G.homology(7,2)                              # optional - gap_packages
265      File "/home/adamwebb/local/sage/local/lib/python/site-packages/sage/groups/perm_gps/permgroup.py", line 1274, in homology
266        L = eval(gap.eval("GroupHomology(%s,%s,%s)"%(GG,n,p)))
267      File "/home/adamwebb/local/sage/local/lib/python/site-packages/sage/interfaces/gap.py", line 480, in eval
268        result = Expect.eval(self, input_line, **kwds)
269      File "/home/adamwebb/local/sage/local/lib/python/site-packages/sage/interfaces/expect.py", line 972, in eval
270        return '\n'.join([self._eval_line(L, **kwds) for L in code.split('\n') if L != ''])
271      File "/home/adamwebb/local/sage/local/lib/python/site-packages/sage/interfaces/gap.py", line 722, in _eval_line
272        raise RuntimeError, message
273    RuntimeError: Gap produced error output
274    Variable: 'GroupHomology' must have a value
275
276
277       executing GroupHomology(SymmetricGroup(5),7,2);
278**********************************************************************
279File "/home/adamwebb/local/sage/devel/sage/sage/groups/perm_gps/permgroup.py", line 1251:
280    sage: G.homology(7,3)                              # optional - gap_packages
281Exception raised:
282    Traceback (most recent call last):
283      File "/home/adamwebb/local/sage/local/bin/ncadoctest.py", line 1231, in run_one_test
284        self.run_one_example(test, example, filename, compileflags)
285      File "/home/adamwebb/local/sage/local/bin/sagedoctest.py", line 38, in run_one_example
286        OrigDocTestRunner.run_one_example(self, test, example, filename, compileflags)
287      File "/home/adamwebb/local/sage/local/bin/ncadoctest.py", line 1172, in run_one_example
288        compileflags, 1) in test.globs
289      File "<doctest __main__.example_39[5]>", line 1, in <module>
290        G.homology(Integer(7),Integer(3))                              # optional - gap_packages###line 1251:
291    sage: G.homology(7,3)                              # optional - gap_packages
292      File "/home/adamwebb/local/sage/local/lib/python/site-packages/sage/groups/perm_gps/permgroup.py", line 1274, in homology
293        L = eval(gap.eval("GroupHomology(%s,%s,%s)"%(GG,n,p)))
294      File "/home/adamwebb/local/sage/local/lib/python/site-packages/sage/interfaces/gap.py", line 480, in eval
295        result = Expect.eval(self, input_line, **kwds)
296      File "/home/adamwebb/local/sage/local/lib/python/site-packages/sage/interfaces/expect.py", line 972, in eval
297        return '\n'.join([self._eval_line(L, **kwds) for L in code.split('\n') if L != ''])
298      File "/home/adamwebb/local/sage/local/lib/python/site-packages/sage/interfaces/gap.py", line 722, in _eval_line
299        raise RuntimeError, message
300    RuntimeError: Gap produced error output
301    Variable: 'GroupHomology' must have a value
302
303
304       executing GroupHomology(SymmetricGroup(5),7,3);
305**********************************************************************
306File "/home/adamwebb/local/sage/devel/sage/sage/groups/perm_gps/permgroup.py", line 1253:
307    sage: G.homology(7,5)                              # optional - gap_packages
308Exception raised:
309    Traceback (most recent call last):
310      File "/home/adamwebb/local/sage/local/bin/ncadoctest.py", line 1231, in run_one_test
311        self.run_one_example(test, example, filename, compileflags)
312      File "/home/adamwebb/local/sage/local/bin/sagedoctest.py", line 38, in run_one_example
313        OrigDocTestRunner.run_one_example(self, test, example, filename, compileflags)
314      File "/home/adamwebb/local/sage/local/bin/ncadoctest.py", line 1172, in run_one_example
315        compileflags, 1) in test.globs
316      File "<doctest __main__.example_39[6]>", line 1, in <module>
317        G.homology(Integer(7),Integer(5))                              # optional - gap_packages###line 1253:
318    sage: G.homology(7,5)                              # optional - gap_packages
319      File "/home/adamwebb/local/sage/local/lib/python/site-packages/sage/groups/perm_gps/permgroup.py", line 1274, in homology
320        L = eval(gap.eval("GroupHomology(%s,%s,%s)"%(GG,n,p)))
321      File "/home/adamwebb/local/sage/local/lib/python/site-packages/sage/interfaces/gap.py", line 480, in eval
322        result = Expect.eval(self, input_line, **kwds)
323      File "/home/adamwebb/local/sage/local/lib/python/site-packages/sage/interfaces/expect.py", line 972, in eval
324        return '\n'.join([self._eval_line(L, **kwds) for L in code.split('\n') if L != ''])
325      File "/home/adamwebb/local/sage/local/lib/python/site-packages/sage/interfaces/gap.py", line 722, in _eval_line
326        raise RuntimeError, message
327    RuntimeError: Gap produced error output
328    Variable: 'GroupHomology' must have a value
329
330
331       executing GroupHomology(SymmetricGroup(5),7,5);
332**********************************************************************
333File "/home/adamwebb/local/sage/devel/sage/sage/groups/perm_gps/permgroup.py", line 237:
334    sage: H = PermutationGroup(G); H          # optional - database_gap
335Expected:
336    Transitive group number 3 of degree 4
337Got:
338    verbose 0 (501: permgroup_named.py, __init__) Warning: Computing with TransitiveGroups requires the optional database_gap package. Please install it.
339    Transitive group number 3 of degree 4
340**********************************************************************
341File "/home/adamwebb/local/sage/devel/sage/sage/groups/perm_gps/permgroup.py", line 239:
342    sage: H.gens()                            # optional - database_gap
343Expected:
344    [(1,2,3,4), (1,3)]
345Got nothing
346**********************************************************************
347File "/home/adamwebb/local/sage/devel/sage/sage/groups/perm_gps/permgroup.py", line 1290:
348    sage: G.homology_part(7,2)                              # optional - gap_packages
349Exception raised:
350    Traceback (most recent call last):
351      File "/home/adamwebb/local/sage/local/bin/ncadoctest.py", line 1231, in run_one_test
352        self.run_one_example(test, example, filename, compileflags)
353      File "/home/adamwebb/local/sage/local/bin/sagedoctest.py", line 38, in run_one_example
354        OrigDocTestRunner.run_one_example(self, test, example, filename, compileflags)
355      File "/home/adamwebb/local/sage/local/bin/ncadoctest.py", line 1172, in run_one_example
356        compileflags, 1) in test.globs
357      File "<doctest __main__.example_40[3]>", line 1, in <module>
358        G.homology_part(Integer(7),Integer(2))                              # optional - gap_packages###line 1290:
359    sage: G.homology_part(7,2)                              # optional - gap_packages
360      File "/home/adamwebb/local/sage/local/lib/python/site-packages/sage/groups/perm_gps/permgroup.py", line 1307, in homology_part
361        gap.eval("R:=ResolutionFiniteGroup(S,%s)"%(n+1))
362      File "/home/adamwebb/local/sage/local/lib/python/site-packages/sage/interfaces/gap.py", line 480, in eval
363        result = Expect.eval(self, input_line, **kwds)
364      File "/home/adamwebb/local/sage/local/lib/python/site-packages/sage/interfaces/expect.py", line 972, in eval
365        return '\n'.join([self._eval_line(L, **kwds) for L in code.split('\n') if L != ''])
366      File "/home/adamwebb/local/sage/local/lib/python/site-packages/sage/interfaces/gap.py", line 722, in _eval_line
367        raise RuntimeError, message
368    RuntimeError: Gap produced error output
369    Variable: 'ResolutionFiniteGroup' must have a value
370
371
372       executing R:=ResolutionFiniteGroup(S,8);
373**********************************************************************
374File "/home/adamwebb/local/sage/devel/sage/sage/groups/perm_gps/permgroup.py", line 288:
375    sage: G.group_id()          # optional - database_gap
376Exception raised:
377    Traceback (most recent call last):
378      File "/home/adamwebb/local/sage/local/bin/ncadoctest.py", line 1231, in run_one_test
379        self.run_one_example(test, example, filename, compileflags)
380      File "/home/adamwebb/local/sage/local/bin/sagedoctest.py", line 38, in run_one_example
381        OrigDocTestRunner.run_one_example(self, test, example, filename, compileflags)
382      File "/home/adamwebb/local/sage/local/bin/ncadoctest.py", line 1172, in run_one_example
383        compileflags, 1) in test.globs
384      File "<doctest __main__.example_5[5]>", line 1, in <module>
385        G.group_id()          # optional - database_gap###line 288:
386    sage: G.group_id()          # optional - database_gap
387      File "/home/adamwebb/local/sage/local/lib/python/site-packages/sage/groups/perm_gps/permgroup.py", line 979, in group_id
388        return [Integer(n) for n in eval(str(self._gap_().IdGroup()))]
389      File "/home/adamwebb/local/sage/local/lib/python/site-packages/sage/interfaces/expect.py", line 1382, in __call__
390        return self._obj.parent().function_call(self._name, [self._obj] + list(args), kwds)
391      File "/home/adamwebb/local/sage/local/lib/python/site-packages/sage/interfaces/gap.py", line 885, in function_call
392        ['%s=%s'%(key,value.name()) for key, value in kwds.items()])))
393      File "/home/adamwebb/local/sage/local/lib/python/site-packages/sage/interfaces/gap.py", line 480, in eval
394        result = Expect.eval(self, input_line, **kwds)
395      File "/home/adamwebb/local/sage/local/lib/python/site-packages/sage/interfaces/expect.py", line 972, in eval
396        return '\n'.join([self._eval_line(L, **kwds) for L in code.split('\n') if L != ''])
397      File "/home/adamwebb/local/sage/local/lib/python/site-packages/sage/interfaces/gap.py", line 722, in _eval_line
398        raise RuntimeError, message
399    RuntimeError: Gap produced error output
400    Error, the Small Groups identification is required but not installed
401
402       executing IdGroup($sage63);
403**********************************************************************
404File "/home/adamwebb/local/sage/devel/sage/sage/groups/perm_gps/permgroup.py", line 2093:
405    sage: G.poincare_series(2,10)                              # optional - gap_packages
406Exception raised:
407    Traceback (most recent call last):
408      File "/home/adamwebb/local/sage/local/bin/ncadoctest.py", line 1231, in run_one_test
409        self.run_one_example(test, example, filename, compileflags)
410      File "/home/adamwebb/local/sage/local/bin/sagedoctest.py", line 38, in run_one_example
411        OrigDocTestRunner.run_one_example(self, test, example, filename, compileflags)
412      File "/home/adamwebb/local/sage/local/bin/ncadoctest.py", line 1172, in run_one_example
413        compileflags, 1) in test.globs
414      File "<doctest __main__.example_73[3]>", line 1, in <module>
415        G.poincare_series(Integer(2),Integer(10))                              # optional - gap_packages###line 2093:
416    sage: G.poincare_series(2,10)                              # optional - gap_packages
417      File "/home/adamwebb/local/sage/local/lib/python/site-packages/sage/groups/perm_gps/permgroup.py", line 2109, in poincare_series
418        ff = gap.eval("ff := PoincareSeriesPrimePart(%s,%s,%s)"%(GG,p,n))
419      File "/home/adamwebb/local/sage/local/lib/python/site-packages/sage/interfaces/gap.py", line 480, in eval
420        result = Expect.eval(self, input_line, **kwds)
421      File "/home/adamwebb/local/sage/local/lib/python/site-packages/sage/interfaces/expect.py", line 972, in eval
422        return '\n'.join([self._eval_line(L, **kwds) for L in code.split('\n') if L != ''])
423      File "/home/adamwebb/local/sage/local/lib/python/site-packages/sage/interfaces/gap.py", line 722, in _eval_line
424        raise RuntimeError, message
425    RuntimeError: Gap produced error output
426    Variable: 'PoincareSeriesPrimePart' must have a value
427
428
429       executing ff := PoincareSeriesPrimePart(SymmetricGroup(5),2,10);
430**********************************************************************
431File "/home/adamwebb/local/sage/devel/sage/sage/groups/perm_gps/permgroup.py", line 2096:
432    sage: G.poincare_series(2,10)                              # optional - gap_packages
433Exception raised:
434    Traceback (most recent call last):
435      File "/home/adamwebb/local/sage/local/bin/ncadoctest.py", line 1231, in run_one_test
436        self.run_one_example(test, example, filename, compileflags)
437      File "/home/adamwebb/local/sage/local/bin/sagedoctest.py", line 38, in run_one_example
438        OrigDocTestRunner.run_one_example(self, test, example, filename, compileflags)
439      File "/home/adamwebb/local/sage/local/bin/ncadoctest.py", line 1172, in run_one_example
440        compileflags, 1) in test.globs
441      File "<doctest __main__.example_73[5]>", line 1, in <module>
442        G.poincare_series(Integer(2),Integer(10))                              # optional - gap_packages###line 2096:
443    sage: G.poincare_series(2,10)                              # optional - gap_packages
444      File "/home/adamwebb/local/sage/local/lib/python/site-packages/sage/groups/perm_gps/permgroup.py", line 2109, in poincare_series
445        ff = gap.eval("ff := PoincareSeriesPrimePart(%s,%s,%s)"%(GG,p,n))
446      File "/home/adamwebb/local/sage/local/lib/python/site-packages/sage/interfaces/gap.py", line 480, in eval
447        result = Expect.eval(self, input_line, **kwds)
448      File "/home/adamwebb/local/sage/local/lib/python/site-packages/sage/interfaces/expect.py", line 972, in eval
449        return '\n'.join([self._eval_line(L, **kwds) for L in code.split('\n') if L != ''])
450      File "/home/adamwebb/local/sage/local/lib/python/site-packages/sage/interfaces/gap.py", line 722, in _eval_line
451        raise RuntimeError, message
452    RuntimeError: Gap produced error output
453    Variable: 'PoincareSeriesPrimePart' must have a value
454
455
456       executing ff := PoincareSeriesPrimePart(SymmetricGroup(3),2,10);
457**********************************************************************
4589 items had failures:
459   1 of   4 in __main__.example_31
460   1 of   4 in __main__.example_32
461   4 of   9 in __main__.example_37
462   2 of   6 in __main__.example_38
463   4 of   7 in __main__.example_39
464   2 of  18 in __main__.example_4
465   1 of   4 in __main__.example_40
466   1 of   9 in __main__.example_5
467   2 of   6 in __main__.example_73
468***Test Failed*** 18 failures.
469For whitespace errors, see the file /home/adamwebb/local/sage/tmp/.doctest_permgroup.py
470         [7.0 s]
471exit code: 1024
472 
473----------------------------------------------------------------------
474The following tests failed:
475
476
477        sage -t -long --optional "devel/sage/sage/groups/perm_gps/permgroup.py"
478Total time for all tests: 7.0 seconds