Ticket #5847: config.log

File config.log, 23.7 KB (added by dimpase, 8 years ago)

macosx 10.5 ppc G4 failure of ./configure

Line 
1This file contains any messages produced by compilers while
2running configure, to aid debugging if configure makes a mistake.
3
4It was created by ecm configure 6.3, which was
5generated by GNU Autoconf 2.63.  Invocation command line was
6
7  $ ./configure
8
9## --------- ##
10## Platform. ##
11## --------- ##
12
13hostname = cantor.local
14uname -m = Power Macintosh
15uname -r = 9.8.0
16uname -s = Darwin
17uname -v = Darwin Kernel Version 9.8.0: Wed Jul 15 16:57:01 PDT 2009; root:xnu-1228.15.4~1/RELEASE_PPC
18
19/usr/bin/uname -p = powerpc
20/bin/uname -X     = unknown
21
22/bin/arch              = unknown
23/usr/bin/arch -k       = unknown
24/usr/convex/getsysinfo = unknown
25/usr/bin/hostinfo      = Mach kernel version:
26         Darwin Kernel Version 9.8.0: Wed Jul 15 16:57:01 PDT 2009; root:xnu-1228.15.4~1/RELEASE_PPC
27Kernel configured for a single processor only.
281 processor is physically available.
291 processor is logically available.
30Processor type: ppc7450 (PowerPC 7450)
31Processor active: 0
32Primary memory available: 1.50 gigabytes
33Default processor set: 116 tasks, 384 threads, 1 processors
34Load average: 5.32, Mach factor: 0.18
35/bin/machine           = unknown
36/usr/bin/oslevel       = unknown
37/bin/universe          = unknown
38
39PATH: /usr/local/texlive/2010/bin/universal-darwin
40PATH: /usr/local/texlive/2007/bin/powerpc-darwin
41PATH: /usr/bin
42PATH: /bin
43PATH: /usr/sbin
44PATH: /sbin
45PATH: /usr/local/bin
46PATH: /usr/X11/bin
47
48
49## ----------- ##
50## Core tests. ##
51## ----------- ##
52
53configure:2130: checking for a BSD-compatible install
54configure:2198: result: /usr/bin/install -c
55configure:2209: checking whether build environment is sane
56configure:2269: result: yes
57configure:2410: checking for a thread-safe mkdir -p
58configure:2449: result: /usr/local/bin/mkdir -p
59configure:2462: checking for gawk
60configure:2492: result: no
61configure:2462: checking for mawk
62configure:2492: result: no
63configure:2462: checking for nawk
64configure:2492: result: no
65configure:2462: checking for awk
66configure:2478: found /usr/bin/awk
67configure:2489: result: awk
68configure:2500: checking whether make sets $(MAKE)
69configure:2522: result: yes
70configure:2674: checking build system type
71configure:2692: result: powerpc-apple-darwin9.8.0
72configure:2714: checking host system type
73configure:2729: result: powerpc-apple-darwin9.8.0
74configure:2757: checking for grep that handles long lines and -e
75configure:2817: result: /usr/bin/grep
76configure:2822: checking for egrep
77configure:2886: result: /usr/bin/grep -E
78configure:2891: checking for a sed that does not truncate output
79configure:2957: result: /usr/bin/sed
80configure:3103: checking for CC and CFLAGS in gmp.h
81Trying to run /lib/cpp
82Could not run /lib/cpp
83Trying to run gcc -E
84Trying to parse gmp.h with: gcc -E  conftest.c
85Success, GMP_CC=__GMP_CC, GMP_CFLAGS=__GMP_CFLAGS
86configure:3136: result: no
87configure:3215: checking for gcc
88configure:3231: found /usr/bin/gcc
89configure:3242: result: gcc
90configure:3474: checking for C compiler version
91configure:3482: gcc --version >&5
92powerpc-apple-darwin9-gcc-4.2.1 (GCC) 4.2.1 (Apple Inc. build 5577)
93Copyright (C) 2007 Free Software Foundation, Inc.
94This is free software; see the source for copying conditions.  There is NO
95warranty; not even for MERCHANTABILITY or FITNESS FOR A PARTICULAR PURPOSE.
96
97configure:3486: $? = 0
98configure:3493: gcc -v >&5
99Using built-in specs.
100Target: powerpc-apple-darwin9
101Configured with: /var/tmp/gcc_42/gcc_42-5577~1/src/configure --disable-checking --prefix=/usr --mandir=/usr/share/man --enable-languages=c,objc,c++,obj-c++ --program-transform-name=/^[cg][^.-]*$/s/$/-4.2/ --with-slibdir=/usr/lib --build=i686-apple-darwin9 --with-gxx-include-dir=/usr/include/c++/4.0.0 --program-prefix= --host=powerpc-apple-darwin9 --target=powerpc-apple-darwin9
102Thread model: posix
103gcc version 4.2.1 (Apple Inc. build 5577)
104configure:3497: $? = 0
105configure:3504: gcc -V >&5
106gcc-4.2: argument to `-V' is missing
107configure:3508: $? = 1
108configure:3531: checking for C compiler default output file name
109configure:3553: gcc    conftest.c  >&5
110configure:3557: $? = 0
111configure:3595: result: a.out
112configure:3614: checking whether the C compiler works
113configure:3624: ./a.out
114configure:3628: $? = 0
115configure:3647: result: yes
116configure:3654: checking whether we are cross compiling
117configure:3656: result: no
118configure:3659: checking for suffix of executables
119configure:3666: gcc -o conftest    conftest.c  >&5
120configure:3670: $? = 0
121configure:3696: result:
122configure:3702: checking for suffix of object files
123configure:3728: gcc -c   conftest.c >&5
124configure:3732: $? = 0
125configure:3757: result: o
126configure:3761: checking whether we are using the GNU C compiler
127configure:3790: gcc -c   conftest.c >&5
128configure:3797: $? = 0
129configure:3814: result: yes
130configure:3823: checking whether gcc accepts -g
131configure:3853: gcc -c -g  conftest.c >&5
132configure:3860: $? = 0
133configure:3961: result: yes
134configure:3978: checking for gcc option to accept ISO C89
135configure:4052: gcc  -c -g -O2  conftest.c >&5
136configure:4059: $? = 0
137configure:4082: result: none needed
138configure:4111: checking for style of include used by make
139configure:4139: result: GNU
140configure:4164: checking dependency style of gcc
141configure:4274: result: gcc3
142configure:4291: checking dependency style of gcc
143configure:4401: result: gcc3
144configure:4425: checking dependency style of gcc
145configure:4533: result: gcc3
146configure:4549: checking whether gcc and cc understand -c and -o together
147configure:4584: gcc -c conftest.c -o conftest2.o >&5
148configure:4588: $? = 0
149configure:4594: gcc -c conftest.c -o conftest2.o >&5
150configure:4598: $? = 0
151configure:4609: cc -c conftest.c >&5
152configure:4613: $? = 0
153configure:4621: cc -c conftest.c -o conftest2.o >&5
154configure:4625: $? = 0
155configure:4631: cc -c conftest.c -o conftest2.o >&5
156configure:4635: $? = 0
157configure:4653: result: yes
158configure:4711: checking for a sed that does not truncate output
159configure:4777: result: /usr/bin/sed
160configure:4795: checking for fgrep
161configure:4859: result: /usr/bin/grep -F
162configure:4894: checking for ld used by gcc
163configure:4961: result: /usr/libexec/gcc/powerpc-apple-darwin9/4.2.1/ld
164configure:4970: checking if the linker (/usr/libexec/gcc/powerpc-apple-darwin9/4.2.1/ld) is GNU ld
165configure:4985: result: no
166configure:4997: checking for BSD- or MS-compatible name lister (nm)
167configure:5046: result: /usr/bin/nm -p
168configure:5164: checking the name lister (/usr/bin/nm -p) interface
169configure:5171: gcc -c -g -O2  conftest.c >&5
170configure:5174: /usr/bin/nm -p "conftest.o"
171configure:5177: output
1720000018c D _some_variable
173configure:5184: result: BSD nm
174configure:5187: checking whether ln -s works
175configure:5191: result: yes
176configure:5199: checking the maximum length of command line arguments
177configure:5319: result: 196608
178configure:5336: checking whether the shell understands some XSI constructs
179configure:5346: result: yes
180configure:5350: checking whether the shell understands "+="
181configure:5356: result: yes
182configure:5391: checking for /usr/libexec/gcc/powerpc-apple-darwin9/4.2.1/ld option to reload object files
183configure:5398: result: -r
184configure:5467: checking for objdump
185configure:5497: result: no
186configure:5526: checking how to recognize dependent libraries
187configure:5722: result: pass_all
188configure:5782: checking for ar
189configure:5798: found /usr/bin/ar
190configure:5809: result: ar
191configure:5887: checking for strip
192configure:5903: found /usr/bin/strip
193configure:5914: result: strip
194configure:5986: checking for ranlib
195configure:6002: found /usr/bin/ranlib
196configure:6013: result: ranlib
197configure:6103: checking command to parse /usr/bin/nm -p output from gcc object
198configure:6221: gcc -c -g -O2  conftest.c >&5
199configure:6224: $? = 0
200configure:6228: /usr/bin/nm -p conftest.o \| sed -n -e 's/^.*[   ]\([BCDEGRST][BCDEGRST]*\)[     ][      ]*\([_A-Za-z][_A-Za-z0-9]*\)$/\1 \2 \2/p' \> conftest.nm
201configure:6231: $? = 0
202cannot find nm_test_var in conftest.nm
203configure:6221: gcc -c -g -O2  conftest.c >&5
204configure:6224: $? = 0
205configure:6228: /usr/bin/nm -p conftest.o \| sed -n -e 's/^.*[   ]\([BCDEGRST][BCDEGRST]*\)[     ][      ]*_\([_A-Za-z][_A-Za-z0-9]*\)$/\1 _\2 \2/p' \> conftest.nm
206configure:6231: $? = 0
207configure:6285: gcc -o conftest -g -O2   conftest.c conftstm.o >&5
208configure:6288: $? = 0
209configure:6326: result: ok
210configure:6620: checking for dsymutil
211configure:6636: found /usr/bin/dsymutil
212configure:6647: result: dsymutil
213configure:6712: checking for nmedit
214configure:6728: found /usr/bin/nmedit
215configure:6739: result: nmedit
216configure:6804: checking for lipo
217configure:6820: found /usr/bin/lipo
218configure:6831: result: lipo
219configure:6896: checking for otool
220configure:6912: found /usr/bin/otool
221configure:6923: result: otool
222configure:6988: checking for otool64
223configure:7018: result: no
224configure:7063: checking for -single_module linker flag
225gcc -g -O2  -o libconftest.dylib -dynamiclib -Wl,-single_module conftest.c
226configure:7090: result: yes
227configure:7092: checking for -exported_symbols_list linker flag
228configure:7122: gcc -o conftest -g -O2   -Wl,-exported_symbols_list,conftest.sym conftest.c  >&5
229configure:7129: $? = 0
230configure:7151: result: yes
231configure:7193: checking how to run the C preprocessor
232configure:7233: gcc -E  conftest.c
233configure:7240: $? = 0
234configure:7271: gcc -E  conftest.c
235conftest.c:12:28: error: ac_nonexistent.h: No such file or directory
236configure:7278: $? = 1
237configure: failed program was:
238| /* confdefs.h.  */
239| #define PACKAGE_NAME "ecm"
240| #define PACKAGE_TARNAME "ecm"
241| #define PACKAGE_VERSION "6.3"
242| #define PACKAGE_STRING "ecm 6.3"
243| #define PACKAGE_BUGREPORT "ecm-discuss@lists.gforge.inria.fr"
244| #define PACKAGE "ecm"
245| #define VERSION "6.3"
246| #define PACKAGE "ecm"
247| #define VERSION "6.3"
248| /* end confdefs.h.  */
249| #include <ac_nonexistent.h>
250configure:7311: result: gcc -E
251configure:7340: gcc -E  conftest.c
252configure:7347: $? = 0
253configure:7378: gcc -E  conftest.c
254conftest.c:12:28: error: ac_nonexistent.h: No such file or directory
255configure:7385: $? = 1
256configure: failed program was:
257| /* confdefs.h.  */
258| #define PACKAGE_NAME "ecm"
259| #define PACKAGE_TARNAME "ecm"
260| #define PACKAGE_VERSION "6.3"
261| #define PACKAGE_STRING "ecm 6.3"
262| #define PACKAGE_BUGREPORT "ecm-discuss@lists.gforge.inria.fr"
263| #define PACKAGE "ecm"
264| #define VERSION "6.3"
265| #define PACKAGE "ecm"
266| #define VERSION "6.3"
267| /* end confdefs.h.  */
268| #include <ac_nonexistent.h>
269configure:7425: checking for ANSI C header files
270configure:7455: gcc -c -g -O2  conftest.c >&5
271configure:7462: $? = 0
272configure:7561: gcc -o conftest -g -O2   conftest.c  >&5
273configure:7565: $? = 0
274configure:7571: ./conftest
275configure:7575: $? = 0
276configure:7593: result: yes
277configure:7617: checking for sys/types.h
278configure:7638: gcc -c -g -O2  conftest.c >&5
279configure:7645: $? = 0
280configure:7662: result: yes
281configure:7617: checking for sys/stat.h
282configure:7638: gcc -c -g -O2  conftest.c >&5
283configure:7645: $? = 0
284configure:7662: result: yes
285configure:7617: checking for stdlib.h
286configure:7638: gcc -c -g -O2  conftest.c >&5
287configure:7645: $? = 0
288configure:7662: result: yes
289configure:7617: checking for string.h
290configure:7638: gcc -c -g -O2  conftest.c >&5
291configure:7645: $? = 0
292configure:7662: result: yes
293configure:7617: checking for memory.h
294configure:7638: gcc -c -g -O2  conftest.c >&5
295configure:7645: $? = 0
296configure:7662: result: yes
297configure:7617: checking for strings.h
298configure:7638: gcc -c -g -O2  conftest.c >&5
299configure:7645: $? = 0
300configure:7662: result: yes
301configure:7617: checking for inttypes.h
302configure:7638: gcc -c -g -O2  conftest.c >&5
303configure:7645: $? = 0
304configure:7662: result: yes
305configure:7617: checking for stdint.h
306configure:7638: gcc -c -g -O2  conftest.c >&5
307configure:7645: $? = 0
308configure:7662: result: yes
309configure:7617: checking for unistd.h
310configure:7638: gcc -c -g -O2  conftest.c >&5
311configure:7645: $? = 0
312configure:7662: result: yes
313configure:7680: checking for dlfcn.h
314configure:7701: gcc -c -g -O2  conftest.c >&5
315configure:7708: $? = 0
316configure:7725: result: yes
317configure:7910: checking for objdir
318configure:7925: result: .libs
319configure:8221: checking if gcc supports -fno-rtti -fno-exceptions
320configure:8239: gcc -c -g -O2  -fno-rtti -fno-exceptions conftest.c >&5
321cc1: warning: command line option "-fno-rtti" is valid for C++/ObjC++ but not for C
322configure:8243: $? = 0
323configure:8256: result: no
324configure:8276: checking for gcc option to produce PIC
325configure:8548: result: -fno-common -DPIC
326configure:8560: checking if gcc PIC flag -fno-common -DPIC works
327configure:8578: gcc -c -g -O2  -fno-common -DPIC -DPIC conftest.c >&5
328configure:8582: $? = 0
329configure:8595: result: yes
330configure:8619: checking if gcc static flag -static works
331configure:8647: result: no
332configure:8662: checking if gcc supports -c -o file.o
333configure:8683: gcc -c -g -O2  -o out/conftest2.o conftest.c >&5
334configure:8687: $? = 0
335configure:8709: result: yes
336configure:8717: checking if gcc supports -c -o file.o
337configure:8764: result: yes
338configure:8797: checking whether the gcc linker (/usr/libexec/gcc/powerpc-apple-darwin9/4.2.1/ld) supports shared libraries
339configure:9871: result: yes
340configure:10110: checking dynamic linker characteristics
341configure:10796: result: darwin9.8.0 dyld
342configure:10898: checking how to hardcode library paths into programs
343configure:10923: result: immediate
344configure:11756: checking whether stripping libraries is possible
345configure:11770: result: yes
346configure:11796: checking if libtool supports shared libraries
347configure:11798: result: yes
348configure:11801: checking whether to build shared libraries
349configure:11822: result: no
350configure:11825: checking whether to build static libraries
351configure:11829: result: yes
352configure:11867: checking for an ANSI C-conforming const
353configure:11942: gcc -c -g -O2  conftest.c >&5
354configure:11949: $? = 0
355configure:11964: result: yes
356configure:11975: checking for inline
357configure:12001: gcc -c -g -O2  conftest.c >&5
358configure:12008: $? = 0
359configure:12026: result: inline
360configure:12046: checking whether time.h and sys/time.h may both be included
361configure:12076: gcc -c -g -O2  conftest.c >&5
362configure:12083: $? = 0
363configure:12098: result: yes
364configure:12109: checking for size_t
365configure:12137: gcc -c -g -O2  conftest.c >&5
366configure:12144: $? = 0
367configure:12171: gcc -c -g -O2  conftest.c >&5
368conftest.c: In function 'main':
369conftest.c:61: error: expected expression before ')' token
370configure:12178: $? = 1
371configure: failed program was:
372| /* confdefs.h.  */
373| #define PACKAGE_NAME "ecm"
374| #define PACKAGE_TARNAME "ecm"
375| #define PACKAGE_VERSION "6.3"
376| #define PACKAGE_STRING "ecm 6.3"
377| #define PACKAGE_BUGREPORT "ecm-discuss@lists.gforge.inria.fr"
378| #define PACKAGE "ecm"
379| #define VERSION "6.3"
380| #define PACKAGE "ecm"
381| #define VERSION "6.3"
382| #define STDC_HEADERS 1
383| #define HAVE_SYS_TYPES_H 1
384| #define HAVE_SYS_STAT_H 1
385| #define HAVE_STDLIB_H 1
386| #define HAVE_STRING_H 1
387| #define HAVE_MEMORY_H 1
388| #define HAVE_STRINGS_H 1
389| #define HAVE_INTTYPES_H 1
390| #define HAVE_STDINT_H 1
391| #define HAVE_UNISTD_H 1
392| #define HAVE_DLFCN_H 1
393| #define LT_OBJDIR ".libs/"
394| #define TIME_WITH_SYS_TIME 1
395| /* end confdefs.h.  */
396| #include <stdio.h>
397| #ifdef HAVE_SYS_TYPES_H
398| # include <sys/types.h>
399| #endif
400| #ifdef HAVE_SYS_STAT_H
401| # include <sys/stat.h>
402| #endif
403| #ifdef STDC_HEADERS
404| # include <stdlib.h>
405| # include <stddef.h>
406| #else
407| # ifdef HAVE_STDLIB_H
408| #  include <stdlib.h>
409| # endif
410| #endif
411| #ifdef HAVE_STRING_H
412| # if !defined STDC_HEADERS && defined HAVE_MEMORY_H
413| #  include <memory.h>
414| # endif
415| # include <string.h>
416| #endif
417| #ifdef HAVE_STRINGS_H
418| # include <strings.h>
419| #endif
420| #ifdef HAVE_INTTYPES_H
421| # include <inttypes.h>
422| #endif
423| #ifdef HAVE_STDINT_H
424| # include <stdint.h>
425| #endif
426| #ifdef HAVE_UNISTD_H
427| # include <unistd.h>
428| #endif
429| int
430| main ()
431| {
432| if (sizeof ((size_t)))
433|         return 0;
434|   ;
435|   return 0;
436| }
437configure:12201: result: yes
438configure:12375: checking for suitable m4
439trying m4
440good
441configure:12419: result: m4
442configure:12424: checking how to switch to text section
443configure:12436: result: .text
444configure:12440: checking how to export a symbol
445configure:12451: result: .globl
446configure:12455: checking what assembly label suffix to use
447configure:12467: result: :
448configure:12474: checking if globals are prefixed by underscore
449configure:12500: gcc -g -O2  -c conftes1.c >&5 && gcc -g -O2 -c conftes2.s >&5 && gcc -g -O2  conftes1.o conftes2.o >&5
450ld warning: can't find atom for stabs FUN at 00000000 in conftes2.o
451Undefined symbols:
452  "_underscore_test", referenced from:
453      _main in conftes1.o
454ld: symbol(s) not found
455collect2: ld returned 1 exit status
456configure:12503: $? = 1
457configure:12500: gcc -g -O2  -c conftes1.c >&5 && gcc -g -O2 -c conftes2.s >&5 && gcc -g -O2  conftes1.o conftes2.o >&5
458collect2: ld terminated with signal 10 [Bus error]
459ld warning: can't find atom for stabs FUN at 00000000 in conftes2.o
460configure:12503: $? = 1
461configure:12523: error: Test program links neither with nor without underscore.
462
463## ---------------- ##
464## Cache variables. ##
465## ---------------- ##
466
467ac_cv_build=powerpc-apple-darwin9.8.0
468ac_cv_c_compiler_gnu=yes
469ac_cv_c_const=yes
470ac_cv_c_inline=inline
471ac_cv_env_CCASFLAGS_set=
472ac_cv_env_CCASFLAGS_value=
473ac_cv_env_CCAS_set=
474ac_cv_env_CCAS_value=
475ac_cv_env_CC_set=
476ac_cv_env_CC_value=
477ac_cv_env_CFLAGS_set=
478ac_cv_env_CFLAGS_value=
479ac_cv_env_CPPFLAGS_set=
480ac_cv_env_CPPFLAGS_value=
481ac_cv_env_CPP_set=
482ac_cv_env_CPP_value=
483ac_cv_env_LDFLAGS_set=
484ac_cv_env_LDFLAGS_value=
485ac_cv_env_LIBS_set=
486ac_cv_env_LIBS_value=
487ac_cv_env_M4_set=
488ac_cv_env_M4_value=
489ac_cv_env_build_alias_set=
490ac_cv_env_build_alias_value=
491ac_cv_env_host_alias_set=
492ac_cv_env_host_alias_value=
493ac_cv_env_target_alias_set=
494ac_cv_env_target_alias_value=
495ac_cv_header_dlfcn_h=yes
496ac_cv_header_inttypes_h=yes
497ac_cv_header_memory_h=yes
498ac_cv_header_stdc=yes
499ac_cv_header_stdint_h=yes
500ac_cv_header_stdlib_h=yes
501ac_cv_header_string_h=yes
502ac_cv_header_strings_h=yes
503ac_cv_header_sys_stat_h=yes
504ac_cv_header_sys_types_h=yes
505ac_cv_header_time=yes
506ac_cv_header_unistd_h=yes
507ac_cv_host=powerpc-apple-darwin9.8.0
508ac_cv_objext=o
509ac_cv_path_EGREP='/usr/bin/grep -E'
510ac_cv_path_FGREP='/usr/bin/grep -F'
511ac_cv_path_GREP=/usr/bin/grep
512ac_cv_path_SED=/usr/bin/sed
513ac_cv_path_install='/usr/bin/install -c'
514ac_cv_path_mkdir=/usr/local/bin/mkdir
515ac_cv_prog_AWK=awk
516ac_cv_prog_CPP='gcc -E'
517ac_cv_prog_ac_ct_AR=ar
518ac_cv_prog_ac_ct_CC=gcc
519ac_cv_prog_ac_ct_DSYMUTIL=dsymutil
520ac_cv_prog_ac_ct_LIPO=lipo
521ac_cv_prog_ac_ct_NMEDIT=nmedit
522ac_cv_prog_ac_ct_OTOOL=otool
523ac_cv_prog_ac_ct_RANLIB=ranlib
524ac_cv_prog_ac_ct_STRIP=strip
525ac_cv_prog_cc_c89=
526ac_cv_prog_cc_g=yes
527ac_cv_prog_cc_gcc_c_o=yes
528ac_cv_prog_make_make_set=yes
529ac_cv_type_size_t=yes
530am_cv_CCAS_dependencies_compiler_type=gcc3
531am_cv_CC_dependencies_compiler_type=gcc3
532gmp_cv_asm_globl=.globl
533gmp_cv_asm_label_suffix=:
534gmp_cv_asm_text=.text
535gmp_cv_prog_m4=m4
536lt_cv_apple_cc_single_mod=yes
537lt_cv_deplibs_check_method=pass_all
538lt_cv_file_magic_cmd='$MAGIC_CMD'
539lt_cv_file_magic_test_file=
540lt_cv_ld_exported_symbols_list=yes
541lt_cv_ld_reload_flag=-r
542lt_cv_nm_interface='BSD nm'
543lt_cv_objdir=.libs
544lt_cv_path_LD=/usr/libexec/gcc/powerpc-apple-darwin9/4.2.1/ld
545lt_cv_path_NM='/usr/bin/nm -p'
546lt_cv_prog_compiler_c_o=yes
547lt_cv_prog_compiler_pic_works=yes
548lt_cv_prog_compiler_rtti_exceptions=no
549lt_cv_prog_compiler_static_works=no
550lt_cv_prog_gnu_ld=no
551lt_cv_sys_global_symbol_pipe='sed -n -e '\''s/^.*[       ]\([BCDEGRST][BCDEGRST]*\)[     ][      ]*_\([_A-Za-z][_A-Za-z0-9]*\)$/\1 _\2 \2/p'\'''
552lt_cv_sys_global_symbol_to_c_name_address='sed -n -e '\''s/^: \([^ ]*\) $/  {\"\1\", (void *) 0},/p'\'' -e '\''s/^[BCDEGRST]* \([^ ]*\) \([^ ]*\)$/  {"\2", (void *) \&\2},/p'\'''
553lt_cv_sys_global_symbol_to_c_name_address_lib_prefix='sed -n -e '\''s/^: \([^ ]*\) $/  {\"\1\", (void *) 0},/p'\'' -e '\''s/^[BCDEGRST]* \([^ ]*\) \(lib[^ ]*\)$/  {"\2", (void *) \&\2},/p'\'' -e '\''s/^[BCDEGRST]* \([^ ]*\) \([^ ]*\)$/  {"lib\2", (void *) \&\2},/p'\'''
554lt_cv_sys_global_symbol_to_cdecl='sed -n -e '\''s/^T .* \(.*\)$/extern int \1();/p'\'' -e '\''s/^[BCDEGRST]* .* \(.*\)$/extern char \1;/p'\'''
555lt_cv_sys_max_cmd_len=196608
556
557## ----------------- ##
558## Output variables. ##
559## ----------------- ##
560
561ACLOCAL='${SHELL} /usr/local/src/sage/sage-4.6/spkg/standard/notwoking/ecm-6.3.p0/src/missing --run aclocal-1.11'
562ALLOCA=''
563AMDEPBACKSLASH='\'
564AMDEP_FALSE='#'
565AMDEP_TRUE=''
566AMTAR='${SHELL} /usr/local/src/sage/sage-4.6/spkg/standard/notwoking/ecm-6.3.p0/src/missing --run tar'
567AR='ar'
568ASMPATH='powerpc64'
569AUTOCONF='${SHELL} /usr/local/src/sage/sage-4.6/spkg/standard/notwoking/ecm-6.3.p0/src/missing --run autoconf'
570AUTOHEADER='${SHELL} /usr/local/src/sage/sage-4.6/spkg/standard/notwoking/ecm-6.3.p0/src/missing --run autoheader'
571AUTOMAKE='${SHELL} /usr/local/src/sage/sage-4.6/spkg/standard/notwoking/ecm-6.3.p0/src/missing --run automake-1.11'
572AWK='awk'
573CC='gcc'
574CCAS='gcc'
575CCASDEPMODE='depmode=gcc3'
576CCASFLAGS='-g -O2'
577CCDEPMODE='depmode=gcc3'
578CFLAGS='-g -O2'
579CPP='gcc -E'
580CPPFLAGS=''
581CYGPATH_W='echo'
582DEFS=''
583DEPDIR='.deps'
584DSYMUTIL='dsymutil'
585DUMPBIN=''
586ECHO_C='\c'
587ECHO_N=''
588ECHO_T=''
589EGREP='/usr/bin/grep -E'
590ENABLE_ASM_REDC_FALSE=''
591ENABLE_ASM_REDC_TRUE=''
592EXEEXT=''
593FGREP='/usr/bin/grep -F'
594GMPLIB=''
595GREP='/usr/bin/grep'
596GSL_LD_FLAGS=''
597INSTALL_DATA='${INSTALL} -m 644'
598INSTALL_PROGRAM='${INSTALL}'
599INSTALL_SCRIPT='${INSTALL}'
600INSTALL_STRIP_PROGRAM='$(install_sh) -c -s'
601LD='/usr/libexec/gcc/powerpc-apple-darwin9/4.2.1/ld'
602LDFLAGS=''
603LIBOBJS=''
604LIBS=''
605LIBTOOL='$(SHELL) $(top_builddir)/libtool'
606LIPO='lipo'
607LN_S='ln -s'
608LTLIBOBJS=''
609M4='m4'
610MAKEINFO='${SHELL} /usr/local/src/sage/sage-4.6/spkg/standard/notwoking/ecm-6.3.p0/src/missing --run makeinfo'
611MAKE_MANPAGE_FALSE=''
612MAKE_MANPAGE_TRUE=''
613MEMORY_DEBUG_FALSE=''
614MEMORY_DEBUG_TRUE='#'
615MKDIR_P='/usr/local/bin/mkdir -p'
616NM='/usr/bin/nm -p'
617NMEDIT='nmedit'
618OBJDUMP='false'
619OBJEXT='o'
620OPENMP_CFLAGS=''
621OTOOL64=':'
622OTOOL='otool'
623PACKAGE='ecm'
624PACKAGE_BUGREPORT='ecm-discuss@lists.gforge.inria.fr'
625PACKAGE_NAME='ecm'
626PACKAGE_STRING='ecm 6.3'
627PACKAGE_TARNAME='ecm'
628PACKAGE_VERSION='6.3'
629PATH_SEPARATOR=':'
630POW_LIB=''
631RANLIB='ranlib'
632SED='/usr/bin/sed'
633SET_MAKE=''
634SHELL='/bin/sh'
635STRIP='strip'
636VALGRIND=''
637VERSION='6.3'
638WITH_GWNUM_FALSE=''
639WITH_GWNUM_TRUE=''
640XSLDIR=''
641XSLTPROC=''
642ac_ct_CC='gcc'
643ac_ct_DUMPBIN=''
644am__EXEEXT_FALSE=''
645am__EXEEXT_TRUE=''
646am__fastdepCCAS_FALSE='#'
647am__fastdepCCAS_TRUE=''
648am__fastdepCC_FALSE='#'
649am__fastdepCC_TRUE=''
650am__include='include'
651am__isrc=''
652am__leading_dot='.'
653am__quote=''
654am__tar='${AMTAR} chof - "$$tardir"'
655am__untar='${AMTAR} xf -'
656bindir='${exec_prefix}/bin'
657build='powerpc-apple-darwin9.8.0'
658build_alias=''
659build_cpu='powerpc'
660build_os='darwin9.8.0'
661build_vendor='apple'
662datadir='${datarootdir}'
663datarootdir='${prefix}/share'
664docdir='${datarootdir}/doc/${PACKAGE_TARNAME}'
665dvidir='${docdir}'
666exec_prefix='NONE'
667host='powerpc-apple-darwin9.8.0'
668host_alias=''
669host_cpu='powerpc'
670host_os='darwin9.8.0'
671host_vendor='apple'
672htmldir='${docdir}'
673includedir='${prefix}/include'
674infodir='${datarootdir}/info'
675install_sh='${SHELL} /usr/local/src/sage/sage-4.6/spkg/standard/notwoking/ecm-6.3.p0/src/install-sh'
676libdir='${exec_prefix}/lib'
677libexecdir='${exec_prefix}/libexec'
678localedir='${datarootdir}/locale'
679localstatedir='${prefix}/var'
680lt_ECHO='/bin/echo'
681mandir='${datarootdir}/man'
682mkdir_p='/usr/local/bin/mkdir -p'
683oldincludedir='/usr/include'
684pdfdir='${docdir}'
685prefix='NONE'
686program_transform_name='s,x,x,'
687psdir='${docdir}'
688sbindir='${exec_prefix}/sbin'
689sharedstatedir='${prefix}/com'
690sysconfdir='${prefix}/etc'
691target_alias=''
692
693## ----------- ##
694## confdefs.h. ##
695## ----------- ##
696
697#define PACKAGE_NAME "ecm"
698#define PACKAGE_TARNAME "ecm"
699#define PACKAGE_VERSION "6.3"
700#define PACKAGE_STRING "ecm 6.3"
701#define PACKAGE_BUGREPORT "ecm-discuss@lists.gforge.inria.fr"
702#define PACKAGE "ecm"
703#define VERSION "6.3"
704#define PACKAGE "ecm"
705#define VERSION "6.3"
706#define STDC_HEADERS 1
707#define HAVE_SYS_TYPES_H 1
708#define HAVE_SYS_STAT_H 1
709#define HAVE_STDLIB_H 1
710#define HAVE_STRING_H 1
711#define HAVE_MEMORY_H 1
712#define HAVE_STRINGS_H 1
713#define HAVE_INTTYPES_H 1
714#define HAVE_STDINT_H 1
715#define HAVE_UNISTD_H 1
716#define HAVE_DLFCN_H 1
717#define LT_OBJDIR ".libs/"
718#define TIME_WITH_SYS_TIME 1
719#define NATIVE_REDC 1
720
721configure: exit 1