Ticket #29071: vdelecroix-29071-fflas_ffpack-2.4.3.log

File vdelecroix-29071-fflas_ffpack-2.4.3.log, 107.5 KB (added by vdelecroix, 20 months ago)
Line 
1Found local metadata for fflas_ffpack-2.4.3
2Using cached file /opt/sage/upstream/fflas_ffpack-2.4.3.tar.bz2
3fflas_ffpack-2.4.3
4====================================================
5Setting up build directory for fflas_ffpack-2.4.3
6Finished extraction
7No patch files found in ../patches
8****************************************************
9Host system:
10Linux mangouste 5.4.13-arch1-1 #1 SMP PREEMPT Fri, 17 Jan 2020 23:09:54 +0000 x86_64 GNU/Linux
11****************************************************
12C compiler: gcc
13C compiler version:
14Using built-in specs.
15COLLECT_GCC=/usr/bin/gcc
16COLLECT_LTO_WRAPPER=/usr/lib/gcc/x86_64-pc-linux-gnu/9.2.0/lto-wrapper
17Target: x86_64-pc-linux-gnu
18Configured with: /build/gcc/src/gcc/configure --prefix=/usr --libdir=/usr/lib --libexecdir=/usr/lib --mandir=/usr/share/man --infodir=/usr/share/info --with-bugurl=https://bugs.archlinux.org/ --enable-languages=c,c++,ada,fortran,go,lto,objc,obj-c++,d --enable-shared --enable-threads=posix --with-system-zlib --with-isl --enable-__cxa_atexit --disable-libunwind-exceptions --enable-clocale=gnu --disable-libstdcxx-pch --disable-libssp --enable-gnu-unique-object --enable-linker-build-id --enable-lto --enable-plugin --enable-install-libiberty --with-linker-hash-style=gnu --enable-gnu-indirect-function --enable-multilib --disable-werror --enable-checking=release --enable-default-pie --enable-default-ssp --enable-cet=auto gdc_include_dir=/usr/include/dlang/gdc
19Thread model: posix
20gcc version 9.2.0 (GCC)
21****************************************************
22Package 'fflas_ffpack' is currently not installed
23No legacy uninstaller found for 'fflas_ffpack'; nothing to do
24*************************************************
25Using --with-blas-libs='-lopenblas ' ''
26*************************************************
27Configuring fflas_ffpack-2.4.3
28configure: WARNING: you should use --build, --host, --target
29configure: WARNING: unrecognized options: --disable-maintainer-mode
30checking build system type... x86_64-pc-linux-gnu
31checking host system type... x86_64-pc-linux-gnu
32checking target system type... x86_64-pc-linux-gnu
33checking for a BSD-compatible install... /usr/bin/install -c
34checking whether build environment is sane... yes
35checking for a thread-safe mkdir -p... /usr/bin/mkdir -p
36checking for gawk... gawk
37checking whether make sets $(MAKE)... yes
38checking whether make supports nested variables... yes
39-----------------------------------------------
40checking whether to enable debugging options in the library... no
41checking whether to enable profiling everything in the library... no
42checking whether to enable warnings when compiling the library... no
43-----------------------------------------------
44checking whether the C++ compiler works... yes
45checking for C++ compiler default output file name... a.out
46checking for suffix of executables...
47checking whether we are cross compiling... no
48checking for suffix of object files... o
49checking whether we are using the GNU C++ compiler... yes
50checking whether g++ -std=gnu++11 accepts -g... yes
51checking for style of include used by make... GNU
52checking dependency style of g++ -std=gnu++11... none
53checking for family name of compiler... gcc
54checking whether g++ -std=gnu++11 supports C++11 features by default... yes
55checking how to run the C++ preprocessor... g++ -std=gnu++11 -E
56checking for grep that handles long lines and -e... /usr/bin/grep
57checking for egrep... /usr/bin/grep -E
58checking for ANSI C header files... yes
59checking how to print strings... printf
60checking for gcc... gcc
61checking whether we are using the GNU C compiler... yes
62checking whether gcc accepts -g... yes
63checking for gcc option to accept ISO C89... none needed
64checking whether gcc understands -c and -o together... yes
65checking dependency style of gcc... none
66checking for a sed that does not truncate output... /usr/bin/sed
67checking for fgrep... /usr/bin/grep -F
68checking for ld used by gcc... ld
69checking if the linker (ld) is GNU ld... yes
70checking for BSD- or MS-compatible name lister (nm)... /usr/bin/nm -B
71checking the name lister (/usr/bin/nm -B) interface... BSD nm
72checking whether ln -s works... yes
73checking the maximum length of command line arguments... 1572864
74checking how to convert x86_64-pc-linux-gnu file names to x86_64-pc-linux-gnu format... func_convert_file_noop
75checking how to convert x86_64-pc-linux-gnu file names to toolchain format... func_convert_file_noop
76checking for ld option to reload object files... -r
77checking for objdump... objdump
78checking how to recognize dependent libraries... pass_all
79checking for dlltool... no
80checking how to associate runtime and link libraries... printf %s\n
81checking for archiver @FILE support... @
82checking for strip... strip
83checking for ranlib... ranlib
84checking command to parse /usr/bin/nm -B output from gcc object... ok
85checking for sysroot... no
86checking for a working dd... /usr/bin/dd
87checking how to truncate binary pipes... /usr/bin/dd bs=4096 count=1
88checking for mt... no
89checking if : is a manifest tool... no
90checking for sys/types.h... yes
91checking for sys/stat.h... yes
92checking for stdlib.h... yes
93checking for string.h... yes
94checking for memory.h... yes
95checking for strings.h... yes
96checking for inttypes.h... yes
97checking for stdint.h... yes
98checking for unistd.h... yes
99checking for dlfcn.h... yes
100checking for objdir... .libs
101checking if gcc supports -fno-rtti -fno-exceptions... no
102checking for gcc option to produce PIC... -fPIC -DPIC
103checking if gcc PIC flag -fPIC -DPIC works... yes
104checking if gcc static flag -static works... yes
105checking if gcc supports -c -o file.o... yes
106checking if gcc supports -c -o file.o... (cached) yes
107checking whether the gcc linker (ld -m elf_x86_64) supports shared libraries... yes
108checking whether -lc should be explicitly linked in... no
109checking dynamic linker characteristics... GNU/Linux ld.so
110checking how to hardcode library paths into programs... immediate
111checking whether stripping libraries is possible... yes
112checking if libtool supports shared libraries... yes
113checking whether to build shared libraries... yes
114checking whether to build static libraries... no
115checking how to run the C++ preprocessor... g++ -std=gnu++11 -E
116checking for ld used by g++ -std=gnu++11... ld -m elf_x86_64
117checking if the linker (ld -m elf_x86_64) is GNU ld... yes
118checking whether the g++ -std=gnu++11 linker (ld -m elf_x86_64) supports shared libraries... yes
119checking for g++ -std=gnu++11 option to produce PIC... -fPIC -DPIC
120checking if g++ -std=gnu++11 PIC flag -fPIC -DPIC works... yes
121checking if g++ -std=gnu++11 static flag -static works... yes
122checking if g++ -std=gnu++11 supports -c -o file.o... yes
123checking if g++ -std=gnu++11 supports -c -o file.o... (cached) yes
124checking whether the g++ -std=gnu++11 linker (ld -m elf_x86_64) supports shared libraries... yes
125checking dynamic linker characteristics... (cached) GNU/Linux ld.so
126checking how to hardcode library paths into programs... immediate
127checking for egrep... (cached) /usr/bin/grep -E
128checking for a sed that does not truncate output... (cached) /usr/bin/sed
129DEFAULT_CFLAGS=-O2  -Wall -g
130DEBUG_CFLAGS=-g
131TESTS_CFLAGS=
132-----------------------------------------------
133     START  FFLAS-FFPACK CONFIG               
134-----------------------------------------------
135checking for OpenMP... yes
136Detecting SIMD instruction set
137SSE enabled
138SSE2 enabled
139SSE3 enabled
140SSSE3 enabled
141SSE4.1 enabled
142SSE4.2 enabled
143AVX enabled
144AVX2 enabled
145AVX512F disabled
146AVX512VL disabled
147AVX512DQ disabled
148FMA3 enabled
149FMA4 disabled
150-----------------------------------------------
151checking size of char... 1
152checking size of short... 2
153checking size of int... 4
154checking size of long... 8
155checking size of long long... 8
156checking size of __int64... 0
157checking for __int128_t... yes
158checking for ANSI C header files... (cached) yes
159checking float.h usability... yes
160checking float.h presence... yes
161checking for float.h... yes
162checking limits.h usability... yes
163checking limits.h presence... yes
164checking for limits.h... yes
165checking stddef.h usability... yes
166checking stddef.h presence... yes
167checking for stddef.h... yes
168checking for stdlib.h... (cached) yes
169checking for string.h... (cached) yes
170checking sys/time.h usability... yes
171checking sys/time.h presence... yes
172checking for sys/time.h... yes
173checking for stdint.h... (cached) yes
174checking pthread.h usability... yes
175checking pthread.h presence... yes
176checking for pthread.h... yes
177checking whether byte ordering is bigendian... no
178-----------------------------------------------
179Default path = /opt/sage/local /usr /usr/local
180-----------------------------------------------
181checking for pkg-config... /usr/bin/pkg-config
182checking pkg-config is at least version 0.9.0... yes
183checking for GIVARO... yes
184checking for GIVARO usability... yes
185checking for use of MKL... no
186checking for BLAS... found Fortran BLAS
187checking for USER LAPACK... no
188checking if this is OpenBLAS... yes
189checking for OPENBLAS numthreads... none specified (using default value 1)
190checking whether to build documentation... no
191checking whether to compile the standard specializations... yes
192-----------------------------------------------
193          END FFLAS-FFPACK CONFIG             
194-----------------------------------------------
195checking that generated files are newer than configure... done
196configure: creating ./config.status
197config.status: creating Makefile
198chmod: cannot access 'fflas-ffpack-config': No such file or directory
199config.status: creating macros/Makefile
200chmod: cannot access 'fflas-ffpack-config': No such file or directory
201config.status: creating macros/CodeChunk/Makefile
202chmod: cannot access 'fflas-ffpack-config': No such file or directory
203config.status: creating fflas-ffpack-config
204config.status: creating fflas-ffpack/Makefile
205config.status: creating fflas-ffpack/fflas/Makefile
206config.status: creating fflas-ffpack/fflas/fflas_fgemm/Makefile
207config.status: creating fflas-ffpack/fflas/fflas_sparse/Makefile
208config.status: creating fflas-ffpack/fflas/fflas_sparse/coo/Makefile
209config.status: creating fflas-ffpack/fflas/fflas_sparse/csr/Makefile
210config.status: creating fflas-ffpack/fflas/fflas_sparse/ell/Makefile
211config.status: creating fflas-ffpack/fflas/fflas_sparse/ell_simd/Makefile
212config.status: creating fflas-ffpack/fflas/fflas_sparse/csr_hyb/Makefile
213config.status: creating fflas-ffpack/fflas/fflas_sparse/sell/Makefile
214config.status: creating fflas-ffpack/fflas/fflas_sparse/hyb_zo/Makefile
215config.status: creating fflas-ffpack/fflas/fflas_igemm/Makefile
216config.status: creating fflas-ffpack/fflas/fflas_simd/Makefile
217config.status: creating fflas-ffpack/ffpack/Makefile
218config.status: creating fflas-ffpack/field/Makefile
219config.status: creating fflas-ffpack/utils/Makefile
220config.status: creating fflas-ffpack/paladin/Makefile
221config.status: creating fflas-ffpack/interfaces/Makefile
222config.status: creating fflas-ffpack/interfaces/libs/Makefile
223config.status: creating fflas-ffpack/checkers/Makefile
224config.status: creating autotune/Makefile
225config.status: creating doc/Makefile
226config.status: creating tests/Makefile
227config.status: creating tests/data/Makefile
228config.status: creating benchmarks/Makefile
229config.status: creating examples/Makefile
230config.status: creating tutorials/Makefile
231config.status: creating fflas-ffpack.pc
232config.status: creating config.h
233config.status: executing fflas-ffpack/config.h commands
234config.status: creating fflas-ffpack/config.h - prefix __FFLASFFPACK for config.h defines
235config.status: executing depfiles commands
236config.status: executing libtool commands
237configure: WARNING: unrecognized options: --disable-maintainer-mode
238Building fflas_ffpack-2.4.3
239make[4]: Entering directory '/opt/sage/local/var/tmp/sage/build/fflas_ffpack-2.4.3/src'
240make  all-recursive
241make[5]: Entering directory '/opt/sage/local/var/tmp/sage/build/fflas_ffpack-2.4.3/src'
242Making all in autotune
243make[6]: Entering directory '/opt/sage/local/var/tmp/sage/build/fflas_ffpack-2.4.3/src/autotune'
244make[6]: Nothing to be done for 'all'.
245make[6]: Leaving directory '/opt/sage/local/var/tmp/sage/build/fflas_ffpack-2.4.3/src/autotune'
246Making all in fflas-ffpack
247make[6]: Entering directory '/opt/sage/local/var/tmp/sage/build/fflas_ffpack-2.4.3/src/fflas-ffpack'
248Making all in fflas
249make[7]: Entering directory '/opt/sage/local/var/tmp/sage/build/fflas_ffpack-2.4.3/src/fflas-ffpack/fflas'
250Making all in fflas_fgemm
251make[8]: Entering directory '/opt/sage/local/var/tmp/sage/build/fflas_ffpack-2.4.3/src/fflas-ffpack/fflas/fflas_fgemm'
252make[8]: Nothing to be done for 'all'.
253make[8]: Leaving directory '/opt/sage/local/var/tmp/sage/build/fflas_ffpack-2.4.3/src/fflas-ffpack/fflas/fflas_fgemm'
254Making all in fflas_igemm
255make[8]: Entering directory '/opt/sage/local/var/tmp/sage/build/fflas_ffpack-2.4.3/src/fflas-ffpack/fflas/fflas_igemm'
256make[8]: Nothing to be done for 'all'.
257make[8]: Leaving directory '/opt/sage/local/var/tmp/sage/build/fflas_ffpack-2.4.3/src/fflas-ffpack/fflas/fflas_igemm'
258Making all in fflas_simd
259make[8]: Entering directory '/opt/sage/local/var/tmp/sage/build/fflas_ffpack-2.4.3/src/fflas-ffpack/fflas/fflas_simd'
260make[8]: Nothing to be done for 'all'.
261make[8]: Leaving directory '/opt/sage/local/var/tmp/sage/build/fflas_ffpack-2.4.3/src/fflas-ffpack/fflas/fflas_simd'
262Making all in fflas_sparse
263make[8]: Entering directory '/opt/sage/local/var/tmp/sage/build/fflas_ffpack-2.4.3/src/fflas-ffpack/fflas/fflas_sparse'
264Making all in coo
265make[9]: Entering directory '/opt/sage/local/var/tmp/sage/build/fflas_ffpack-2.4.3/src/fflas-ffpack/fflas/fflas_sparse/coo'
266make[9]: Nothing to be done for 'all'.
267make[9]: Leaving directory '/opt/sage/local/var/tmp/sage/build/fflas_ffpack-2.4.3/src/fflas-ffpack/fflas/fflas_sparse/coo'
268Making all in csr
269make[9]: Entering directory '/opt/sage/local/var/tmp/sage/build/fflas_ffpack-2.4.3/src/fflas-ffpack/fflas/fflas_sparse/csr'
270make[9]: Nothing to be done for 'all'.
271make[9]: Leaving directory '/opt/sage/local/var/tmp/sage/build/fflas_ffpack-2.4.3/src/fflas-ffpack/fflas/fflas_sparse/csr'
272Making all in csr_hyb
273make[9]: Entering directory '/opt/sage/local/var/tmp/sage/build/fflas_ffpack-2.4.3/src/fflas-ffpack/fflas/fflas_sparse/csr_hyb'
274make[9]: Nothing to be done for 'all'.
275make[9]: Leaving directory '/opt/sage/local/var/tmp/sage/build/fflas_ffpack-2.4.3/src/fflas-ffpack/fflas/fflas_sparse/csr_hyb'
276Making all in ell
277make[9]: Entering directory '/opt/sage/local/var/tmp/sage/build/fflas_ffpack-2.4.3/src/fflas-ffpack/fflas/fflas_sparse/ell'
278make[9]: Nothing to be done for 'all'.
279make[9]: Leaving directory '/opt/sage/local/var/tmp/sage/build/fflas_ffpack-2.4.3/src/fflas-ffpack/fflas/fflas_sparse/ell'
280Making all in ell_simd
281make[9]: Entering directory '/opt/sage/local/var/tmp/sage/build/fflas_ffpack-2.4.3/src/fflas-ffpack/fflas/fflas_sparse/ell_simd'
282make[9]: Nothing to be done for 'all'.
283make[9]: Leaving directory '/opt/sage/local/var/tmp/sage/build/fflas_ffpack-2.4.3/src/fflas-ffpack/fflas/fflas_sparse/ell_simd'
284Making all in hyb_zo
285make[9]: Entering directory '/opt/sage/local/var/tmp/sage/build/fflas_ffpack-2.4.3/src/fflas-ffpack/fflas/fflas_sparse/hyb_zo'
286make[9]: Nothing to be done for 'all'.
287make[9]: Leaving directory '/opt/sage/local/var/tmp/sage/build/fflas_ffpack-2.4.3/src/fflas-ffpack/fflas/fflas_sparse/hyb_zo'
288Making all in sell
289make[9]: Entering directory '/opt/sage/local/var/tmp/sage/build/fflas_ffpack-2.4.3/src/fflas-ffpack/fflas/fflas_sparse/sell'
290make[9]: Nothing to be done for 'all'.
291make[9]: Leaving directory '/opt/sage/local/var/tmp/sage/build/fflas_ffpack-2.4.3/src/fflas-ffpack/fflas/fflas_sparse/sell'
292make[9]: Entering directory '/opt/sage/local/var/tmp/sage/build/fflas_ffpack-2.4.3/src/fflas-ffpack/fflas/fflas_sparse'
293make[9]: Nothing to be done for 'all-am'.
294make[9]: Leaving directory '/opt/sage/local/var/tmp/sage/build/fflas_ffpack-2.4.3/src/fflas-ffpack/fflas/fflas_sparse'
295make[8]: Leaving directory '/opt/sage/local/var/tmp/sage/build/fflas_ffpack-2.4.3/src/fflas-ffpack/fflas/fflas_sparse'
296make[8]: Entering directory '/opt/sage/local/var/tmp/sage/build/fflas_ffpack-2.4.3/src/fflas-ffpack/fflas'
297make[8]: Nothing to be done for 'all-am'.
298make[8]: Leaving directory '/opt/sage/local/var/tmp/sage/build/fflas_ffpack-2.4.3/src/fflas-ffpack/fflas'
299make[7]: Leaving directory '/opt/sage/local/var/tmp/sage/build/fflas_ffpack-2.4.3/src/fflas-ffpack/fflas'
300Making all in ffpack
301make[7]: Entering directory '/opt/sage/local/var/tmp/sage/build/fflas_ffpack-2.4.3/src/fflas-ffpack/ffpack'
302make[7]: Nothing to be done for 'all'.
303make[7]: Leaving directory '/opt/sage/local/var/tmp/sage/build/fflas_ffpack-2.4.3/src/fflas-ffpack/ffpack'
304Making all in field
305make[7]: Entering directory '/opt/sage/local/var/tmp/sage/build/fflas_ffpack-2.4.3/src/fflas-ffpack/field'
306make[7]: Nothing to be done for 'all'.
307make[7]: Leaving directory '/opt/sage/local/var/tmp/sage/build/fflas_ffpack-2.4.3/src/fflas-ffpack/field'
308Making all in utils
309make[7]: Entering directory '/opt/sage/local/var/tmp/sage/build/fflas_ffpack-2.4.3/src/fflas-ffpack/utils'
310make[7]: Nothing to be done for 'all'.
311make[7]: Leaving directory '/opt/sage/local/var/tmp/sage/build/fflas_ffpack-2.4.3/src/fflas-ffpack/utils'
312Making all in paladin
313make[7]: Entering directory '/opt/sage/local/var/tmp/sage/build/fflas_ffpack-2.4.3/src/fflas-ffpack/paladin'
314make[7]: Nothing to be done for 'all'.
315make[7]: Leaving directory '/opt/sage/local/var/tmp/sage/build/fflas_ffpack-2.4.3/src/fflas-ffpack/paladin'
316Making all in interfaces
317make[7]: Entering directory '/opt/sage/local/var/tmp/sage/build/fflas_ffpack-2.4.3/src/fflas-ffpack/interfaces'
318Making all in libs
319make[8]: Entering directory '/opt/sage/local/var/tmp/sage/build/fflas_ffpack-2.4.3/src/fflas-ffpack/interfaces/libs'
320/usr/bin/bash ../../../libtool  --tag=CXX   --mode=compile g++ -std=gnu++11 -DHAVE_CONFIG_H -I. -I../../..  -I../../..   -O2  -Wall -g -fabi-version=6  -msse -msse2 -msse3 -mssse3 -msse4.1 -msse4.2 -mavx -mavx2 -mfma -fabi-version=6    -fopenmp -c -o fflas_L1_inst.lo fflas_L1_inst.C
321libtool: compile:  g++ -std=gnu++11 -DHAVE_CONFIG_H -I. -I../../.. -I../../.. -O2 -Wall -g -fabi-version=6 -msse -msse2 -msse3 -mssse3 -msse4.1 -msse4.2 -mavx -mavx2 -mfma -fabi-version=6 -fopenmp -c fflas_L1_inst.C  -fPIC -DPIC -o .libs/fflas_L1_inst.o
322In file included from ../../../fflas-ffpack/fflas/fflas_fassign.h:31,
323                 from ../../../fflas-ffpack/fflas/fflas_freduce.inl:35,
324                 from ../../../fflas-ffpack/fflas/fflas_freduce.h:63,
325                 from ../../../fflas-ffpack/fflas/fflas.h:102,
326                 from fflas_L1_inst.C:32:
327../../../fflas-ffpack/fflas/fflas_fassign.inl: In function 'void FFLAS::fassign(const Field&, size_t, typename Field::ConstElement_ptr, size_t, typename Field::Element_ptr, size_t) [with Field = Givaro::Modular<float>; size_t = long unsigned int; typename Field::ConstElement_ptr = const float*; typename Field::Element_ptr = float*]':
328../../../fflas-ffpack/fflas/fflas_fassign.inl:75:9: error: 'openblas_set_num_threads' was not declared in this scope; did you mean 'omp_set_num_threads'?
329   75 |         openblas_set_num_threads(__FFLASFFPACK_OPENBLAS_NUM_THREADS);
330      |         ^~~~~~~~~~~~~~~~~~~~~~~~
331      |         omp_set_num_threads
332../../../fflas-ffpack/fflas/fflas_fassign.inl: In function 'void FFLAS::fassign(const Field&, size_t, typename Field::ConstElement_ptr, size_t, typename Field::Element_ptr, size_t) [with Field = Givaro::ModularBalanced<float>; size_t = long unsigned int; typename Field::ConstElement_ptr = const float*; typename Field::Element_ptr = float*]':
333../../../fflas-ffpack/fflas/fflas_fassign.inl:90:9: error: 'openblas_set_num_threads' was not declared in this scope; did you mean 'omp_set_num_threads'?
334   90 |         openblas_set_num_threads(__FFLASFFPACK_OPENBLAS_NUM_THREADS);
335      |         ^~~~~~~~~~~~~~~~~~~~~~~~
336      |         omp_set_num_threads
337../../../fflas-ffpack/fflas/fflas_fassign.inl: In function 'void FFLAS::fassign(const Field&, size_t, typename Field::ConstElement_ptr, size_t, typename Field::Element_ptr, size_t) [with Field = Givaro::ZRing<float>; size_t = long unsigned int; typename Field::ConstElement_ptr = const float*; typename Field::Element_ptr = float*]':
338../../../fflas-ffpack/fflas/fflas_fassign.inl:105:9: error: 'openblas_set_num_threads' was not declared in this scope; did you mean 'omp_set_num_threads'?
339  105 |         openblas_set_num_threads(__FFLASFFPACK_OPENBLAS_NUM_THREADS);
340      |         ^~~~~~~~~~~~~~~~~~~~~~~~
341      |         omp_set_num_threads
342../../../fflas-ffpack/fflas/fflas_fassign.inl: In function 'void FFLAS::fassign(const Field&, size_t, typename Field::ConstElement_ptr, size_t, typename Field::Element_ptr, size_t) [with Field = Givaro::Modular<double>; size_t = long unsigned int; typename Field::ConstElement_ptr = const double*; typename Field::Element_ptr = double*]':
343../../../fflas-ffpack/fflas/fflas_fassign.inl:120:9: error: 'openblas_set_num_threads' was not declared in this scope; did you mean 'omp_set_num_threads'?
344  120 |         openblas_set_num_threads(__FFLASFFPACK_OPENBLAS_NUM_THREADS);
345      |         ^~~~~~~~~~~~~~~~~~~~~~~~
346      |         omp_set_num_threads
347../../../fflas-ffpack/fflas/fflas_fassign.inl: In function 'void FFLAS::fassign(const Field&, size_t, typename Field::ConstElement_ptr, size_t, typename Field::Element_ptr, size_t) [with Field = Givaro::ModularBalanced<double>; size_t = long unsigned int; typename Field::ConstElement_ptr = const double*; typename Field::Element_ptr = double*]':
348../../../fflas-ffpack/fflas/fflas_fassign.inl:135:9: error: 'openblas_set_num_threads' was not declared in this scope; did you mean 'omp_set_num_threads'?
349  135 |         openblas_set_num_threads(__FFLASFFPACK_OPENBLAS_NUM_THREADS);
350      |         ^~~~~~~~~~~~~~~~~~~~~~~~
351      |         omp_set_num_threads
352../../../fflas-ffpack/fflas/fflas_fassign.inl: In function 'void FFLAS::fassign(const Field&, size_t, typename Field::ConstElement_ptr, size_t, typename Field::Element_ptr, size_t) [with Field = Givaro::ZRing<double>; size_t = long unsigned int; typename Field::ConstElement_ptr = const double*; typename Field::Element_ptr = double*]':
353../../../fflas-ffpack/fflas/fflas_fassign.inl:150:9: error: 'openblas_set_num_threads' was not declared in this scope; did you mean 'omp_set_num_threads'?
354  150 |         openblas_set_num_threads(__FFLASFFPACK_OPENBLAS_NUM_THREADS);
355      |         ^~~~~~~~~~~~~~~~~~~~~~~~
356      |         omp_set_num_threads
357In file included from ../../../fflas-ffpack/fflas/fflas_fscal.h:32,
358                 from ../../../fflas-ffpack/fflas/fflas.h:104,
359                 from fflas_L1_inst.C:32:
360../../../fflas-ffpack/fflas/fflas_fscal.inl: In function 'void FFLAS::fscal(const Field&, size_t, typename Field::Element, typename Field::ConstElement_ptr, size_t, typename Field::Element_ptr, size_t) [with Field = Givaro::ZRing<double>; size_t = long unsigned int; typename Field::Element = double; typename Field::ConstElement_ptr = const double*; typename Field::Element_ptr = double*]':
361../../../fflas-ffpack/fflas/fflas_fscal.inl:296:9: error: 'openblas_set_num_threads' was not declared in this scope; did you mean 'omp_set_num_threads'?
362  296 |         openblas_set_num_threads(__FFLASFFPACK_OPENBLAS_NUM_THREADS);
363      |         ^~~~~~~~~~~~~~~~~~~~~~~~
364      |         omp_set_num_threads
365../../../fflas-ffpack/fflas/fflas_fscal.inl: In function 'void FFLAS::fscal(const Field&, size_t, typename Field::Element, typename Field::ConstElement_ptr, size_t, typename Field::Element_ptr, size_t) [with Field = Givaro::ZRing<float>; size_t = long unsigned int; typename Field::Element = float; typename Field::ConstElement_ptr = const float*; typename Field::Element_ptr = float*]':
366../../../fflas-ffpack/fflas/fflas_fscal.inl:310:9: error: 'openblas_set_num_threads' was not declared in this scope; did you mean 'omp_set_num_threads'?
367  310 |         openblas_set_num_threads(__FFLASFFPACK_OPENBLAS_NUM_THREADS);
368      |         ^~~~~~~~~~~~~~~~~~~~~~~~
369      |         omp_set_num_threads
370../../../fflas-ffpack/fflas/fflas_fscal.inl: In function 'void FFLAS::fscalin(const Field&, size_t, typename Field::Element, typename Field::Element_ptr, size_t) [with Field = Givaro::ZRing<double>; size_t = long unsigned int; typename Field::Element = double; typename Field::Element_ptr = double*]':
371../../../fflas-ffpack/fflas/fflas_fscal.inl:324:9: error: 'openblas_set_num_threads' was not declared in this scope; did you mean 'omp_set_num_threads'?
372  324 |         openblas_set_num_threads(__FFLASFFPACK_OPENBLAS_NUM_THREADS);
373      |         ^~~~~~~~~~~~~~~~~~~~~~~~
374      |         omp_set_num_threads
375../../../fflas-ffpack/fflas/fflas_fscal.inl: In function 'void FFLAS::fscalin(const Field&, size_t, typename Field::Element, typename Field::Element_ptr, size_t) [with Field = Givaro::ZRing<float>; size_t = long unsigned int; typename Field::Element = float; typename Field::Element_ptr = float*]':
376../../../fflas-ffpack/fflas/fflas_fscal.inl:337:9: error: 'openblas_set_num_threads' was not declared in this scope; did you mean 'omp_set_num_threads'?
377  337 |         openblas_set_num_threads(__FFLASFFPACK_OPENBLAS_NUM_THREADS);
378      |         ^~~~~~~~~~~~~~~~~~~~~~~~
379      |         omp_set_num_threads
380In file included from ../../../fflas-ffpack/fflas/fflas_fgemm.inl:440,
381                 from ../../../fflas-ffpack/fflas/fflas.h:107,
382                 from fflas_L1_inst.C:32:
383../../../fflas-ffpack/fflas/fflas_fgemm/fgemm_classical.inl: In function 'void FFLAS::fgemm(const DoubleDomain&, FFLAS::FFLAS_TRANSPOSE, FFLAS::FFLAS_TRANSPOSE, size_t, size_t, size_t, Givaro::ZRing<double>::Element, Givaro::ZRing<double>::ConstElement_ptr, size_t, Givaro::ZRing<double>::ConstElement_ptr, size_t, Givaro::ZRing<double>::Element, Givaro::ZRing<double>::Element_ptr, size_t, FFLAS::MMHelper<Givaro::ZRing<double>, FFLAS::MMHelperAlgo::Classic, FFLAS::ModeCategories::DefaultTag>&)':
384../../../fflas-ffpack/fflas/fflas_fgemm/fgemm_classical.inl:253:9: error: 'openblas_set_num_threads' was not declared in this scope; did you mean 'omp_set_num_threads'?
385  253 |         openblas_set_num_threads(__FFLASFFPACK_OPENBLAS_NUM_THREADS);
386      |         ^~~~~~~~~~~~~~~~~~~~~~~~
387      |         omp_set_num_threads
388../../../fflas-ffpack/fflas/fflas_fgemm/fgemm_classical.inl: In function 'void FFLAS::fgemm(const FloatDomain&, FFLAS::FFLAS_TRANSPOSE, FFLAS::FFLAS_TRANSPOSE, size_t, size_t, size_t, Givaro::ZRing<float>::Element, Givaro::ZRing<float>::ConstElement_ptr, size_t, Givaro::ZRing<float>::ConstElement_ptr, size_t, Givaro::ZRing<float>::Element, Givaro::ZRing<float>::Element_ptr, size_t, FFLAS::MMHelper<Givaro::ZRing<float>, FFLAS::MMHelperAlgo::Classic, FFLAS::ModeCategories::DefaultTag>&)':
389../../../fflas-ffpack/fflas/fflas_fgemm/fgemm_classical.inl:276:9: error: 'openblas_set_num_threads' was not declared in this scope; did you mean 'omp_set_num_threads'?
390  276 |         openblas_set_num_threads(__FFLASFFPACK_OPENBLAS_NUM_THREADS);
391      |         ^~~~~~~~~~~~~~~~~~~~~~~~
392      |         omp_set_num_threads
393In file included from ../../../fflas-ffpack/fflas/fflas.h:107,
394                 from fflas_L1_inst.C:32:
395../../../fflas-ffpack/fflas/fflas_fgemm.inl: In function 'typename Field::Element_ptr FFLAS::fsquare(const Field&, FFLAS::FFLAS_TRANSPOSE, size_t, typename Field::Element, typename Field::ConstElement_ptr, size_t, typename Field::Element, typename Field::Element_ptr, size_t)':
396../../../fflas-ffpack/fflas/fflas_fgemm.inl:474:9: error: there are no arguments to 'openblas_set_num_threads' that depend on a template parameter, so a declaration of 'openblas_set_num_threads' must be available [-fpermissive]
397  474 |         openblas_set_num_threads(__FFLASFFPACK_OPENBLAS_NUM_THREADS);
398      |         ^~~~~~~~~~~~~~~~~~~~~~~~
399../../../fflas-ffpack/fflas/fflas_fgemm.inl:474:9: note: (if you use '-fpermissive', G++ will accept your code, but allowing the use of an undeclared name is deprecated)
400In file included from ../../../fflas-ffpack/fflas/fflas.h:110,
401                 from fflas_L1_inst.C:32:
402../../../fflas-ffpack/fflas/fflas_fgemv.inl: In function 'Givaro::ZRing<double>::Element* FFLAS::fgemv(const DoubleDomain&, FFLAS::FFLAS_TRANSPOSE, size_t, size_t, Givaro::ZRing<double>::Element, Givaro::ZRing<double>::ConstElement_ptr, size_t, Givaro::ZRing<double>::ConstElement_ptr, size_t, Givaro::ZRing<double>::Element, Givaro::ZRing<double>::Element_ptr, size_t, FFLAS::MMHelper<Givaro::ZRing<double>, FFLAS::MMHelperAlgo::Classic, FFLAS::ModeCategories::DefaultTag>&)':
403../../../fflas-ffpack/fflas/fflas_fgemv.inl:420:9: error: 'openblas_set_num_threads' was not declared in this scope; did you mean 'omp_set_num_threads'?
404  420 |         openblas_set_num_threads(__FFLASFFPACK_OPENBLAS_NUM_THREADS);
405      |         ^~~~~~~~~~~~~~~~~~~~~~~~
406      |         omp_set_num_threads
407../../../fflas-ffpack/fflas/fflas_fgemv.inl: In function 'Givaro::ZRing<float>::Element* FFLAS::fgemv(const FloatDomain&, FFLAS::FFLAS_TRANSPOSE, size_t, size_t, Givaro::ZRing<float>::Element, Givaro::ZRing<float>::ConstElement_ptr, size_t, Givaro::ZRing<float>::ConstElement_ptr, size_t, Givaro::ZRing<float>::Element, Givaro::ZRing<float>::Element_ptr, size_t, FFLAS::MMHelper<Givaro::ZRing<float>, FFLAS::MMHelperAlgo::Classic, FFLAS::ModeCategories::DefaultTag>&)':
408../../../fflas-ffpack/fflas/fflas_fgemv.inl:458:9: error: 'openblas_set_num_threads' was not declared in this scope; did you mean 'omp_set_num_threads'?
409  458 |         openblas_set_num_threads(__FFLASFFPACK_OPENBLAS_NUM_THREADS);
410      |         ^~~~~~~~~~~~~~~~~~~~~~~~
411      |         omp_set_num_threads
412In file included from ../../../fflas-ffpack/fflas/fflas.h:113,
413                 from fflas_L1_inst.C:32:
414../../../fflas-ffpack/fflas/fflas_fger.inl: In function 'void FFLAS::fger(const DoubleDomain&, size_t, size_t, Givaro::ZRing<double>::Element, Givaro::ZRing<double>::ConstElement_ptr, size_t, Givaro::ZRing<double>::ConstElement_ptr, size_t, Givaro::ZRing<double>::Element_ptr, size_t, FFLAS::MMHelper<Givaro::ZRing<double>, FFLAS::MMHelperAlgo::Classic, FFLAS::ModeCategories::DefaultTag>&)':
415../../../fflas-ffpack/fflas/fflas_fger.inl:180:9: error: 'openblas_set_num_threads' was not declared in this scope; did you mean 'omp_set_num_threads'?
416  180 |         openblas_set_num_threads(__FFLASFFPACK_OPENBLAS_NUM_THREADS);
417      |         ^~~~~~~~~~~~~~~~~~~~~~~~
418      |         omp_set_num_threads
419../../../fflas-ffpack/fflas/fflas_fger.inl: In function 'void FFLAS::fger(const FloatDomain&, size_t, size_t, Givaro::ZRing<float>::Element, Givaro::ZRing<float>::ConstElement_ptr, size_t, Givaro::ZRing<float>::ConstElement_ptr, size_t, Givaro::ZRing<float>::Element_ptr, size_t, FFLAS::MMHelper<Givaro::ZRing<float>, FFLAS::MMHelperAlgo::Classic, FFLAS::ModeCategories::DefaultTag>&)':
420../../../fflas-ffpack/fflas/fflas_fger.inl:211:9: error: 'openblas_set_num_threads' was not declared in this scope; did you mean 'omp_set_num_threads'?
421  211 |         openblas_set_num_threads(__FFLASFFPACK_OPENBLAS_NUM_THREADS);
422      |         ^~~~~~~~~~~~~~~~~~~~~~~~
423      |         omp_set_num_threads
424In file included from ../../../fflas-ffpack/fflas/fflas_ftrsm.inl:387,
425                 from ../../../fflas-ffpack/fflas/fflas.h:116,
426                 from fflas_L1_inst.C:32:
427../../../fflas-ffpack/fflas/fflas_ftrsm_src.inl: In member function 'void FFLAS::Protected::ftrsmLeftUpperNoTransNonUnit<double>::delayed(const Field&, size_t, size_t, typename Field::ConstElement_ptr, size_t, typename Field::Element_ptr, size_t, size_t, size_t, FFLAS::TRSMHelper<FFLAS::StructureHelper::Recursive, ParSeqTrait>&)':
428../../../fflas-ffpack/fflas/fflas_ftrsm_src.inl:277:13: error: there are no arguments to 'openblas_set_num_threads' that depend on a template parameter, so a declaration of 'openblas_set_num_threads' must be available [-fpermissive]
429  277 |             openblas_set_num_threads(__FFLASFFPACK_OPENBLAS_NUM_THREADS);
430      |             ^~~~~~~~~~~~~~~~~~~~~~~~
431In file included from ../../../fflas-ffpack/fflas/fflas_ftrsm.inl:399,
432                 from ../../../fflas-ffpack/fflas/fflas.h:116,
433                 from fflas_L1_inst.C:32:
434../../../fflas-ffpack/fflas/fflas_ftrsm_src.inl: In member function 'void FFLAS::Protected::ftrsmLeftUpperNoTransUnit<double>::delayed(const Field&, size_t, size_t, typename Field::ConstElement_ptr, size_t, typename Field::Element_ptr, size_t, size_t, size_t, FFLAS::TRSMHelper<FFLAS::StructureHelper::Recursive, ParSeqTrait>&)':
435../../../fflas-ffpack/fflas/fflas_ftrsm_src.inl:277:13: error: there are no arguments to 'openblas_set_num_threads' that depend on a template parameter, so a declaration of 'openblas_set_num_threads' must be available [-fpermissive]
436  277 |             openblas_set_num_threads(__FFLASFFPACK_OPENBLAS_NUM_THREADS);
437      |             ^~~~~~~~~~~~~~~~~~~~~~~~
438In file included from ../../../fflas-ffpack/fflas/fflas_ftrsm.inl:411,
439                 from ../../../fflas-ffpack/fflas/fflas.h:116,
440                 from fflas_L1_inst.C:32:
441../../../fflas-ffpack/fflas/fflas_ftrsm_src.inl: In member function 'void FFLAS::Protected::ftrsmLeftUpperTransNonUnit<double>::delayed(const Field&, size_t, size_t, typename Field::ConstElement_ptr, size_t, typename Field::Element_ptr, size_t, size_t, size_t, FFLAS::TRSMHelper<FFLAS::StructureHelper::Recursive, ParSeqTrait>&)':
442../../../fflas-ffpack/fflas/fflas_ftrsm_src.inl:277:13: error: there are no arguments to 'openblas_set_num_threads' that depend on a template parameter, so a declaration of 'openblas_set_num_threads' must be available [-fpermissive]
443  277 |             openblas_set_num_threads(__FFLASFFPACK_OPENBLAS_NUM_THREADS);
444      |             ^~~~~~~~~~~~~~~~~~~~~~~~
445In file included from ../../../fflas-ffpack/fflas/fflas_ftrsm.inl:423,
446                 from ../../../fflas-ffpack/fflas/fflas.h:116,
447                 from fflas_L1_inst.C:32:
448../../../fflas-ffpack/fflas/fflas_ftrsm_src.inl: In member function 'void FFLAS::Protected::ftrsmLeftUpperTransUnit<double>::delayed(const Field&, size_t, size_t, typename Field::ConstElement_ptr, size_t, typename Field::Element_ptr, size_t, size_t, size_t, FFLAS::TRSMHelper<FFLAS::StructureHelper::Recursive, ParSeqTrait>&)':
449../../../fflas-ffpack/fflas/fflas_ftrsm_src.inl:277:13: error: there are no arguments to 'openblas_set_num_threads' that depend on a template parameter, so a declaration of 'openblas_set_num_threads' must be available [-fpermissive]
450  277 |             openblas_set_num_threads(__FFLASFFPACK_OPENBLAS_NUM_THREADS);
451      |             ^~~~~~~~~~~~~~~~~~~~~~~~
452In file included from ../../../fflas-ffpack/fflas/fflas_ftrsm.inl:436,
453                 from ../../../fflas-ffpack/fflas/fflas.h:116,
454                 from fflas_L1_inst.C:32:
455../../../fflas-ffpack/fflas/fflas_ftrsm_src.inl: In member function 'void FFLAS::Protected::ftrsmLeftLowerNoTransNonUnit<double>::delayed(const Field&, size_t, size_t, typename Field::ConstElement_ptr, size_t, typename Field::Element_ptr, size_t, size_t, size_t, FFLAS::TRSMHelper<FFLAS::StructureHelper::Recursive, ParSeqTrait>&)':
456../../../fflas-ffpack/fflas/fflas_ftrsm_src.inl:277:13: error: there are no arguments to 'openblas_set_num_threads' that depend on a template parameter, so a declaration of 'openblas_set_num_threads' must be available [-fpermissive]
457  277 |             openblas_set_num_threads(__FFLASFFPACK_OPENBLAS_NUM_THREADS);
458      |             ^~~~~~~~~~~~~~~~~~~~~~~~
459In file included from ../../../fflas-ffpack/fflas/fflas_ftrsm.inl:448,
460                 from ../../../fflas-ffpack/fflas/fflas.h:116,
461                 from fflas_L1_inst.C:32:
462../../../fflas-ffpack/fflas/fflas_ftrsm_src.inl: In member function 'void FFLAS::Protected::ftrsmLeftLowerNoTransUnit<double>::delayed(const Field&, size_t, size_t, typename Field::ConstElement_ptr, size_t, typename Field::Element_ptr, size_t, size_t, size_t, FFLAS::TRSMHelper<FFLAS::StructureHelper::Recursive, ParSeqTrait>&)':
463../../../fflas-ffpack/fflas/fflas_ftrsm_src.inl:277:13: error: there are no arguments to 'openblas_set_num_threads' that depend on a template parameter, so a declaration of 'openblas_set_num_threads' must be available [-fpermissive]
464  277 |             openblas_set_num_threads(__FFLASFFPACK_OPENBLAS_NUM_THREADS);
465      |             ^~~~~~~~~~~~~~~~~~~~~~~~
466In file included from ../../../fflas-ffpack/fflas/fflas_ftrsm.inl:460,
467                 from ../../../fflas-ffpack/fflas/fflas.h:116,
468                 from fflas_L1_inst.C:32:
469../../../fflas-ffpack/fflas/fflas_ftrsm_src.inl: In member function 'void FFLAS::Protected::ftrsmLeftLowerTransNonUnit<double>::delayed(const Field&, size_t, size_t, typename Field::ConstElement_ptr, size_t, typename Field::Element_ptr, size_t, size_t, size_t, FFLAS::TRSMHelper<FFLAS::StructureHelper::Recursive, ParSeqTrait>&)':
470../../../fflas-ffpack/fflas/fflas_ftrsm_src.inl:277:13: error: there are no arguments to 'openblas_set_num_threads' that depend on a template parameter, so a declaration of 'openblas_set_num_threads' must be available [-fpermissive]
471  277 |             openblas_set_num_threads(__FFLASFFPACK_OPENBLAS_NUM_THREADS);
472      |             ^~~~~~~~~~~~~~~~~~~~~~~~
473In file included from ../../../fflas-ffpack/fflas/fflas_ftrsm.inl:472,
474                 from ../../../fflas-ffpack/fflas/fflas.h:116,
475                 from fflas_L1_inst.C:32:
476../../../fflas-ffpack/fflas/fflas_ftrsm_src.inl: In member function 'void FFLAS::Protected::ftrsmLeftLowerTransUnit<double>::delayed(const Field&, size_t, size_t, typename Field::ConstElement_ptr, size_t, typename Field::Element_ptr, size_t, size_t, size_t, FFLAS::TRSMHelper<FFLAS::StructureHelper::Recursive, ParSeqTrait>&)':
477../../../fflas-ffpack/fflas/fflas_ftrsm_src.inl:277:13: error: there are no arguments to 'openblas_set_num_threads' that depend on a template parameter, so a declaration of 'openblas_set_num_threads' must be available [-fpermissive]
478  277 |             openblas_set_num_threads(__FFLASFFPACK_OPENBLAS_NUM_THREADS);
479      |             ^~~~~~~~~~~~~~~~~~~~~~~~
480In file included from ../../../fflas-ffpack/fflas/fflas_ftrsm.inl:486,
481                 from ../../../fflas-ffpack/fflas/fflas.h:116,
482                 from fflas_L1_inst.C:32:
483../../../fflas-ffpack/fflas/fflas_ftrsm_src.inl: In member function 'void FFLAS::Protected::ftrsmRightUpperNoTransNonUnit<double>::delayed(const Field&, size_t, size_t, typename Field::ConstElement_ptr, size_t, typename Field::Element_ptr, size_t, size_t, size_t, FFLAS::TRSMHelper<FFLAS::StructureHelper::Recursive, ParSeqTrait>&)':
484../../../fflas-ffpack/fflas/fflas_ftrsm_src.inl:277:13: error: there are no arguments to 'openblas_set_num_threads' that depend on a template parameter, so a declaration of 'openblas_set_num_threads' must be available [-fpermissive]
485  277 |             openblas_set_num_threads(__FFLASFFPACK_OPENBLAS_NUM_THREADS);
486      |             ^~~~~~~~~~~~~~~~~~~~~~~~
487In file included from ../../../fflas-ffpack/fflas/fflas_ftrsm.inl:498,
488                 from ../../../fflas-ffpack/fflas/fflas.h:116,
489                 from fflas_L1_inst.C:32:
490../../../fflas-ffpack/fflas/fflas_ftrsm_src.inl: In member function 'void FFLAS::Protected::ftrsmRightUpperNoTransUnit<double>::delayed(const Field&, size_t, size_t, typename Field::ConstElement_ptr, size_t, typename Field::Element_ptr, size_t, size_t, size_t, FFLAS::TRSMHelper<FFLAS::StructureHelper::Recursive, ParSeqTrait>&)':
491../../../fflas-ffpack/fflas/fflas_ftrsm_src.inl:277:13: error: there are no arguments to 'openblas_set_num_threads' that depend on a template parameter, so a declaration of 'openblas_set_num_threads' must be available [-fpermissive]
492  277 |             openblas_set_num_threads(__FFLASFFPACK_OPENBLAS_NUM_THREADS);
493      |             ^~~~~~~~~~~~~~~~~~~~~~~~
494In file included from ../../../fflas-ffpack/fflas/fflas_ftrsm.inl:510,
495                 from ../../../fflas-ffpack/fflas/fflas.h:116,
496                 from fflas_L1_inst.C:32:
497../../../fflas-ffpack/fflas/fflas_ftrsm_src.inl: In member function 'void FFLAS::Protected::ftrsmRightUpperTransNonUnit<double>::delayed(const Field&, size_t, size_t, typename Field::ConstElement_ptr, size_t, typename Field::Element_ptr, size_t, size_t, size_t, FFLAS::TRSMHelper<FFLAS::StructureHelper::Recursive, ParSeqTrait>&)':
498../../../fflas-ffpack/fflas/fflas_ftrsm_src.inl:277:13: error: there are no arguments to 'openblas_set_num_threads' that depend on a template parameter, so a declaration of 'openblas_set_num_threads' must be available [-fpermissive]
499  277 |             openblas_set_num_threads(__FFLASFFPACK_OPENBLAS_NUM_THREADS);
500      |             ^~~~~~~~~~~~~~~~~~~~~~~~
501In file included from ../../../fflas-ffpack/fflas/fflas_ftrsm.inl:522,
502                 from ../../../fflas-ffpack/fflas/fflas.h:116,
503                 from fflas_L1_inst.C:32:
504../../../fflas-ffpack/fflas/fflas_ftrsm_src.inl: In member function 'void FFLAS::Protected::ftrsmRightUpperTransUnit<double>::delayed(const Field&, size_t, size_t, typename Field::ConstElement_ptr, size_t, typename Field::Element_ptr, size_t, size_t, size_t, FFLAS::TRSMHelper<FFLAS::StructureHelper::Recursive, ParSeqTrait>&)':
505../../../fflas-ffpack/fflas/fflas_ftrsm_src.inl:277:13: error: there are no arguments to 'openblas_set_num_threads' that depend on a template parameter, so a declaration of 'openblas_set_num_threads' must be available [-fpermissive]
506  277 |             openblas_set_num_threads(__FFLASFFPACK_OPENBLAS_NUM_THREADS);
507      |             ^~~~~~~~~~~~~~~~~~~~~~~~
508In file included from ../../../fflas-ffpack/fflas/fflas_ftrsm.inl:535,
509                 from ../../../fflas-ffpack/fflas/fflas.h:116,
510                 from fflas_L1_inst.C:32:
511../../../fflas-ffpack/fflas/fflas_ftrsm_src.inl: In member function 'void FFLAS::Protected::ftrsmRightLowerNoTransNonUnit<double>::delayed(const Field&, size_t, size_t, typename Field::ConstElement_ptr, size_t, typename Field::Element_ptr, size_t, size_t, size_t, FFLAS::TRSMHelper<FFLAS::StructureHelper::Recursive, ParSeqTrait>&)':
512../../../fflas-ffpack/fflas/fflas_ftrsm_src.inl:277:13: error: there are no arguments to 'openblas_set_num_threads' that depend on a template parameter, so a declaration of 'openblas_set_num_threads' must be available [-fpermissive]
513  277 |             openblas_set_num_threads(__FFLASFFPACK_OPENBLAS_NUM_THREADS);
514      |             ^~~~~~~~~~~~~~~~~~~~~~~~
515In file included from ../../../fflas-ffpack/fflas/fflas_ftrsm.inl:547,
516                 from ../../../fflas-ffpack/fflas/fflas.h:116,
517                 from fflas_L1_inst.C:32:
518../../../fflas-ffpack/fflas/fflas_ftrsm_src.inl: In member function 'void FFLAS::Protected::ftrsmRightLowerNoTransUnit<double>::delayed(const Field&, size_t, size_t, typename Field::ConstElement_ptr, size_t, typename Field::Element_ptr, size_t, size_t, size_t, FFLAS::TRSMHelper<FFLAS::StructureHelper::Recursive, ParSeqTrait>&)':
519../../../fflas-ffpack/fflas/fflas_ftrsm_src.inl:277:13: error: there are no arguments to 'openblas_set_num_threads' that depend on a template parameter, so a declaration of 'openblas_set_num_threads' must be available [-fpermissive]
520  277 |             openblas_set_num_threads(__FFLASFFPACK_OPENBLAS_NUM_THREADS);
521      |             ^~~~~~~~~~~~~~~~~~~~~~~~
522In file included from ../../../fflas-ffpack/fflas/fflas_ftrsm.inl:559,
523                 from ../../../fflas-ffpack/fflas/fflas.h:116,
524                 from fflas_L1_inst.C:32:
525../../../fflas-ffpack/fflas/fflas_ftrsm_src.inl: In member function 'void FFLAS::Protected::ftrsmRightLowerTransNonUnit<double>::delayed(const Field&, size_t, size_t, typename Field::ConstElement_ptr, size_t, typename Field::Element_ptr, size_t, size_t, size_t, FFLAS::TRSMHelper<FFLAS::StructureHelper::Recursive, ParSeqTrait>&)':
526../../../fflas-ffpack/fflas/fflas_ftrsm_src.inl:277:13: error: there are no arguments to 'openblas_set_num_threads' that depend on a template parameter, so a declaration of 'openblas_set_num_threads' must be available [-fpermissive]
527  277 |             openblas_set_num_threads(__FFLASFFPACK_OPENBLAS_NUM_THREADS);
528      |             ^~~~~~~~~~~~~~~~~~~~~~~~
529In file included from ../../../fflas-ffpack/fflas/fflas_ftrsm.inl:571,
530                 from ../../../fflas-ffpack/fflas/fflas.h:116,
531                 from fflas_L1_inst.C:32:
532../../../fflas-ffpack/fflas/fflas_ftrsm_src.inl: In member function 'void FFLAS::Protected::ftrsmRightLowerTransUnit<double>::delayed(const Field&, size_t, size_t, typename Field::ConstElement_ptr, size_t, typename Field::Element_ptr, size_t, size_t, size_t, FFLAS::TRSMHelper<FFLAS::StructureHelper::Recursive, ParSeqTrait>&)':
533../../../fflas-ffpack/fflas/fflas_ftrsm_src.inl:277:13: error: there are no arguments to 'openblas_set_num_threads' that depend on a template parameter, so a declaration of 'openblas_set_num_threads' must be available [-fpermissive]
534  277 |             openblas_set_num_threads(__FFLASFFPACK_OPENBLAS_NUM_THREADS);
535      |             ^~~~~~~~~~~~~~~~~~~~~~~~
536In file included from ../../../fflas-ffpack/fflas/fflas_ftrsm.inl:584,
537                 from ../../../fflas-ffpack/fflas/fflas.h:116,
538                 from fflas_L1_inst.C:32:
539../../../fflas-ffpack/fflas/fflas_ftrsm_src.inl: In member function 'void FFLAS::Protected::ftrsmLeftUpperNoTransNonUnit<float>::delayed(const Field&, size_t, size_t, typename Field::ConstElement_ptr, size_t, typename Field::Element_ptr, size_t, size_t, size_t, FFLAS::TRSMHelper<FFLAS::StructureHelper::Recursive, ParSeqTrait>&)':
540../../../fflas-ffpack/fflas/fflas_ftrsm_src.inl:277:13: error: there are no arguments to 'openblas_set_num_threads' that depend on a template parameter, so a declaration of 'openblas_set_num_threads' must be available [-fpermissive]
541  277 |             openblas_set_num_threads(__FFLASFFPACK_OPENBLAS_NUM_THREADS);
542      |             ^~~~~~~~~~~~~~~~~~~~~~~~
543In file included from ../../../fflas-ffpack/fflas/fflas_ftrsm.inl:596,
544                 from ../../../fflas-ffpack/fflas/fflas.h:116,
545                 from fflas_L1_inst.C:32:
546../../../fflas-ffpack/fflas/fflas_ftrsm_src.inl: In member function 'void FFLAS::Protected::ftrsmLeftUpperNoTransUnit<float>::delayed(const Field&, size_t, size_t, typename Field::ConstElement_ptr, size_t, typename Field::Element_ptr, size_t, size_t, size_t, FFLAS::TRSMHelper<FFLAS::StructureHelper::Recursive, ParSeqTrait>&)':
547../../../fflas-ffpack/fflas/fflas_ftrsm_src.inl:277:13: error: there are no arguments to 'openblas_set_num_threads' that depend on a template parameter, so a declaration of 'openblas_set_num_threads' must be available [-fpermissive]
548  277 |             openblas_set_num_threads(__FFLASFFPACK_OPENBLAS_NUM_THREADS);
549      |             ^~~~~~~~~~~~~~~~~~~~~~~~
550In file included from ../../../fflas-ffpack/fflas/fflas_ftrsm.inl:608,
551                 from ../../../fflas-ffpack/fflas/fflas.h:116,
552                 from fflas_L1_inst.C:32:
553../../../fflas-ffpack/fflas/fflas_ftrsm_src.inl: In member function 'void FFLAS::Protected::ftrsmLeftUpperTransNonUnit<float>::delayed(const Field&, size_t, size_t, typename Field::ConstElement_ptr, size_t, typename Field::Element_ptr, size_t, size_t, size_t, FFLAS::TRSMHelper<FFLAS::StructureHelper::Recursive, ParSeqTrait>&)':
554../../../fflas-ffpack/fflas/fflas_ftrsm_src.inl:277:13: error: there are no arguments to 'openblas_set_num_threads' that depend on a template parameter, so a declaration of 'openblas_set_num_threads' must be available [-fpermissive]
555  277 |             openblas_set_num_threads(__FFLASFFPACK_OPENBLAS_NUM_THREADS);
556      |             ^~~~~~~~~~~~~~~~~~~~~~~~
557In file included from ../../../fflas-ffpack/fflas/fflas_ftrsm.inl:620,
558                 from ../../../fflas-ffpack/fflas/fflas.h:116,
559                 from fflas_L1_inst.C:32:
560../../../fflas-ffpack/fflas/fflas_ftrsm_src.inl: In member function 'void FFLAS::Protected::ftrsmLeftUpperTransUnit<float>::delayed(const Field&, size_t, size_t, typename Field::ConstElement_ptr, size_t, typename Field::Element_ptr, size_t, size_t, size_t, FFLAS::TRSMHelper<FFLAS::StructureHelper::Recursive, ParSeqTrait>&)':
561../../../fflas-ffpack/fflas/fflas_ftrsm_src.inl:277:13: error: there are no arguments to 'openblas_set_num_threads' that depend on a template parameter, so a declaration of 'openblas_set_num_threads' must be available [-fpermissive]
562  277 |             openblas_set_num_threads(__FFLASFFPACK_OPENBLAS_NUM_THREADS);
563      |             ^~~~~~~~~~~~~~~~~~~~~~~~
564In file included from ../../../fflas-ffpack/fflas/fflas_ftrsm.inl:633,
565                 from ../../../fflas-ffpack/fflas/fflas.h:116,
566                 from fflas_L1_inst.C:32:
567../../../fflas-ffpack/fflas/fflas_ftrsm_src.inl: In member function 'void FFLAS::Protected::ftrsmLeftLowerNoTransNonUnit<float>::delayed(const Field&, size_t, size_t, typename Field::ConstElement_ptr, size_t, typename Field::Element_ptr, size_t, size_t, size_t, FFLAS::TRSMHelper<FFLAS::StructureHelper::Recursive, ParSeqTrait>&)':
568../../../fflas-ffpack/fflas/fflas_ftrsm_src.inl:277:13: error: there are no arguments to 'openblas_set_num_threads' that depend on a template parameter, so a declaration of 'openblas_set_num_threads' must be available [-fpermissive]
569  277 |             openblas_set_num_threads(__FFLASFFPACK_OPENBLAS_NUM_THREADS);
570      |             ^~~~~~~~~~~~~~~~~~~~~~~~
571In file included from ../../../fflas-ffpack/fflas/fflas_ftrsm.inl:645,
572                 from ../../../fflas-ffpack/fflas/fflas.h:116,
573                 from fflas_L1_inst.C:32:
574../../../fflas-ffpack/fflas/fflas_ftrsm_src.inl: In member function 'void FFLAS::Protected::ftrsmLeftLowerNoTransUnit<float>::delayed(const Field&, size_t, size_t, typename Field::ConstElement_ptr, size_t, typename Field::Element_ptr, size_t, size_t, size_t, FFLAS::TRSMHelper<FFLAS::StructureHelper::Recursive, ParSeqTrait>&)':
575../../../fflas-ffpack/fflas/fflas_ftrsm_src.inl:277:13: error: there are no arguments to 'openblas_set_num_threads' that depend on a template parameter, so a declaration of 'openblas_set_num_threads' must be available [-fpermissive]
576  277 |             openblas_set_num_threads(__FFLASFFPACK_OPENBLAS_NUM_THREADS);
577      |             ^~~~~~~~~~~~~~~~~~~~~~~~
578In file included from ../../../fflas-ffpack/fflas/fflas_ftrsm.inl:657,
579                 from ../../../fflas-ffpack/fflas/fflas.h:116,
580                 from fflas_L1_inst.C:32:
581../../../fflas-ffpack/fflas/fflas_ftrsm_src.inl: In member function 'void FFLAS::Protected::ftrsmLeftLowerTransNonUnit<float>::delayed(const Field&, size_t, size_t, typename Field::ConstElement_ptr, size_t, typename Field::Element_ptr, size_t, size_t, size_t, FFLAS::TRSMHelper<FFLAS::StructureHelper::Recursive, ParSeqTrait>&)':
582../../../fflas-ffpack/fflas/fflas_ftrsm_src.inl:277:13: error: there are no arguments to 'openblas_set_num_threads' that depend on a template parameter, so a declaration of 'openblas_set_num_threads' must be available [-fpermissive]
583  277 |             openblas_set_num_threads(__FFLASFFPACK_OPENBLAS_NUM_THREADS);
584      |             ^~~~~~~~~~~~~~~~~~~~~~~~
585In file included from ../../../fflas-ffpack/fflas/fflas_ftrsm.inl:669,
586                 from ../../../fflas-ffpack/fflas/fflas.h:116,
587                 from fflas_L1_inst.C:32:
588../../../fflas-ffpack/fflas/fflas_ftrsm_src.inl: In member function 'void FFLAS::Protected::ftrsmLeftLowerTransUnit<float>::delayed(const Field&, size_t, size_t, typename Field::ConstElement_ptr, size_t, typename Field::Element_ptr, size_t, size_t, size_t, FFLAS::TRSMHelper<FFLAS::StructureHelper::Recursive, ParSeqTrait>&)':
589../../../fflas-ffpack/fflas/fflas_ftrsm_src.inl:277:13: error: there are no arguments to 'openblas_set_num_threads' that depend on a template parameter, so a declaration of 'openblas_set_num_threads' must be available [-fpermissive]
590  277 |             openblas_set_num_threads(__FFLASFFPACK_OPENBLAS_NUM_THREADS);
591      |             ^~~~~~~~~~~~~~~~~~~~~~~~
592In file included from ../../../fflas-ffpack/fflas/fflas_ftrsm.inl:683,
593                 from ../../../fflas-ffpack/fflas/fflas.h:116,
594                 from fflas_L1_inst.C:32:
595../../../fflas-ffpack/fflas/fflas_ftrsm_src.inl: In member function 'void FFLAS::Protected::ftrsmRightUpperNoTransNonUnit<float>::delayed(const Field&, size_t, size_t, typename Field::ConstElement_ptr, size_t, typename Field::Element_ptr, size_t, size_t, size_t, FFLAS::TRSMHelper<FFLAS::StructureHelper::Recursive, ParSeqTrait>&)':
596../../../fflas-ffpack/fflas/fflas_ftrsm_src.inl:277:13: error: there are no arguments to 'openblas_set_num_threads' that depend on a template parameter, so a declaration of 'openblas_set_num_threads' must be available [-fpermissive]
597  277 |             openblas_set_num_threads(__FFLASFFPACK_OPENBLAS_NUM_THREADS);
598      |             ^~~~~~~~~~~~~~~~~~~~~~~~
599In file included from ../../../fflas-ffpack/fflas/fflas_ftrsm.inl:695,
600                 from ../../../fflas-ffpack/fflas/fflas.h:116,
601                 from fflas_L1_inst.C:32:
602../../../fflas-ffpack/fflas/fflas_ftrsm_src.inl: In member function 'void FFLAS::Protected::ftrsmRightUpperNoTransUnit<float>::delayed(const Field&, size_t, size_t, typename Field::ConstElement_ptr, size_t, typename Field::Element_ptr, size_t, size_t, size_t, FFLAS::TRSMHelper<FFLAS::StructureHelper::Recursive, ParSeqTrait>&)':
603../../../fflas-ffpack/fflas/fflas_ftrsm_src.inl:277:13: error: there are no arguments to 'openblas_set_num_threads' that depend on a template parameter, so a declaration of 'openblas_set_num_threads' must be available [-fpermissive]
604  277 |             openblas_set_num_threads(__FFLASFFPACK_OPENBLAS_NUM_THREADS);
605      |             ^~~~~~~~~~~~~~~~~~~~~~~~
606In file included from ../../../fflas-ffpack/fflas/fflas_ftrsm.inl:707,
607                 from ../../../fflas-ffpack/fflas/fflas.h:116,
608                 from fflas_L1_inst.C:32:
609../../../fflas-ffpack/fflas/fflas_ftrsm_src.inl: In member function 'void FFLAS::Protected::ftrsmRightUpperTransNonUnit<float>::delayed(const Field&, size_t, size_t, typename Field::ConstElement_ptr, size_t, typename Field::Element_ptr, size_t, size_t, size_t, FFLAS::TRSMHelper<FFLAS::StructureHelper::Recursive, ParSeqTrait>&)':
610../../../fflas-ffpack/fflas/fflas_ftrsm_src.inl:277:13: error: there are no arguments to 'openblas_set_num_threads' that depend on a template parameter, so a declaration of 'openblas_set_num_threads' must be available [-fpermissive]
611  277 |             openblas_set_num_threads(__FFLASFFPACK_OPENBLAS_NUM_THREADS);
612      |             ^~~~~~~~~~~~~~~~~~~~~~~~
613In file included from ../../../fflas-ffpack/fflas/fflas_ftrsm.inl:719,
614                 from ../../../fflas-ffpack/fflas/fflas.h:116,
615                 from fflas_L1_inst.C:32:
616../../../fflas-ffpack/fflas/fflas_ftrsm_src.inl: In member function 'void FFLAS::Protected::ftrsmRightUpperTransUnit<float>::delayed(const Field&, size_t, size_t, typename Field::ConstElement_ptr, size_t, typename Field::Element_ptr, size_t, size_t, size_t, FFLAS::TRSMHelper<FFLAS::StructureHelper::Recursive, ParSeqTrait>&)':
617../../../fflas-ffpack/fflas/fflas_ftrsm_src.inl:277:13: error: there are no arguments to 'openblas_set_num_threads' that depend on a template parameter, so a declaration of 'openblas_set_num_threads' must be available [-fpermissive]
618  277 |             openblas_set_num_threads(__FFLASFFPACK_OPENBLAS_NUM_THREADS);
619      |             ^~~~~~~~~~~~~~~~~~~~~~~~
620In file included from ../../../fflas-ffpack/fflas/fflas_ftrsm.inl:732,
621                 from ../../../fflas-ffpack/fflas/fflas.h:116,
622                 from fflas_L1_inst.C:32:
623../../../fflas-ffpack/fflas/fflas_ftrsm_src.inl: In member function 'void FFLAS::Protected::ftrsmRightLowerNoTransNonUnit<float>::delayed(const Field&, size_t, size_t, typename Field::ConstElement_ptr, size_t, typename Field::Element_ptr, size_t, size_t, size_t, FFLAS::TRSMHelper<FFLAS::StructureHelper::Recursive, ParSeqTrait>&)':
624../../../fflas-ffpack/fflas/fflas_ftrsm_src.inl:277:13: error: there are no arguments to 'openblas_set_num_threads' that depend on a template parameter, so a declaration of 'openblas_set_num_threads' must be available [-fpermissive]
625  277 |             openblas_set_num_threads(__FFLASFFPACK_OPENBLAS_NUM_THREADS);
626      |             ^~~~~~~~~~~~~~~~~~~~~~~~
627In file included from ../../../fflas-ffpack/fflas/fflas_ftrsm.inl:744,
628                 from ../../../fflas-ffpack/fflas/fflas.h:116,
629                 from fflas_L1_inst.C:32:
630../../../fflas-ffpack/fflas/fflas_ftrsm_src.inl: In member function 'void FFLAS::Protected::ftrsmRightLowerNoTransUnit<float>::delayed(const Field&, size_t, size_t, typename Field::ConstElement_ptr, size_t, typename Field::Element_ptr, size_t, size_t, size_t, FFLAS::TRSMHelper<FFLAS::StructureHelper::Recursive, ParSeqTrait>&)':
631../../../fflas-ffpack/fflas/fflas_ftrsm_src.inl:277:13: error: there are no arguments to 'openblas_set_num_threads' that depend on a template parameter, so a declaration of 'openblas_set_num_threads' must be available [-fpermissive]
632  277 |             openblas_set_num_threads(__FFLASFFPACK_OPENBLAS_NUM_THREADS);
633      |             ^~~~~~~~~~~~~~~~~~~~~~~~
634In file included from ../../../fflas-ffpack/fflas/fflas_ftrsm.inl:756,
635                 from ../../../fflas-ffpack/fflas/fflas.h:116,
636                 from fflas_L1_inst.C:32:
637../../../fflas-ffpack/fflas/fflas_ftrsm_src.inl: In member function 'void FFLAS::Protected::ftrsmRightLowerTransNonUnit<float>::delayed(const Field&, size_t, size_t, typename Field::ConstElement_ptr, size_t, typename Field::Element_ptr, size_t, size_t, size_t, FFLAS::TRSMHelper<FFLAS::StructureHelper::Recursive, ParSeqTrait>&)':
638../../../fflas-ffpack/fflas/fflas_ftrsm_src.inl:277:13: error: there are no arguments to 'openblas_set_num_threads' that depend on a template parameter, so a declaration of 'openblas_set_num_threads' must be available [-fpermissive]
639  277 |             openblas_set_num_threads(__FFLASFFPACK_OPENBLAS_NUM_THREADS);
640      |             ^~~~~~~~~~~~~~~~~~~~~~~~
641In file included from ../../../fflas-ffpack/fflas/fflas_ftrsm.inl:768,
642                 from ../../../fflas-ffpack/fflas/fflas.h:116,
643                 from fflas_L1_inst.C:32:
644../../../fflas-ffpack/fflas/fflas_ftrsm_src.inl: In member function 'void FFLAS::Protected::ftrsmRightLowerTransUnit<float>::delayed(const Field&, size_t, size_t, typename Field::ConstElement_ptr, size_t, typename Field::Element_ptr, size_t, size_t, size_t, FFLAS::TRSMHelper<FFLAS::StructureHelper::Recursive, ParSeqTrait>&)':
645../../../fflas-ffpack/fflas/fflas_ftrsm_src.inl:277:13: error: there are no arguments to 'openblas_set_num_threads' that depend on a template parameter, so a declaration of 'openblas_set_num_threads' must be available [-fpermissive]
646  277 |             openblas_set_num_threads(__FFLASFFPACK_OPENBLAS_NUM_THREADS);
647      |             ^~~~~~~~~~~~~~~~~~~~~~~~
648In file included from ../../../fflas-ffpack/fflas/fflas_ftrmm.inl:390,
649                 from ../../../fflas-ffpack/fflas/fflas.h:118,
650                 from fflas_L1_inst.C:32:
651../../../fflas-ffpack/fflas/fflas_ftrmm_src.inl: In member function 'void FFLAS::Protected::ftrmmLeftUpperNoTransNonUnit<double>::delayed(const Field&, size_t, size_t, typename Field::ConstElement_ptr, size_t, typename Field::Element_ptr, size_t)':
652../../../fflas-ffpack/fflas/fflas_ftrmm_src.inl:193:9: error: there are no arguments to 'openblas_set_num_threads' that depend on a template parameter, so a declaration of 'openblas_set_num_threads' must be available [-fpermissive]
653  193 |         openblas_set_num_threads(__FFLASFFPACK_OPENBLAS_NUM_THREADS);
654      |         ^~~~~~~~~~~~~~~~~~~~~~~~
655../../../fflas-ffpack/fflas/fflas_ftrmm_src.inl: In member function 'void FFLAS::Protected::ftrmmLeftUpperNoTransNonUnit<double>::delayed(const Field&, size_t, size_t, typename Field::ConstElement_ptr, size_t, typename Field::ConstElement_ptr, size_t, typename Field::Element, typename Field::Element_ptr, size_t)':
656../../../fflas-ffpack/fflas/fflas_ftrmm_src.inl:213:9: error: there are no arguments to 'openblas_set_num_threads' that depend on a template parameter, so a declaration of 'openblas_set_num_threads' must be available [-fpermissive]
657  213 |         openblas_set_num_threads(__FFLASFFPACK_OPENBLAS_NUM_THREADS);
658      |         ^~~~~~~~~~~~~~~~~~~~~~~~
659In file included from ../../../fflas-ffpack/fflas/fflas_ftrmm.inl:402,
660                 from ../../../fflas-ffpack/fflas/fflas.h:118,
661                 from fflas_L1_inst.C:32:
662../../../fflas-ffpack/fflas/fflas_ftrmm_src.inl: In member function 'void FFLAS::Protected::ftrmmLeftUpperNoTransUnit<double>::delayed(const Field&, size_t, size_t, typename Field::ConstElement_ptr, size_t, typename Field::Element_ptr, size_t)':
663../../../fflas-ffpack/fflas/fflas_ftrmm_src.inl:193:9: error: there are no arguments to 'openblas_set_num_threads' that depend on a template parameter, so a declaration of 'openblas_set_num_threads' must be available [-fpermissive]
664  193 |         openblas_set_num_threads(__FFLASFFPACK_OPENBLAS_NUM_THREADS);
665      |         ^~~~~~~~~~~~~~~~~~~~~~~~
666../../../fflas-ffpack/fflas/fflas_ftrmm_src.inl: In member function 'void FFLAS::Protected::ftrmmLeftUpperNoTransUnit<double>::delayed(const Field&, size_t, size_t, typename Field::ConstElement_ptr, size_t, typename Field::ConstElement_ptr, size_t, typename Field::Element, typename Field::Element_ptr, size_t)':
667../../../fflas-ffpack/fflas/fflas_ftrmm_src.inl:213:9: error: there are no arguments to 'openblas_set_num_threads' that depend on a template parameter, so a declaration of 'openblas_set_num_threads' must be available [-fpermissive]
668  213 |         openblas_set_num_threads(__FFLASFFPACK_OPENBLAS_NUM_THREADS);
669      |         ^~~~~~~~~~~~~~~~~~~~~~~~
670In file included from ../../../fflas-ffpack/fflas/fflas_ftrmm.inl:414,
671                 from ../../../fflas-ffpack/fflas/fflas.h:118,
672                 from fflas_L1_inst.C:32:
673../../../fflas-ffpack/fflas/fflas_ftrmm_src.inl: In member function 'void FFLAS::Protected::ftrmmLeftUpperTransNonUnit<double>::delayed(const Field&, size_t, size_t, typename Field::ConstElement_ptr, size_t, typename Field::Element_ptr, size_t)':
674../../../fflas-ffpack/fflas/fflas_ftrmm_src.inl:193:9: error: there are no arguments to 'openblas_set_num_threads' that depend on a template parameter, so a declaration of 'openblas_set_num_threads' must be available [-fpermissive]
675  193 |         openblas_set_num_threads(__FFLASFFPACK_OPENBLAS_NUM_THREADS);
676      |         ^~~~~~~~~~~~~~~~~~~~~~~~
677../../../fflas-ffpack/fflas/fflas_ftrmm_src.inl: In member function 'void FFLAS::Protected::ftrmmLeftUpperTransNonUnit<double>::delayed(const Field&, size_t, size_t, typename Field::ConstElement_ptr, size_t, typename Field::ConstElement_ptr, size_t, typename Field::Element, typename Field::Element_ptr, size_t)':
678../../../fflas-ffpack/fflas/fflas_ftrmm_src.inl:213:9: error: there are no arguments to 'openblas_set_num_threads' that depend on a template parameter, so a declaration of 'openblas_set_num_threads' must be available [-fpermissive]
679  213 |         openblas_set_num_threads(__FFLASFFPACK_OPENBLAS_NUM_THREADS);
680      |         ^~~~~~~~~~~~~~~~~~~~~~~~
681In file included from ../../../fflas-ffpack/fflas/fflas_ftrmm.inl:426,
682                 from ../../../fflas-ffpack/fflas/fflas.h:118,
683                 from fflas_L1_inst.C:32:
684../../../fflas-ffpack/fflas/fflas_ftrmm_src.inl: In member function 'void FFLAS::Protected::ftrmmLeftUpperTransUnit<double>::delayed(const Field&, size_t, size_t, typename Field::ConstElement_ptr, size_t, typename Field::Element_ptr, size_t)':
685../../../fflas-ffpack/fflas/fflas_ftrmm_src.inl:193:9: error: there are no arguments to 'openblas_set_num_threads' that depend on a template parameter, so a declaration of 'openblas_set_num_threads' must be available [-fpermissive]
686  193 |         openblas_set_num_threads(__FFLASFFPACK_OPENBLAS_NUM_THREADS);
687      |         ^~~~~~~~~~~~~~~~~~~~~~~~
688../../../fflas-ffpack/fflas/fflas_ftrmm_src.inl: In member function 'void FFLAS::Protected::ftrmmLeftUpperTransUnit<double>::delayed(const Field&, size_t, size_t, typename Field::ConstElement_ptr, size_t, typename Field::ConstElement_ptr, size_t, typename Field::Element, typename Field::Element_ptr, size_t)':
689../../../fflas-ffpack/fflas/fflas_ftrmm_src.inl:213:9: error: there are no arguments to 'openblas_set_num_threads' that depend on a template parameter, so a declaration of 'openblas_set_num_threads' must be available [-fpermissive]
690  213 |         openblas_set_num_threads(__FFLASFFPACK_OPENBLAS_NUM_THREADS);
691      |         ^~~~~~~~~~~~~~~~~~~~~~~~
692In file included from ../../../fflas-ffpack/fflas/fflas_ftrmm.inl:439,
693                 from ../../../fflas-ffpack/fflas/fflas.h:118,
694                 from fflas_L1_inst.C:32:
695../../../fflas-ffpack/fflas/fflas_ftrmm_src.inl: In member function 'void FFLAS::Protected::ftrmmLeftLowerNoTransNonUnit<double>::delayed(const Field&, size_t, size_t, typename Field::ConstElement_ptr, size_t, typename Field::Element_ptr, size_t)':
696../../../fflas-ffpack/fflas/fflas_ftrmm_src.inl:193:9: error: there are no arguments to 'openblas_set_num_threads' that depend on a template parameter, so a declaration of 'openblas_set_num_threads' must be available [-fpermissive]
697  193 |         openblas_set_num_threads(__FFLASFFPACK_OPENBLAS_NUM_THREADS);
698      |         ^~~~~~~~~~~~~~~~~~~~~~~~
699../../../fflas-ffpack/fflas/fflas_ftrmm_src.inl: In member function 'void FFLAS::Protected::ftrmmLeftLowerNoTransNonUnit<double>::delayed(const Field&, size_t, size_t, typename Field::ConstElement_ptr, size_t, typename Field::ConstElement_ptr, size_t, typename Field::Element, typename Field::Element_ptr, size_t)':
700../../../fflas-ffpack/fflas/fflas_ftrmm_src.inl:213:9: error: there are no arguments to 'openblas_set_num_threads' that depend on a template parameter, so a declaration of 'openblas_set_num_threads' must be available [-fpermissive]
701  213 |         openblas_set_num_threads(__FFLASFFPACK_OPENBLAS_NUM_THREADS);
702      |         ^~~~~~~~~~~~~~~~~~~~~~~~
703In file included from ../../../fflas-ffpack/fflas/fflas_ftrmm.inl:451,
704                 from ../../../fflas-ffpack/fflas/fflas.h:118,
705                 from fflas_L1_inst.C:32:
706../../../fflas-ffpack/fflas/fflas_ftrmm_src.inl: In member function 'void FFLAS::Protected::ftrmmLeftLowerNoTransUnit<double>::delayed(const Field&, size_t, size_t, typename Field::ConstElement_ptr, size_t, typename Field::Element_ptr, size_t)':
707../../../fflas-ffpack/fflas/fflas_ftrmm_src.inl:193:9: error: there are no arguments to 'openblas_set_num_threads' that depend on a template parameter, so a declaration of 'openblas_set_num_threads' must be available [-fpermissive]
708  193 |         openblas_set_num_threads(__FFLASFFPACK_OPENBLAS_NUM_THREADS);
709      |         ^~~~~~~~~~~~~~~~~~~~~~~~
710../../../fflas-ffpack/fflas/fflas_ftrmm_src.inl: In member function 'void FFLAS::Protected::ftrmmLeftLowerNoTransUnit<double>::delayed(const Field&, size_t, size_t, typename Field::ConstElement_ptr, size_t, typename Field::ConstElement_ptr, size_t, typename Field::Element, typename Field::Element_ptr, size_t)':
711../../../fflas-ffpack/fflas/fflas_ftrmm_src.inl:213:9: error: there are no arguments to 'openblas_set_num_threads' that depend on a template parameter, so a declaration of 'openblas_set_num_threads' must be available [-fpermissive]
712  213 |         openblas_set_num_threads(__FFLASFFPACK_OPENBLAS_NUM_THREADS);
713      |         ^~~~~~~~~~~~~~~~~~~~~~~~
714In file included from ../../../fflas-ffpack/fflas/fflas_ftrmm.inl:463,
715                 from ../../../fflas-ffpack/fflas/fflas.h:118,
716                 from fflas_L1_inst.C:32:
717../../../fflas-ffpack/fflas/fflas_ftrmm_src.inl: In member function 'void FFLAS::Protected::ftrmmLeftLowerTransNonUnit<double>::delayed(const Field&, size_t, size_t, typename Field::ConstElement_ptr, size_t, typename Field::Element_ptr, size_t)':
718../../../fflas-ffpack/fflas/fflas_ftrmm_src.inl:193:9: error: there are no arguments to 'openblas_set_num_threads' that depend on a template parameter, so a declaration of 'openblas_set_num_threads' must be available [-fpermissive]
719  193 |         openblas_set_num_threads(__FFLASFFPACK_OPENBLAS_NUM_THREADS);
720      |         ^~~~~~~~~~~~~~~~~~~~~~~~
721../../../fflas-ffpack/fflas/fflas_ftrmm_src.inl: In member function 'void FFLAS::Protected::ftrmmLeftLowerTransNonUnit<double>::delayed(const Field&, size_t, size_t, typename Field::ConstElement_ptr, size_t, typename Field::ConstElement_ptr, size_t, typename Field::Element, typename Field::Element_ptr, size_t)':
722../../../fflas-ffpack/fflas/fflas_ftrmm_src.inl:213:9: error: there are no arguments to 'openblas_set_num_threads' that depend on a template parameter, so a declaration of 'openblas_set_num_threads' must be available [-fpermissive]
723  213 |         openblas_set_num_threads(__FFLASFFPACK_OPENBLAS_NUM_THREADS);
724      |         ^~~~~~~~~~~~~~~~~~~~~~~~
725In file included from ../../../fflas-ffpack/fflas/fflas_ftrmm.inl:475,
726                 from ../../../fflas-ffpack/fflas/fflas.h:118,
727                 from fflas_L1_inst.C:32:
728../../../fflas-ffpack/fflas/fflas_ftrmm_src.inl: In member function 'void FFLAS::Protected::ftrmmLeftLowerTransUnit<double>::delayed(const Field&, size_t, size_t, typename Field::ConstElement_ptr, size_t, typename Field::Element_ptr, size_t)':
729../../../fflas-ffpack/fflas/fflas_ftrmm_src.inl:193:9: error: there are no arguments to 'openblas_set_num_threads' that depend on a template parameter, so a declaration of 'openblas_set_num_threads' must be available [-fpermissive]
730  193 |         openblas_set_num_threads(__FFLASFFPACK_OPENBLAS_NUM_THREADS);
731      |         ^~~~~~~~~~~~~~~~~~~~~~~~
732../../../fflas-ffpack/fflas/fflas_ftrmm_src.inl: In member function 'void FFLAS::Protected::ftrmmLeftLowerTransUnit<double>::delayed(const Field&, size_t, size_t, typename Field::ConstElement_ptr, size_t, typename Field::ConstElement_ptr, size_t, typename Field::Element, typename Field::Element_ptr, size_t)':
733../../../fflas-ffpack/fflas/fflas_ftrmm_src.inl:213:9: error: there are no arguments to 'openblas_set_num_threads' that depend on a template parameter, so a declaration of 'openblas_set_num_threads' must be available [-fpermissive]
734  213 |         openblas_set_num_threads(__FFLASFFPACK_OPENBLAS_NUM_THREADS);
735      |         ^~~~~~~~~~~~~~~~~~~~~~~~
736In file included from ../../../fflas-ffpack/fflas/fflas_ftrmm.inl:489,
737                 from ../../../fflas-ffpack/fflas/fflas.h:118,
738                 from fflas_L1_inst.C:32:
739../../../fflas-ffpack/fflas/fflas_ftrmm_src.inl: In member function 'void FFLAS::Protected::ftrmmRightUpperNoTransNonUnit<double>::delayed(const Field&, size_t, size_t, typename Field::ConstElement_ptr, size_t, typename Field::Element_ptr, size_t)':
740../../../fflas-ffpack/fflas/fflas_ftrmm_src.inl:193:9: error: there are no arguments to 'openblas_set_num_threads' that depend on a template parameter, so a declaration of 'openblas_set_num_threads' must be available [-fpermissive]
741  193 |         openblas_set_num_threads(__FFLASFFPACK_OPENBLAS_NUM_THREADS);
742      |         ^~~~~~~~~~~~~~~~~~~~~~~~
743../../../fflas-ffpack/fflas/fflas_ftrmm_src.inl: In member function 'void FFLAS::Protected::ftrmmRightUpperNoTransNonUnit<double>::delayed(const Field&, size_t, size_t, typename Field::ConstElement_ptr, size_t, typename Field::ConstElement_ptr, size_t, typename Field::Element, typename Field::Element_ptr, size_t)':
744../../../fflas-ffpack/fflas/fflas_ftrmm_src.inl:213:9: error: there are no arguments to 'openblas_set_num_threads' that depend on a template parameter, so a declaration of 'openblas_set_num_threads' must be available [-fpermissive]
745  213 |         openblas_set_num_threads(__FFLASFFPACK_OPENBLAS_NUM_THREADS);
746      |         ^~~~~~~~~~~~~~~~~~~~~~~~
747In file included from ../../../fflas-ffpack/fflas/fflas_ftrmm.inl:501,
748                 from ../../../fflas-ffpack/fflas/fflas.h:118,
749                 from fflas_L1_inst.C:32:
750../../../fflas-ffpack/fflas/fflas_ftrmm_src.inl: In member function 'void FFLAS::Protected::ftrmmRightUpperNoTransUnit<double>::delayed(const Field&, size_t, size_t, typename Field::ConstElement_ptr, size_t, typename Field::Element_ptr, size_t)':
751../../../fflas-ffpack/fflas/fflas_ftrmm_src.inl:193:9: error: there are no arguments to 'openblas_set_num_threads' that depend on a template parameter, so a declaration of 'openblas_set_num_threads' must be available [-fpermissive]
752  193 |         openblas_set_num_threads(__FFLASFFPACK_OPENBLAS_NUM_THREADS);
753      |         ^~~~~~~~~~~~~~~~~~~~~~~~
754../../../fflas-ffpack/fflas/fflas_ftrmm_src.inl: In member function 'void FFLAS::Protected::ftrmmRightUpperNoTransUnit<double>::delayed(const Field&, size_t, size_t, typename Field::ConstElement_ptr, size_t, typename Field::ConstElement_ptr, size_t, typename Field::Element, typename Field::Element_ptr, size_t)':
755../../../fflas-ffpack/fflas/fflas_ftrmm_src.inl:213:9: error: there are no arguments to 'openblas_set_num_threads' that depend on a template parameter, so a declaration of 'openblas_set_num_threads' must be available [-fpermissive]
756  213 |         openblas_set_num_threads(__FFLASFFPACK_OPENBLAS_NUM_THREADS);
757      |         ^~~~~~~~~~~~~~~~~~~~~~~~
758In file included from ../../../fflas-ffpack/fflas/fflas_ftrmm.inl:513,
759                 from ../../../fflas-ffpack/fflas/fflas.h:118,
760                 from fflas_L1_inst.C:32:
761../../../fflas-ffpack/fflas/fflas_ftrmm_src.inl: In member function 'void FFLAS::Protected::ftrmmRightUpperTransNonUnit<double>::delayed(const Field&, size_t, size_t, typename Field::ConstElement_ptr, size_t, typename Field::Element_ptr, size_t)':
762../../../fflas-ffpack/fflas/fflas_ftrmm_src.inl:193:9: error: there are no arguments to 'openblas_set_num_threads' that depend on a template parameter, so a declaration of 'openblas_set_num_threads' must be available [-fpermissive]
763  193 |         openblas_set_num_threads(__FFLASFFPACK_OPENBLAS_NUM_THREADS);
764      |         ^~~~~~~~~~~~~~~~~~~~~~~~
765../../../fflas-ffpack/fflas/fflas_ftrmm_src.inl: In member function 'void FFLAS::Protected::ftrmmRightUpperTransNonUnit<double>::delayed(const Field&, size_t, size_t, typename Field::ConstElement_ptr, size_t, typename Field::ConstElement_ptr, size_t, typename Field::Element, typename Field::Element_ptr, size_t)':
766../../../fflas-ffpack/fflas/fflas_ftrmm_src.inl:213:9: error: there are no arguments to 'openblas_set_num_threads' that depend on a template parameter, so a declaration of 'openblas_set_num_threads' must be available [-fpermissive]
767  213 |         openblas_set_num_threads(__FFLASFFPACK_OPENBLAS_NUM_THREADS);
768      |         ^~~~~~~~~~~~~~~~~~~~~~~~
769In file included from ../../../fflas-ffpack/fflas/fflas_ftrmm.inl:525,
770                 from ../../../fflas-ffpack/fflas/fflas.h:118,
771                 from fflas_L1_inst.C:32:
772../../../fflas-ffpack/fflas/fflas_ftrmm_src.inl: In member function 'void FFLAS::Protected::ftrmmRightUpperTransUnit<double>::delayed(const Field&, size_t, size_t, typename Field::ConstElement_ptr, size_t, typename Field::Element_ptr, size_t)':
773../../../fflas-ffpack/fflas/fflas_ftrmm_src.inl:193:9: error: there are no arguments to 'openblas_set_num_threads' that depend on a template parameter, so a declaration of 'openblas_set_num_threads' must be available [-fpermissive]
774  193 |         openblas_set_num_threads(__FFLASFFPACK_OPENBLAS_NUM_THREADS);
775      |         ^~~~~~~~~~~~~~~~~~~~~~~~
776../../../fflas-ffpack/fflas/fflas_ftrmm_src.inl: In member function 'void FFLAS::Protected::ftrmmRightUpperTransUnit<double>::delayed(const Field&, size_t, size_t, typename Field::ConstElement_ptr, size_t, typename Field::ConstElement_ptr, size_t, typename Field::Element, typename Field::Element_ptr, size_t)':
777../../../fflas-ffpack/fflas/fflas_ftrmm_src.inl:213:9: error: there are no arguments to 'openblas_set_num_threads' that depend on a template parameter, so a declaration of 'openblas_set_num_threads' must be available [-fpermissive]
778  213 |         openblas_set_num_threads(__FFLASFFPACK_OPENBLAS_NUM_THREADS);
779      |         ^~~~~~~~~~~~~~~~~~~~~~~~
780In file included from ../../../fflas-ffpack/fflas/fflas_ftrmm.inl:538,
781                 from ../../../fflas-ffpack/fflas/fflas.h:118,
782                 from fflas_L1_inst.C:32:
783../../../fflas-ffpack/fflas/fflas_ftrmm_src.inl: In member function 'void FFLAS::Protected::ftrmmRightLowerNoTransNonUnit<double>::delayed(const Field&, size_t, size_t, typename Field::ConstElement_ptr, size_t, typename Field::Element_ptr, size_t)':
784../../../fflas-ffpack/fflas/fflas_ftrmm_src.inl:193:9: error: there are no arguments to 'openblas_set_num_threads' that depend on a template parameter, so a declaration of 'openblas_set_num_threads' must be available [-fpermissive]
785  193 |         openblas_set_num_threads(__FFLASFFPACK_OPENBLAS_NUM_THREADS);
786      |         ^~~~~~~~~~~~~~~~~~~~~~~~
787../../../fflas-ffpack/fflas/fflas_ftrmm_src.inl: In member function 'void FFLAS::Protected::ftrmmRightLowerNoTransNonUnit<double>::delayed(const Field&, size_t, size_t, typename Field::ConstElement_ptr, size_t, typename Field::ConstElement_ptr, size_t, typename Field::Element, typename Field::Element_ptr, size_t)':
788../../../fflas-ffpack/fflas/fflas_ftrmm_src.inl:213:9: error: there are no arguments to 'openblas_set_num_threads' that depend on a template parameter, so a declaration of 'openblas_set_num_threads' must be available [-fpermissive]
789  213 |         openblas_set_num_threads(__FFLASFFPACK_OPENBLAS_NUM_THREADS);
790      |         ^~~~~~~~~~~~~~~~~~~~~~~~
791In file included from ../../../fflas-ffpack/fflas/fflas_ftrmm.inl:550,
792                 from ../../../fflas-ffpack/fflas/fflas.h:118,
793                 from fflas_L1_inst.C:32:
794../../../fflas-ffpack/fflas/fflas_ftrmm_src.inl: In member function 'void FFLAS::Protected::ftrmmRightLowerNoTransUnit<double>::delayed(const Field&, size_t, size_t, typename Field::ConstElement_ptr, size_t, typename Field::Element_ptr, size_t)':
795../../../fflas-ffpack/fflas/fflas_ftrmm_src.inl:193:9: error: there are no arguments to 'openblas_set_num_threads' that depend on a template parameter, so a declaration of 'openblas_set_num_threads' must be available [-fpermissive]
796  193 |         openblas_set_num_threads(__FFLASFFPACK_OPENBLAS_NUM_THREADS);
797      |         ^~~~~~~~~~~~~~~~~~~~~~~~
798../../../fflas-ffpack/fflas/fflas_ftrmm_src.inl: In member function 'void FFLAS::Protected::ftrmmRightLowerNoTransUnit<double>::delayed(const Field&, size_t, size_t, typename Field::ConstElement_ptr, size_t, typename Field::ConstElement_ptr, size_t, typename Field::Element, typename Field::Element_ptr, size_t)':
799../../../fflas-ffpack/fflas/fflas_ftrmm_src.inl:213:9: error: there are no arguments to 'openblas_set_num_threads' that depend on a template parameter, so a declaration of 'openblas_set_num_threads' must be available [-fpermissive]
800  213 |         openblas_set_num_threads(__FFLASFFPACK_OPENBLAS_NUM_THREADS);
801      |         ^~~~~~~~~~~~~~~~~~~~~~~~
802In file included from ../../../fflas-ffpack/fflas/fflas_ftrmm.inl:562,
803                 from ../../../fflas-ffpack/fflas/fflas.h:118,
804                 from fflas_L1_inst.C:32:
805../../../fflas-ffpack/fflas/fflas_ftrmm_src.inl: In member function 'void FFLAS::Protected::ftrmmRightLowerTransNonUnit<double>::delayed(const Field&, size_t, size_t, typename Field::ConstElement_ptr, size_t, typename Field::Element_ptr, size_t)':
806../../../fflas-ffpack/fflas/fflas_ftrmm_src.inl:193:9: error: there are no arguments to 'openblas_set_num_threads' that depend on a template parameter, so a declaration of 'openblas_set_num_threads' must be available [-fpermissive]
807  193 |         openblas_set_num_threads(__FFLASFFPACK_OPENBLAS_NUM_THREADS);
808      |         ^~~~~~~~~~~~~~~~~~~~~~~~
809../../../fflas-ffpack/fflas/fflas_ftrmm_src.inl: In member function 'void FFLAS::Protected::ftrmmRightLowerTransNonUnit<double>::delayed(const Field&, size_t, size_t, typename Field::ConstElement_ptr, size_t, typename Field::ConstElement_ptr, size_t, typename Field::Element, typename Field::Element_ptr, size_t)':
810../../../fflas-ffpack/fflas/fflas_ftrmm_src.inl:213:9: error: there are no arguments to 'openblas_set_num_threads' that depend on a template parameter, so a declaration of 'openblas_set_num_threads' must be available [-fpermissive]
811  213 |         openblas_set_num_threads(__FFLASFFPACK_OPENBLAS_NUM_THREADS);
812      |         ^~~~~~~~~~~~~~~~~~~~~~~~
813In file included from ../../../fflas-ffpack/fflas/fflas_ftrmm.inl:574,
814                 from ../../../fflas-ffpack/fflas/fflas.h:118,
815                 from fflas_L1_inst.C:32:
816../../../fflas-ffpack/fflas/fflas_ftrmm_src.inl: In member function 'void FFLAS::Protected::ftrmmRightLowerTransUnit<double>::delayed(const Field&, size_t, size_t, typename Field::ConstElement_ptr, size_t, typename Field::Element_ptr, size_t)':
817../../../fflas-ffpack/fflas/fflas_ftrmm_src.inl:193:9: error: there are no arguments to 'openblas_set_num_threads' that depend on a template parameter, so a declaration of 'openblas_set_num_threads' must be available [-fpermissive]
818  193 |         openblas_set_num_threads(__FFLASFFPACK_OPENBLAS_NUM_THREADS);
819      |         ^~~~~~~~~~~~~~~~~~~~~~~~
820../../../fflas-ffpack/fflas/fflas_ftrmm_src.inl: In member function 'void FFLAS::Protected::ftrmmRightLowerTransUnit<double>::delayed(const Field&, size_t, size_t, typename Field::ConstElement_ptr, size_t, typename Field::ConstElement_ptr, size_t, typename Field::Element, typename Field::Element_ptr, size_t)':
821../../../fflas-ffpack/fflas/fflas_ftrmm_src.inl:213:9: error: there are no arguments to 'openblas_set_num_threads' that depend on a template parameter, so a declaration of 'openblas_set_num_threads' must be available [-fpermissive]
822  213 |         openblas_set_num_threads(__FFLASFFPACK_OPENBLAS_NUM_THREADS);
823      |         ^~~~~~~~~~~~~~~~~~~~~~~~
824In file included from ../../../fflas-ffpack/fflas/fflas_ftrmm.inl:587,
825                 from ../../../fflas-ffpack/fflas/fflas.h:118,
826                 from fflas_L1_inst.C:32:
827../../../fflas-ffpack/fflas/fflas_ftrmm_src.inl: In member function 'void FFLAS::Protected::ftrmmLeftUpperNoTransNonUnit<float>::delayed(const Field&, size_t, size_t, typename Field::ConstElement_ptr, size_t, typename Field::Element_ptr, size_t)':
828../../../fflas-ffpack/fflas/fflas_ftrmm_src.inl:193:9: error: there are no arguments to 'openblas_set_num_threads' that depend on a template parameter, so a declaration of 'openblas_set_num_threads' must be available [-fpermissive]
829  193 |         openblas_set_num_threads(__FFLASFFPACK_OPENBLAS_NUM_THREADS);
830      |         ^~~~~~~~~~~~~~~~~~~~~~~~
831../../../fflas-ffpack/fflas/fflas_ftrmm_src.inl: In member function 'void FFLAS::Protected::ftrmmLeftUpperNoTransNonUnit<float>::delayed(const Field&, size_t, size_t, typename Field::ConstElement_ptr, size_t, typename Field::ConstElement_ptr, size_t, typename Field::Element, typename Field::Element_ptr, size_t)':
832../../../fflas-ffpack/fflas/fflas_ftrmm_src.inl:213:9: error: there are no arguments to 'openblas_set_num_threads' that depend on a template parameter, so a declaration of 'openblas_set_num_threads' must be available [-fpermissive]
833  213 |         openblas_set_num_threads(__FFLASFFPACK_OPENBLAS_NUM_THREADS);
834      |         ^~~~~~~~~~~~~~~~~~~~~~~~
835In file included from ../../../fflas-ffpack/fflas/fflas_ftrmm.inl:599,
836                 from ../../../fflas-ffpack/fflas/fflas.h:118,
837                 from fflas_L1_inst.C:32:
838../../../fflas-ffpack/fflas/fflas_ftrmm_src.inl: In member function 'void FFLAS::Protected::ftrmmLeftUpperNoTransUnit<float>::delayed(const Field&, size_t, size_t, typename Field::ConstElement_ptr, size_t, typename Field::Element_ptr, size_t)':
839../../../fflas-ffpack/fflas/fflas_ftrmm_src.inl:193:9: error: there are no arguments to 'openblas_set_num_threads' that depend on a template parameter, so a declaration of 'openblas_set_num_threads' must be available [-fpermissive]
840  193 |         openblas_set_num_threads(__FFLASFFPACK_OPENBLAS_NUM_THREADS);
841      |         ^~~~~~~~~~~~~~~~~~~~~~~~
842../../../fflas-ffpack/fflas/fflas_ftrmm_src.inl: In member function 'void FFLAS::Protected::ftrmmLeftUpperNoTransUnit<float>::delayed(const Field&, size_t, size_t, typename Field::ConstElement_ptr, size_t, typename Field::ConstElement_ptr, size_t, typename Field::Element, typename Field::Element_ptr, size_t)':
843../../../fflas-ffpack/fflas/fflas_ftrmm_src.inl:213:9: error: there are no arguments to 'openblas_set_num_threads' that depend on a template parameter, so a declaration of 'openblas_set_num_threads' must be available [-fpermissive]
844  213 |         openblas_set_num_threads(__FFLASFFPACK_OPENBLAS_NUM_THREADS);
845      |         ^~~~~~~~~~~~~~~~~~~~~~~~
846In file included from ../../../fflas-ffpack/fflas/fflas_ftrmm.inl:611,
847                 from ../../../fflas-ffpack/fflas/fflas.h:118,
848                 from fflas_L1_inst.C:32:
849../../../fflas-ffpack/fflas/fflas_ftrmm_src.inl: In member function 'void FFLAS::Protected::ftrmmLeftUpperTransNonUnit<float>::delayed(const Field&, size_t, size_t, typename Field::ConstElement_ptr, size_t, typename Field::Element_ptr, size_t)':
850../../../fflas-ffpack/fflas/fflas_ftrmm_src.inl:193:9: error: there are no arguments to 'openblas_set_num_threads' that depend on a template parameter, so a declaration of 'openblas_set_num_threads' must be available [-fpermissive]
851  193 |         openblas_set_num_threads(__FFLASFFPACK_OPENBLAS_NUM_THREADS);
852      |         ^~~~~~~~~~~~~~~~~~~~~~~~
853../../../fflas-ffpack/fflas/fflas_ftrmm_src.inl: In member function 'void FFLAS::Protected::ftrmmLeftUpperTransNonUnit<float>::delayed(const Field&, size_t, size_t, typename Field::ConstElement_ptr, size_t, typename Field::ConstElement_ptr, size_t, typename Field::Element, typename Field::Element_ptr, size_t)':
854../../../fflas-ffpack/fflas/fflas_ftrmm_src.inl:213:9: error: there are no arguments to 'openblas_set_num_threads' that depend on a template parameter, so a declaration of 'openblas_set_num_threads' must be available [-fpermissive]
855  213 |         openblas_set_num_threads(__FFLASFFPACK_OPENBLAS_NUM_THREADS);
856      |         ^~~~~~~~~~~~~~~~~~~~~~~~
857In file included from ../../../fflas-ffpack/fflas/fflas_ftrmm.inl:623,
858                 from ../../../fflas-ffpack/fflas/fflas.h:118,
859                 from fflas_L1_inst.C:32:
860../../../fflas-ffpack/fflas/fflas_ftrmm_src.inl: In member function 'void FFLAS::Protected::ftrmmLeftUpperTransUnit<float>::delayed(const Field&, size_t, size_t, typename Field::ConstElement_ptr, size_t, typename Field::Element_ptr, size_t)':
861../../../fflas-ffpack/fflas/fflas_ftrmm_src.inl:193:9: error: there are no arguments to 'openblas_set_num_threads' that depend on a template parameter, so a declaration of 'openblas_set_num_threads' must be available [-fpermissive]
862  193 |         openblas_set_num_threads(__FFLASFFPACK_OPENBLAS_NUM_THREADS);
863      |         ^~~~~~~~~~~~~~~~~~~~~~~~
864../../../fflas-ffpack/fflas/fflas_ftrmm_src.inl: In member function 'void FFLAS::Protected::ftrmmLeftUpperTransUnit<float>::delayed(const Field&, size_t, size_t, typename Field::ConstElement_ptr, size_t, typename Field::ConstElement_ptr, size_t, typename Field::Element, typename Field::Element_ptr, size_t)':
865../../../fflas-ffpack/fflas/fflas_ftrmm_src.inl:213:9: error: there are no arguments to 'openblas_set_num_threads' that depend on a template parameter, so a declaration of 'openblas_set_num_threads' must be available [-fpermissive]
866  213 |         openblas_set_num_threads(__FFLASFFPACK_OPENBLAS_NUM_THREADS);
867      |         ^~~~~~~~~~~~~~~~~~~~~~~~
868In file included from ../../../fflas-ffpack/fflas/fflas_ftrmm.inl:636,
869                 from ../../../fflas-ffpack/fflas/fflas.h:118,
870                 from fflas_L1_inst.C:32:
871../../../fflas-ffpack/fflas/fflas_ftrmm_src.inl: In member function 'void FFLAS::Protected::ftrmmLeftLowerNoTransNonUnit<float>::delayed(const Field&, size_t, size_t, typename Field::ConstElement_ptr, size_t, typename Field::Element_ptr, size_t)':
872../../../fflas-ffpack/fflas/fflas_ftrmm_src.inl:193:9: error: there are no arguments to 'openblas_set_num_threads' that depend on a template parameter, so a declaration of 'openblas_set_num_threads' must be available [-fpermissive]
873  193 |         openblas_set_num_threads(__FFLASFFPACK_OPENBLAS_NUM_THREADS);
874      |         ^~~~~~~~~~~~~~~~~~~~~~~~
875../../../fflas-ffpack/fflas/fflas_ftrmm_src.inl: In member function 'void FFLAS::Protected::ftrmmLeftLowerNoTransNonUnit<float>::delayed(const Field&, size_t, size_t, typename Field::ConstElement_ptr, size_t, typename Field::ConstElement_ptr, size_t, typename Field::Element, typename Field::Element_ptr, size_t)':
876../../../fflas-ffpack/fflas/fflas_ftrmm_src.inl:213:9: error: there are no arguments to 'openblas_set_num_threads' that depend on a template parameter, so a declaration of 'openblas_set_num_threads' must be available [-fpermissive]
877  213 |         openblas_set_num_threads(__FFLASFFPACK_OPENBLAS_NUM_THREADS);
878      |         ^~~~~~~~~~~~~~~~~~~~~~~~
879In file included from ../../../fflas-ffpack/fflas/fflas_ftrmm.inl:648,
880                 from ../../../fflas-ffpack/fflas/fflas.h:118,
881                 from fflas_L1_inst.C:32:
882../../../fflas-ffpack/fflas/fflas_ftrmm_src.inl: In member function 'void FFLAS::Protected::ftrmmLeftLowerNoTransUnit<float>::delayed(const Field&, size_t, size_t, typename Field::ConstElement_ptr, size_t, typename Field::Element_ptr, size_t)':
883../../../fflas-ffpack/fflas/fflas_ftrmm_src.inl:193:9: error: there are no arguments to 'openblas_set_num_threads' that depend on a template parameter, so a declaration of 'openblas_set_num_threads' must be available [-fpermissive]
884  193 |         openblas_set_num_threads(__FFLASFFPACK_OPENBLAS_NUM_THREADS);
885      |         ^~~~~~~~~~~~~~~~~~~~~~~~
886../../../fflas-ffpack/fflas/fflas_ftrmm_src.inl: In member function 'void FFLAS::Protected::ftrmmLeftLowerNoTransUnit<float>::delayed(const Field&, size_t, size_t, typename Field::ConstElement_ptr, size_t, typename Field::ConstElement_ptr, size_t, typename Field::Element, typename Field::Element_ptr, size_t)':
887../../../fflas-ffpack/fflas/fflas_ftrmm_src.inl:213:9: error: there are no arguments to 'openblas_set_num_threads' that depend on a template parameter, so a declaration of 'openblas_set_num_threads' must be available [-fpermissive]
888  213 |         openblas_set_num_threads(__FFLASFFPACK_OPENBLAS_NUM_THREADS);
889      |         ^~~~~~~~~~~~~~~~~~~~~~~~
890In file included from ../../../fflas-ffpack/fflas/fflas_ftrmm.inl:660,
891                 from ../../../fflas-ffpack/fflas/fflas.h:118,
892                 from fflas_L1_inst.C:32:
893../../../fflas-ffpack/fflas/fflas_ftrmm_src.inl: In member function 'void FFLAS::Protected::ftrmmLeftLowerTransNonUnit<float>::delayed(const Field&, size_t, size_t, typename Field::ConstElement_ptr, size_t, typename Field::Element_ptr, size_t)':
894../../../fflas-ffpack/fflas/fflas_ftrmm_src.inl:193:9: error: there are no arguments to 'openblas_set_num_threads' that depend on a template parameter, so a declaration of 'openblas_set_num_threads' must be available [-fpermissive]
895  193 |         openblas_set_num_threads(__FFLASFFPACK_OPENBLAS_NUM_THREADS);
896      |         ^~~~~~~~~~~~~~~~~~~~~~~~
897../../../fflas-ffpack/fflas/fflas_ftrmm_src.inl: In member function 'void FFLAS::Protected::ftrmmLeftLowerTransNonUnit<float>::delayed(const Field&, size_t, size_t, typename Field::ConstElement_ptr, size_t, typename Field::ConstElement_ptr, size_t, typename Field::Element, typename Field::Element_ptr, size_t)':
898../../../fflas-ffpack/fflas/fflas_ftrmm_src.inl:213:9: error: there are no arguments to 'openblas_set_num_threads' that depend on a template parameter, so a declaration of 'openblas_set_num_threads' must be available [-fpermissive]
899  213 |         openblas_set_num_threads(__FFLASFFPACK_OPENBLAS_NUM_THREADS);
900      |         ^~~~~~~~~~~~~~~~~~~~~~~~
901In file included from ../../../fflas-ffpack/fflas/fflas_ftrmm.inl:672,
902                 from ../../../fflas-ffpack/fflas/fflas.h:118,
903                 from fflas_L1_inst.C:32:
904../../../fflas-ffpack/fflas/fflas_ftrmm_src.inl: In member function 'void FFLAS::Protected::ftrmmLeftLowerTransUnit<float>::delayed(const Field&, size_t, size_t, typename Field::ConstElement_ptr, size_t, typename Field::Element_ptr, size_t)':
905../../../fflas-ffpack/fflas/fflas_ftrmm_src.inl:193:9: error: there are no arguments to 'openblas_set_num_threads' that depend on a template parameter, so a declaration of 'openblas_set_num_threads' must be available [-fpermissive]
906  193 |         openblas_set_num_threads(__FFLASFFPACK_OPENBLAS_NUM_THREADS);
907      |         ^~~~~~~~~~~~~~~~~~~~~~~~
908../../../fflas-ffpack/fflas/fflas_ftrmm_src.inl: In member function 'void FFLAS::Protected::ftrmmLeftLowerTransUnit<float>::delayed(const Field&, size_t, size_t, typename Field::ConstElement_ptr, size_t, typename Field::ConstElement_ptr, size_t, typename Field::Element, typename Field::Element_ptr, size_t)':
909../../../fflas-ffpack/fflas/fflas_ftrmm_src.inl:213:9: error: there are no arguments to 'openblas_set_num_threads' that depend on a template parameter, so a declaration of 'openblas_set_num_threads' must be available [-fpermissive]
910  213 |         openblas_set_num_threads(__FFLASFFPACK_OPENBLAS_NUM_THREADS);
911      |         ^~~~~~~~~~~~~~~~~~~~~~~~
912In file included from ../../../fflas-ffpack/fflas/fflas_ftrmm.inl:686,
913                 from ../../../fflas-ffpack/fflas/fflas.h:118,
914                 from fflas_L1_inst.C:32:
915../../../fflas-ffpack/fflas/fflas_ftrmm_src.inl: In member function 'void FFLAS::Protected::ftrmmRightUpperNoTransNonUnit<float>::delayed(const Field&, size_t, size_t, typename Field::ConstElement_ptr, size_t, typename Field::Element_ptr, size_t)':
916../../../fflas-ffpack/fflas/fflas_ftrmm_src.inl:193:9: error: there are no arguments to 'openblas_set_num_threads' that depend on a template parameter, so a declaration of 'openblas_set_num_threads' must be available [-fpermissive]
917  193 |         openblas_set_num_threads(__FFLASFFPACK_OPENBLAS_NUM_THREADS);
918      |         ^~~~~~~~~~~~~~~~~~~~~~~~
919../../../fflas-ffpack/fflas/fflas_ftrmm_src.inl: In member function 'void FFLAS::Protected::ftrmmRightUpperNoTransNonUnit<float>::delayed(const Field&, size_t, size_t, typename Field::ConstElement_ptr, size_t, typename Field::ConstElement_ptr, size_t, typename Field::Element, typename Field::Element_ptr, size_t)':
920../../../fflas-ffpack/fflas/fflas_ftrmm_src.inl:213:9: error: there are no arguments to 'openblas_set_num_threads' that depend on a template parameter, so a declaration of 'openblas_set_num_threads' must be available [-fpermissive]
921  213 |         openblas_set_num_threads(__FFLASFFPACK_OPENBLAS_NUM_THREADS);
922      |         ^~~~~~~~~~~~~~~~~~~~~~~~
923In file included from ../../../fflas-ffpack/fflas/fflas_ftrmm.inl:698,
924                 from ../../../fflas-ffpack/fflas/fflas.h:118,
925                 from fflas_L1_inst.C:32:
926../../../fflas-ffpack/fflas/fflas_ftrmm_src.inl: In member function 'void FFLAS::Protected::ftrmmRightUpperNoTransUnit<float>::delayed(const Field&, size_t, size_t, typename Field::ConstElement_ptr, size_t, typename Field::Element_ptr, size_t)':
927../../../fflas-ffpack/fflas/fflas_ftrmm_src.inl:193:9: error: there are no arguments to 'openblas_set_num_threads' that depend on a template parameter, so a declaration of 'openblas_set_num_threads' must be available [-fpermissive]
928  193 |         openblas_set_num_threads(__FFLASFFPACK_OPENBLAS_NUM_THREADS);
929      |         ^~~~~~~~~~~~~~~~~~~~~~~~
930../../../fflas-ffpack/fflas/fflas_ftrmm_src.inl: In member function 'void FFLAS::Protected::ftrmmRightUpperNoTransUnit<float>::delayed(const Field&, size_t, size_t, typename Field::ConstElement_ptr, size_t, typename Field::ConstElement_ptr, size_t, typename Field::Element, typename Field::Element_ptr, size_t)':
931../../../fflas-ffpack/fflas/fflas_ftrmm_src.inl:213:9: error: there are no arguments to 'openblas_set_num_threads' that depend on a template parameter, so a declaration of 'openblas_set_num_threads' must be available [-fpermissive]
932  213 |         openblas_set_num_threads(__FFLASFFPACK_OPENBLAS_NUM_THREADS);
933      |         ^~~~~~~~~~~~~~~~~~~~~~~~
934In file included from ../../../fflas-ffpack/fflas/fflas_ftrmm.inl:710,
935                 from ../../../fflas-ffpack/fflas/fflas.h:118,
936                 from fflas_L1_inst.C:32:
937../../../fflas-ffpack/fflas/fflas_ftrmm_src.inl: In member function 'void FFLAS::Protected::ftrmmRightUpperTransNonUnit<float>::delayed(const Field&, size_t, size_t, typename Field::ConstElement_ptr, size_t, typename Field::Element_ptr, size_t)':
938../../../fflas-ffpack/fflas/fflas_ftrmm_src.inl:193:9: error: there are no arguments to 'openblas_set_num_threads' that depend on a template parameter, so a declaration of 'openblas_set_num_threads' must be available [-fpermissive]
939  193 |         openblas_set_num_threads(__FFLASFFPACK_OPENBLAS_NUM_THREADS);
940      |         ^~~~~~~~~~~~~~~~~~~~~~~~
941../../../fflas-ffpack/fflas/fflas_ftrmm_src.inl: In member function 'void FFLAS::Protected::ftrmmRightUpperTransNonUnit<float>::delayed(const Field&, size_t, size_t, typename Field::ConstElement_ptr, size_t, typename Field::ConstElement_ptr, size_t, typename Field::Element, typename Field::Element_ptr, size_t)':
942../../../fflas-ffpack/fflas/fflas_ftrmm_src.inl:213:9: error: there are no arguments to 'openblas_set_num_threads' that depend on a template parameter, so a declaration of 'openblas_set_num_threads' must be available [-fpermissive]
943  213 |         openblas_set_num_threads(__FFLASFFPACK_OPENBLAS_NUM_THREADS);
944      |         ^~~~~~~~~~~~~~~~~~~~~~~~
945In file included from ../../../fflas-ffpack/fflas/fflas_ftrmm.inl:722,
946                 from ../../../fflas-ffpack/fflas/fflas.h:118,
947                 from fflas_L1_inst.C:32:
948../../../fflas-ffpack/fflas/fflas_ftrmm_src.inl: In member function 'void FFLAS::Protected::ftrmmRightUpperTransUnit<float>::delayed(const Field&, size_t, size_t, typename Field::ConstElement_ptr, size_t, typename Field::Element_ptr, size_t)':
949../../../fflas-ffpack/fflas/fflas_ftrmm_src.inl:193:9: error: there are no arguments to 'openblas_set_num_threads' that depend on a template parameter, so a declaration of 'openblas_set_num_threads' must be available [-fpermissive]
950  193 |         openblas_set_num_threads(__FFLASFFPACK_OPENBLAS_NUM_THREADS);
951      |         ^~~~~~~~~~~~~~~~~~~~~~~~
952../../../fflas-ffpack/fflas/fflas_ftrmm_src.inl: In member function 'void FFLAS::Protected::ftrmmRightUpperTransUnit<float>::delayed(const Field&, size_t, size_t, typename Field::ConstElement_ptr, size_t, typename Field::ConstElement_ptr, size_t, typename Field::Element, typename Field::Element_ptr, size_t)':
953../../../fflas-ffpack/fflas/fflas_ftrmm_src.inl:213:9: error: there are no arguments to 'openblas_set_num_threads' that depend on a template parameter, so a declaration of 'openblas_set_num_threads' must be available [-fpermissive]
954  213 |         openblas_set_num_threads(__FFLASFFPACK_OPENBLAS_NUM_THREADS);
955      |         ^~~~~~~~~~~~~~~~~~~~~~~~
956In file included from ../../../fflas-ffpack/fflas/fflas_ftrmm.inl:735,
957                 from ../../../fflas-ffpack/fflas/fflas.h:118,
958                 from fflas_L1_inst.C:32:
959../../../fflas-ffpack/fflas/fflas_ftrmm_src.inl: In member function 'void FFLAS::Protected::ftrmmRightLowerNoTransNonUnit<float>::delayed(const Field&, size_t, size_t, typename Field::ConstElement_ptr, size_t, typename Field::Element_ptr, size_t)':
960../../../fflas-ffpack/fflas/fflas_ftrmm_src.inl:193:9: error: there are no arguments to 'openblas_set_num_threads' that depend on a template parameter, so a declaration of 'openblas_set_num_threads' must be available [-fpermissive]
961  193 |         openblas_set_num_threads(__FFLASFFPACK_OPENBLAS_NUM_THREADS);
962      |         ^~~~~~~~~~~~~~~~~~~~~~~~
963../../../fflas-ffpack/fflas/fflas_ftrmm_src.inl: In member function 'void FFLAS::Protected::ftrmmRightLowerNoTransNonUnit<float>::delayed(const Field&, size_t, size_t, typename Field::ConstElement_ptr, size_t, typename Field::ConstElement_ptr, size_t, typename Field::Element, typename Field::Element_ptr, size_t)':
964../../../fflas-ffpack/fflas/fflas_ftrmm_src.inl:213:9: error: there are no arguments to 'openblas_set_num_threads' that depend on a template parameter, so a declaration of 'openblas_set_num_threads' must be available [-fpermissive]
965  213 |         openblas_set_num_threads(__FFLASFFPACK_OPENBLAS_NUM_THREADS);
966      |         ^~~~~~~~~~~~~~~~~~~~~~~~
967In file included from ../../../fflas-ffpack/fflas/fflas_ftrmm.inl:747,
968                 from ../../../fflas-ffpack/fflas/fflas.h:118,
969                 from fflas_L1_inst.C:32:
970../../../fflas-ffpack/fflas/fflas_ftrmm_src.inl: In member function 'void FFLAS::Protected::ftrmmRightLowerNoTransUnit<float>::delayed(const Field&, size_t, size_t, typename Field::ConstElement_ptr, size_t, typename Field::Element_ptr, size_t)':
971../../../fflas-ffpack/fflas/fflas_ftrmm_src.inl:193:9: error: there are no arguments to 'openblas_set_num_threads' that depend on a template parameter, so a declaration of 'openblas_set_num_threads' must be available [-fpermissive]
972  193 |         openblas_set_num_threads(__FFLASFFPACK_OPENBLAS_NUM_THREADS);
973      |         ^~~~~~~~~~~~~~~~~~~~~~~~
974../../../fflas-ffpack/fflas/fflas_ftrmm_src.inl: In member function 'void FFLAS::Protected::ftrmmRightLowerNoTransUnit<float>::delayed(const Field&, size_t, size_t, typename Field::ConstElement_ptr, size_t, typename Field::ConstElement_ptr, size_t, typename Field::Element, typename Field::Element_ptr, size_t)':
975../../../fflas-ffpack/fflas/fflas_ftrmm_src.inl:213:9: error: there are no arguments to 'openblas_set_num_threads' that depend on a template parameter, so a declaration of 'openblas_set_num_threads' must be available [-fpermissive]
976  213 |         openblas_set_num_threads(__FFLASFFPACK_OPENBLAS_NUM_THREADS);
977      |         ^~~~~~~~~~~~~~~~~~~~~~~~
978In file included from ../../../fflas-ffpack/fflas/fflas_ftrmm.inl:759,
979                 from ../../../fflas-ffpack/fflas/fflas.h:118,
980                 from fflas_L1_inst.C:32:
981../../../fflas-ffpack/fflas/fflas_ftrmm_src.inl: In member function 'void FFLAS::Protected::ftrmmRightLowerTransNonUnit<float>::delayed(const Field&, size_t, size_t, typename Field::ConstElement_ptr, size_t, typename Field::Element_ptr, size_t)':
982../../../fflas-ffpack/fflas/fflas_ftrmm_src.inl:193:9: error: there are no arguments to 'openblas_set_num_threads' that depend on a template parameter, so a declaration of 'openblas_set_num_threads' must be available [-fpermissive]
983  193 |         openblas_set_num_threads(__FFLASFFPACK_OPENBLAS_NUM_THREADS);
984      |         ^~~~~~~~~~~~~~~~~~~~~~~~
985../../../fflas-ffpack/fflas/fflas_ftrmm_src.inl: In member function 'void FFLAS::Protected::ftrmmRightLowerTransNonUnit<float>::delayed(const Field&, size_t, size_t, typename Field::ConstElement_ptr, size_t, typename Field::ConstElement_ptr, size_t, typename Field::Element, typename Field::Element_ptr, size_t)':
986../../../fflas-ffpack/fflas/fflas_ftrmm_src.inl:213:9: error: there are no arguments to 'openblas_set_num_threads' that depend on a template parameter, so a declaration of 'openblas_set_num_threads' must be available [-fpermissive]
987  213 |         openblas_set_num_threads(__FFLASFFPACK_OPENBLAS_NUM_THREADS);
988      |         ^~~~~~~~~~~~~~~~~~~~~~~~
989In file included from ../../../fflas-ffpack/fflas/fflas_ftrmm.inl:771,
990                 from ../../../fflas-ffpack/fflas/fflas.h:118,
991                 from fflas_L1_inst.C:32:
992../../../fflas-ffpack/fflas/fflas_ftrmm_src.inl: In member function 'void FFLAS::Protected::ftrmmRightLowerTransUnit<float>::delayed(const Field&, size_t, size_t, typename Field::ConstElement_ptr, size_t, typename Field::Element_ptr, size_t)':
993../../../fflas-ffpack/fflas/fflas_ftrmm_src.inl:193:9: error: there are no arguments to 'openblas_set_num_threads' that depend on a template parameter, so a declaration of 'openblas_set_num_threads' must be available [-fpermissive]
994  193 |         openblas_set_num_threads(__FFLASFFPACK_OPENBLAS_NUM_THREADS);
995      |         ^~~~~~~~~~~~~~~~~~~~~~~~
996../../../fflas-ffpack/fflas/fflas_ftrmm_src.inl: In member function 'void FFLAS::Protected::ftrmmRightLowerTransUnit<float>::delayed(const Field&, size_t, size_t, typename Field::ConstElement_ptr, size_t, typename Field::ConstElement_ptr, size_t, typename Field::Element, typename Field::Element_ptr, size_t)':
997../../../fflas-ffpack/fflas/fflas_ftrmm_src.inl:213:9: error: there are no arguments to 'openblas_set_num_threads' that depend on a template parameter, so a declaration of 'openblas_set_num_threads' must be available [-fpermissive]
998  213 |         openblas_set_num_threads(__FFLASFFPACK_OPENBLAS_NUM_THREADS);
999      |         ^~~~~~~~~~~~~~~~~~~~~~~~
1000In file included from ../../../fflas-ffpack/fflas/fflas.h:120,
1001                 from fflas_L1_inst.C:32:
1002../../../fflas-ffpack/fflas/fflas_faxpy.inl: In function 'void FFLAS::faxpy(const Field&, size_t, typename Field::Element, typename Field::ConstElement_ptr, size_t, typename Field::Element_ptr, size_t) [with Field = Givaro::ZRing<double>; size_t = long unsigned int; typename Field::Element = double; typename Field::ConstElement_ptr = const double*; typename Field::Element_ptr = double*]':
1003../../../fflas-ffpack/fflas/fflas_faxpy.inl:68:9: error: 'openblas_set_num_threads' was not declared in this scope; did you mean 'omp_set_num_threads'?
1004   68 |         openblas_set_num_threads(__FFLASFFPACK_OPENBLAS_NUM_THREADS);
1005      |         ^~~~~~~~~~~~~~~~~~~~~~~~
1006      |         omp_set_num_threads
1007../../../fflas-ffpack/fflas/fflas_faxpy.inl: In function 'void FFLAS::faxpy(const Field&, size_t, typename Field::Element, typename Field::ConstElement_ptr, size_t, typename Field::Element_ptr, size_t) [with Field = Givaro::ZRing<float>; size_t = long unsigned int; typename Field::Element = float; typename Field::ConstElement_ptr = const float*; typename Field::Element_ptr = float*]':
1008../../../fflas-ffpack/fflas/fflas_faxpy.inl:82:9: error: 'openblas_set_num_threads' was not declared in this scope; did you mean 'omp_set_num_threads'?
1009   82 |         openblas_set_num_threads(__FFLASFFPACK_OPENBLAS_NUM_THREADS);
1010      |         ^~~~~~~~~~~~~~~~~~~~~~~~
1011      |         omp_set_num_threads
1012In file included from ../../../fflas-ffpack/fflas/fflas.h:121,
1013                 from fflas_L1_inst.C:32:
1014../../../fflas-ffpack/fflas/fflas_fdot.inl: In function 'typename Field::Element FFLAS::fdot(const Field&, size_t, typename Field::ConstElement_ptr, size_t, typename Field::ConstElement_ptr, size_t, FFLAS::ModeCategories::DefaultTag&) [with Field = Givaro::ZRing<double>; typename Field::Element = double; size_t = long unsigned int; typename Field::ConstElement_ptr = const double*]':
1015../../../fflas-ffpack/fflas/fflas_fdot.inl:98:9: error: 'openblas_set_num_threads' was not declared in this scope; did you mean 'omp_set_num_threads'?
1016   98 |         openblas_set_num_threads(__FFLASFFPACK_OPENBLAS_NUM_THREADS);
1017      |         ^~~~~~~~~~~~~~~~~~~~~~~~
1018      |         omp_set_num_threads
1019../../../fflas-ffpack/fflas/fflas_fdot.inl: In function 'typename Field::Element FFLAS::fdot(const Field&, size_t, typename Field::ConstElement_ptr, size_t, typename Field::ConstElement_ptr, size_t, FFLAS::ModeCategories::DefaultTag&) [with Field = Givaro::ZRing<float>; typename Field::Element = float; size_t = long unsigned int; typename Field::ConstElement_ptr = const float*]':
1020../../../fflas-ffpack/fflas/fflas_fdot.inl:112:9: error: 'openblas_set_num_threads' was not declared in this scope; did you mean 'omp_set_num_threads'?
1021  112 |         openblas_set_num_threads(__FFLASFFPACK_OPENBLAS_NUM_THREADS);
1022      |         ^~~~~~~~~~~~~~~~~~~~~~~~
1023      |         omp_set_num_threads
1024make[8]: *** [Makefile:611: fflas_L1_inst.lo] Error 1
1025make[8]: Leaving directory '/opt/sage/local/var/tmp/sage/build/fflas_ffpack-2.4.3/src/fflas-ffpack/interfaces/libs'
1026make[7]: *** [Makefile:416: all-recursive] Error 1
1027make[7]: Leaving directory '/opt/sage/local/var/tmp/sage/build/fflas_ffpack-2.4.3/src/fflas-ffpack/interfaces'
1028make[6]: *** [Makefile:477: all-recursive] Error 1
1029make[6]: Leaving directory '/opt/sage/local/var/tmp/sage/build/fflas_ffpack-2.4.3/src/fflas-ffpack'
1030make[5]: *** [Makefile:568: all-recursive] Error 1
1031make[5]: Leaving directory '/opt/sage/local/var/tmp/sage/build/fflas_ffpack-2.4.3/src'
1032make[4]: *** [Makefile:440: all] Error 2
1033make[4]: Leaving directory '/opt/sage/local/var/tmp/sage/build/fflas_ffpack-2.4.3/src'
1034********************************************************************************************************************************************************************************************************************
1035Error building fflas_ffpack-2.4.3
1036********************************************************************************************************************************************************************************************************************
1037
1038real    0m11.341s
1039user    0m9.552s
1040sys     0m2.288s
1041************************************************************************
1042Error installing package fflas_ffpack-2.4.3
1043************************************************************************
1044Please email sage-devel (http://groups.google.com/group/sage-devel)
1045explaining the problem and including the log file
1046  /opt/sage/logs/pkgs/fflas_ffpack-2.4.3.log
1047Describe your computer, operating system, etc.
1048If you want to try to fix the problem yourself, *don't* just cd to
1049/opt/sage/local/var/tmp/sage/build/fflas_ffpack-2.4.3 and type 'make' or whatever is appropriate.
1050Instead, the following commands setup all environment variables
1051correctly and load a subshell for you to debug the error:
1052  (cd '/opt/sage/local/var/tmp/sage/build/fflas_ffpack-2.4.3' && '/opt/sage/sage' --sh)
1053When you are done debugging, you can type "exit" to leave the subshell.
1054************************************************************************