Ticket #29071: vdelecroix-29071-config.log

File vdelecroix-29071-config.log, 187.3 KB (added by vdelecroix, 20 months ago)
Line 
1This file contains any messages produced by compilers while
2running configure, to aid debugging if configure makes a mistake.
3
4It was created by Sage configure 9.1.beta1, which was
5generated by GNU Autoconf 2.69.  Invocation command line was
6
7  $ ./configure
8
9## --------- ##
10## Platform. ##
11## --------- ##
12
13hostname = mangouste
14uname -m = x86_64
15uname -r = 5.4.13-arch1-1
16uname -s = Linux
17uname -v = #1 SMP PREEMPT Fri, 17 Jan 2020 23:09:54 +0000
18
19/usr/bin/uname -p = unknown
20/bin/uname -X     = unknown
21
22/bin/arch              = unknown
23/usr/bin/arch -k       = unknown
24/usr/convex/getsysinfo = unknown
25/usr/bin/hostinfo      = unknown
26/bin/machine           = unknown
27/usr/bin/oslevel       = unknown
28/bin/universe          = unknown
29
30PATH: /usr/lib/ccache/bin
31PATH: /home/vincent/.opam/system/bin
32PATH: /home/vincent/miniconda3/condabin
33PATH: /usr/lib/ccache/bin
34PATH: /usr/local/sbin
35PATH: /usr/local/bin
36PATH: /usr/bin
37PATH: /opt/intel/mediasdk/bin
38PATH: /usr/lib/jvm/default/bin
39PATH: /usr/bin/site_perl
40PATH: /usr/bin/vendor_perl
41PATH: /usr/bin/core_perl
42
43
44## ----------- ##
45## Core tests. ##
46## ----------- ##
47
48configure:3200: checking for a BSD-compatible install
49configure:3268: result: /usr/bin/install -c
50configure:3279: checking whether build environment is sane
51configure:3334: result: yes
52configure:3483: checking for a thread-safe mkdir -p
53configure:3522: result: /usr/bin/mkdir -p
54configure:3529: checking for gawk
55configure:3545: found /usr/bin/gawk
56configure:3556: result: gawk
57configure:3567: checking whether make sets $(MAKE)
58configure:3589: result: yes
59configure:3618: checking whether make supports nested variables
60configure:3635: result: yes
61configure:3764: checking whether to enable maintainer-specific portions of Makefiles
62configure:3773: result: yes
63configure:3824: checking for root user
64configure:3833: result: no
65configure:3845: checking build system type
66configure:3859: result: x86_64-pc-linux-gnu
67configure:3879: checking host system type
68configure:3892: result: x86_64-pc-linux-gnu
69configure:4004: checking for a sed that does not truncate output
70configure:4068: result: /usr/bin/sed
71configure:4076: checking for ar
72configure:4092: found /usr/bin/ar
73configure:4104: result: yes
74configure:4125: checking for m4
75configure:4141: found /usr/bin/m4
76configure:4153: result: yes
77configure:4228: checking for pkg-config
78configure:4246: found /usr/bin/pkg-config
79configure:4258: result: /usr/bin/pkg-config
80configure:4283: checking pkg-config is at least version 0.9.0
81configure:4286: result: yes
82configure:4297: checking for ranlib
83configure:4313: found /usr/bin/ranlib
84configure:4325: result: yes
85configure:4346: checking for strip
86configure:4362: found /usr/bin/strip
87configure:4374: result: yes
88configure:4394: checking for GNU or BSD tar
89configure:4442: result: /usr/bin/tar
90configure:4453: checking for GNU make
91configure:4495: result: /usr/bin/make
92configure:4509: checking for latex
93configure:4525: found /usr/bin/latex
94configure:4537: result: yes
95configure:4561: checking for perl
96configure:4579: found /usr/bin/perl
97configure:4591: result: /usr/bin/perl
98configure:4599: checking for Perl version 5.8.0 or later
99configure:4610: result: yes
100configure:4672: checking for gcc
101configure:4688: found /usr/lib/ccache/bin/gcc
102configure:4699: result: gcc
103configure:4928: checking for C compiler version
104configure:4937: gcc --version >&5
105gcc (GCC) 9.2.0
106Copyright (C) 2019 Free Software Foundation, Inc.
107This is free software; see the source for copying conditions.  There is NO
108warranty; not even for MERCHANTABILITY or FITNESS FOR A PARTICULAR PURPOSE.
109
110configure:4948: $? = 0
111configure:4937: gcc -v >&5
112Using built-in specs.
113COLLECT_GCC=/usr/bin/gcc
114COLLECT_LTO_WRAPPER=/usr/lib/gcc/x86_64-pc-linux-gnu/9.2.0/lto-wrapper
115Target: x86_64-pc-linux-gnu
116Configured with: /build/gcc/src/gcc/configure --prefix=/usr --libdir=/usr/lib --libexecdir=/usr/lib --mandir=/usr/share/man --infodir=/usr/share/info --with-bugurl=https://bugs.archlinux.org/ --enable-languages=c,c++,ada,fortran,go,lto,objc,obj-c++,d --enable-shared --enable-threads=posix --with-system-zlib --with-isl --enable-__cxa_atexit --disable-libunwind-exceptions --enable-clocale=gnu --disable-libstdcxx-pch --disable-libssp --enable-gnu-unique-object --enable-linker-build-id --enable-lto --enable-plugin --enable-install-libiberty --with-linker-hash-style=gnu --enable-gnu-indirect-function --enable-multilib --disable-werror --enable-checking=release --enable-default-pie --enable-default-ssp --enable-cet=auto gdc_include_dir=/usr/include/dlang/gdc
117Thread model: posix
118gcc version 9.2.0 (GCC)
119configure:4948: $? = 0
120configure:4937: gcc -V >&5
121gcc: error: unrecognized command line option '-V'
122gcc: fatal error: no input files
123compilation terminated.
124configure:4948: $? = 1
125configure:4937: gcc -qversion >&5
126gcc: error: unrecognized command line option '-qversion'; did you mean '--version'?
127gcc: fatal error: no input files
128compilation terminated.
129configure:4948: $? = 1
130configure:4968: checking whether the C compiler works
131configure:4990: gcc    conftest.c  >&5
132configure:4994: $? = 0
133configure:5042: result: yes
134configure:5045: checking for C compiler default output file name
135configure:5047: result: a.out
136configure:5053: checking for suffix of executables
137configure:5060: gcc -o conftest    conftest.c  >&5
138configure:5064: $? = 0
139configure:5086: result:
140configure:5108: checking whether we are cross compiling
141configure:5116: gcc -o conftest    conftest.c  >&5
142configure:5120: $? = 0
143configure:5127: ./conftest
144configure:5131: $? = 0
145configure:5119: result: no
146configure:5124: checking for suffix of object files
147configure:5146: gcc -c   conftest.c >&5
148configure:5150: $? = 0
149configure:5171: result: o
150configure:5175: checking whether we are using the GNU C compiler
151configure:5194: gcc -c   conftest.c >&5
152configure:5194: $? = 0
153configure:5203: result: yes
154configure:5212: checking whether gcc accepts -g
155configure:5232: gcc -c -g  conftest.c >&5
156configure:5232: $? = 0
157configure:5273: result: yes
158configure:5290: checking for gcc option to accept ISO C89
159configure:5353: gcc  -c -g -O2  conftest.c >&5
160configure:5353: $? = 0
161configure:5366: result: none needed
162configure:5391: checking whether gcc understands -c and -o together
163configure:5413: gcc -c conftest.c -o conftest2.o
164configure:5416: $? = 0
165configure:5413: gcc -c conftest.c -o conftest2.o
166configure:5416: $? = 0
167configure:5428: result: yes
168configure:5448: checking whether make supports the include directive
169configure:5463: make -f confmf.GNU && cat confinc.out
170this is the am__doit target
171configure:5466: $? = 0
172configure:5485: result: yes (GNU style)
173configure:5510: checking dependency style of gcc
174configure:5621: result: none
175configure:5641: checking how to run the C preprocessor
176configure:5672: gcc -E  conftest.c
177configure:5672: $? = 0
178configure:5686: gcc -E  conftest.c
179conftest.c:11:10: fatal error: ac_nonexistent.h: No such file or directory
180   11 | #include <ac_nonexistent.h>
181      |          ^~~~~~~~~~~~~~~~~~
182compilation terminated.
183configure:5686: $? = 1
184configure: failed program was:
185| /* confdefs.h */
186| #define PACKAGE_NAME "Sage"
187| #define PACKAGE_TARNAME "sage"
188| #define PACKAGE_VERSION "9.1.beta1"
189| #define PACKAGE_STRING "Sage 9.1.beta1"
190| #define PACKAGE_BUGREPORT "sage-devel@googlegroups.com"
191| #define PACKAGE_URL ""
192| #define PACKAGE "sage"
193| #define VERSION "9.1.beta1"
194| /* end confdefs.h.  */
195| #include <ac_nonexistent.h>
196configure:5711: result: gcc -E
197configure:5731: gcc -E  conftest.c
198configure:5731: $? = 0
199configure:5745: gcc -E  conftest.c
200conftest.c:11:10: fatal error: ac_nonexistent.h: No such file or directory
201   11 | #include <ac_nonexistent.h>
202      |          ^~~~~~~~~~~~~~~~~~
203compilation terminated.
204configure:5745: $? = 1
205configure: failed program was:
206| /* confdefs.h */
207| #define PACKAGE_NAME "Sage"
208| #define PACKAGE_TARNAME "sage"
209| #define PACKAGE_VERSION "9.1.beta1"
210| #define PACKAGE_STRING "Sage 9.1.beta1"
211| #define PACKAGE_BUGREPORT "sage-devel@googlegroups.com"
212| #define PACKAGE_URL ""
213| #define PACKAGE "sage"
214| #define VERSION "9.1.beta1"
215| /* end confdefs.h.  */
216| #include <ac_nonexistent.h>
217configure:5831: checking for g++
218configure:5847: found /usr/lib/ccache/bin/g++
219configure:5858: result: g++
220configure:5885: checking for C++ compiler version
221configure:5894: g++ --version >&5
222g++ (GCC) 9.2.0
223Copyright (C) 2019 Free Software Foundation, Inc.
224This is free software; see the source for copying conditions.  There is NO
225warranty; not even for MERCHANTABILITY or FITNESS FOR A PARTICULAR PURPOSE.
226
227configure:5905: $? = 0
228configure:5894: g++ -v >&5
229Using built-in specs.
230COLLECT_GCC=/usr/bin/g++
231COLLECT_LTO_WRAPPER=/usr/lib/gcc/x86_64-pc-linux-gnu/9.2.0/lto-wrapper
232Target: x86_64-pc-linux-gnu
233Configured with: /build/gcc/src/gcc/configure --prefix=/usr --libdir=/usr/lib --libexecdir=/usr/lib --mandir=/usr/share/man --infodir=/usr/share/info --with-bugurl=https://bugs.archlinux.org/ --enable-languages=c,c++,ada,fortran,go,lto,objc,obj-c++,d --enable-shared --enable-threads=posix --with-system-zlib --with-isl --enable-__cxa_atexit --disable-libunwind-exceptions --enable-clocale=gnu --disable-libstdcxx-pch --disable-libssp --enable-gnu-unique-object --enable-linker-build-id --enable-lto --enable-plugin --enable-install-libiberty --with-linker-hash-style=gnu --enable-gnu-indirect-function --enable-multilib --disable-werror --enable-checking=release --enable-default-pie --enable-default-ssp --enable-cet=auto gdc_include_dir=/usr/include/dlang/gdc
234Thread model: posix
235gcc version 9.2.0 (GCC)
236configure:5905: $? = 0
237configure:5894: g++ -V >&5
238g++: error: unrecognized command line option '-V'
239g++: fatal error: no input files
240compilation terminated.
241configure:5905: $? = 1
242configure:5894: g++ -qversion >&5
243g++: error: unrecognized command line option '-qversion'; did you mean '--version'?
244g++: fatal error: no input files
245compilation terminated.
246configure:5905: $? = 1
247configure:5909: checking whether we are using the GNU C++ compiler
248configure:5928: g++ -c   conftest.cpp >&5
249configure:5928: $? = 0
250configure:5937: result: yes
251configure:5946: checking whether g++ accepts -g
252configure:5966: g++ -c -g  conftest.cpp >&5
253configure:5966: $? = 0
254configure:6007: result: yes
255configure:6032: checking dependency style of g++
256configure:6143: result: none
257configure:6211: checking for gfortran
258configure:6227: found /usr/bin/gfortran
259configure:6238: result: gfortran
260configure:6264: checking for Fortran compiler version
261configure:6273: gfortran --version >&5
262GNU Fortran (GCC) 9.2.0
263Copyright (C) 2019 Free Software Foundation, Inc.
264This is free software; see the source for copying conditions.  There is NO
265warranty; not even for MERCHANTABILITY or FITNESS FOR A PARTICULAR PURPOSE.
266
267configure:6284: $? = 0
268configure:6273: gfortran -v >&5
269Using built-in specs.
270COLLECT_GCC=gfortran
271COLLECT_LTO_WRAPPER=/usr/lib/gcc/x86_64-pc-linux-gnu/9.2.0/lto-wrapper
272Target: x86_64-pc-linux-gnu
273Configured with: /build/gcc/src/gcc/configure --prefix=/usr --libdir=/usr/lib --libexecdir=/usr/lib --mandir=/usr/share/man --infodir=/usr/share/info --with-bugurl=https://bugs.archlinux.org/ --enable-languages=c,c++,ada,fortran,go,lto,objc,obj-c++,d --enable-shared --enable-threads=posix --with-system-zlib --with-isl --enable-__cxa_atexit --disable-libunwind-exceptions --enable-clocale=gnu --disable-libstdcxx-pch --disable-libssp --enable-gnu-unique-object --enable-linker-build-id --enable-lto --enable-plugin --enable-install-libiberty --with-linker-hash-style=gnu --enable-gnu-indirect-function --enable-multilib --disable-werror --enable-checking=release --enable-default-pie --enable-default-ssp --enable-cet=auto gdc_include_dir=/usr/include/dlang/gdc
274Thread model: posix
275gcc version 9.2.0 (GCC)
276configure:6284: $? = 0
277configure:6273: gfortran -V >&5
278gfortran: error: unrecognized command line option '-V'
279gfortran: fatal error: no input files
280compilation terminated.
281configure:6284: $? = 1
282configure:6273: gfortran -qversion >&5
283gfortran: error: unrecognized command line option '-qversion'; did you mean '--version'?
284gfortran: fatal error: no input files
285compilation terminated.
286configure:6284: $? = 1
287configure:6293: checking whether we are using the GNU Fortran compiler
288configure:6306: gfortran -c   conftest.F >&5
289configure:6306: $? = 0
290configure:6315: result: yes
291configure:6321: checking whether gfortran accepts -g
292configure:6332: gfortran -c -g  conftest.f >&5
293configure:6332: $? = 0
294configure:6340: result: yes
295configure:6430: checking for gcc
296configure:6446: found /usr/lib/ccache/bin/gcc
297configure:6457: result: gcc
298configure:6482: checking for Objective C compiler version
299configure:6491: gcc --version >&5
300gcc (GCC) 9.2.0
301Copyright (C) 2019 Free Software Foundation, Inc.
302This is free software; see the source for copying conditions.  There is NO
303warranty; not even for MERCHANTABILITY or FITNESS FOR A PARTICULAR PURPOSE.
304
305configure:6502: $? = 0
306configure:6491: gcc -v >&5
307Using built-in specs.
308COLLECT_GCC=/usr/bin/gcc
309COLLECT_LTO_WRAPPER=/usr/lib/gcc/x86_64-pc-linux-gnu/9.2.0/lto-wrapper
310Target: x86_64-pc-linux-gnu
311Configured with: /build/gcc/src/gcc/configure --prefix=/usr --libdir=/usr/lib --libexecdir=/usr/lib --mandir=/usr/share/man --infodir=/usr/share/info --with-bugurl=https://bugs.archlinux.org/ --enable-languages=c,c++,ada,fortran,go,lto,objc,obj-c++,d --enable-shared --enable-threads=posix --with-system-zlib --with-isl --enable-__cxa_atexit --disable-libunwind-exceptions --enable-clocale=gnu --disable-libstdcxx-pch --disable-libssp --enable-gnu-unique-object --enable-linker-build-id --enable-lto --enable-plugin --enable-install-libiberty --with-linker-hash-style=gnu --enable-gnu-indirect-function --enable-multilib --disable-werror --enable-checking=release --enable-default-pie --enable-default-ssp --enable-cet=auto gdc_include_dir=/usr/include/dlang/gdc
312Thread model: posix
313gcc version 9.2.0 (GCC)
314configure:6502: $? = 0
315configure:6491: gcc -V >&5
316gcc: error: unrecognized command line option '-V'
317gcc: fatal error: no input files
318compilation terminated.
319configure:6502: $? = 1
320configure:6491: gcc -qversion >&5
321gcc: error: unrecognized command line option '-qversion'; did you mean '--version'?
322gcc: fatal error: no input files
323compilation terminated.
324configure:6502: $? = 1
325configure:6506: checking whether we are using the GNU Objective C compiler
326configure:6525: gcc -c   conftest.m >&5
327gcc: fatal error: cannot execute 'cc1obj': execvp: No such file or directory
328compilation terminated.
329configure:6525: $? = 1
330configure: failed program was:
331| /* confdefs.h */
332| #define PACKAGE_NAME "Sage"
333| #define PACKAGE_TARNAME "sage"
334| #define PACKAGE_VERSION "9.1.beta1"
335| #define PACKAGE_STRING "Sage 9.1.beta1"
336| #define PACKAGE_BUGREPORT "sage-devel@googlegroups.com"
337| #define PACKAGE_URL ""
338| #define PACKAGE "sage"
339| #define VERSION "9.1.beta1"
340| /* end confdefs.h.  */
341|
342| int
343| main ()
344| {
345| #ifndef __GNUC__
346|        choke me
347| #endif
348|
349|   ;
350|   return 0;
351| }
352configure:6534: result: no
353configure:6543: checking whether gcc accepts -g
354configure:6563: gcc -c -g  conftest.m >&5
355gcc: fatal error: cannot execute 'cc1obj': execvp: No such file or directory
356compilation terminated.
357configure:6563: $? = 1
358configure: failed program was:
359| /* confdefs.h */
360| #define PACKAGE_NAME "Sage"
361| #define PACKAGE_TARNAME "sage"
362| #define PACKAGE_VERSION "9.1.beta1"
363| #define PACKAGE_STRING "Sage 9.1.beta1"
364| #define PACKAGE_BUGREPORT "sage-devel@googlegroups.com"
365| #define PACKAGE_URL ""
366| #define PACKAGE "sage"
367| #define VERSION "9.1.beta1"
368| /* end confdefs.h.  */
369|
370| int
371| main ()
372| {
373|
374|   ;
375|   return 0;
376| }
377configure:6578: gcc -c   conftest.m >&5
378gcc: fatal error: cannot execute 'cc1obj': execvp: No such file or directory
379compilation terminated.
380configure:6578: $? = 1
381configure: failed program was:
382| /* confdefs.h */
383| #define PACKAGE_NAME "Sage"
384| #define PACKAGE_TARNAME "sage"
385| #define PACKAGE_VERSION "9.1.beta1"
386| #define PACKAGE_STRING "Sage 9.1.beta1"
387| #define PACKAGE_BUGREPORT "sage-devel@googlegroups.com"
388| #define PACKAGE_URL ""
389| #define PACKAGE "sage"
390| #define VERSION "9.1.beta1"
391| /* end confdefs.h.  */
392|
393| int
394| main ()
395| {
396|
397|   ;
398|   return 0;
399| }
400configure:6594: gcc -c -g  conftest.m >&5
401gcc: fatal error: cannot execute 'cc1obj': execvp: No such file or directory
402compilation terminated.
403configure:6594: $? = 1
404configure: failed program was:
405| /* confdefs.h */
406| #define PACKAGE_NAME "Sage"
407| #define PACKAGE_TARNAME "sage"
408| #define PACKAGE_VERSION "9.1.beta1"
409| #define PACKAGE_STRING "Sage 9.1.beta1"
410| #define PACKAGE_BUGREPORT "sage-devel@googlegroups.com"
411| #define PACKAGE_URL ""
412| #define PACKAGE "sage"
413| #define VERSION "9.1.beta1"
414| /* end confdefs.h.  */
415|
416| int
417| main ()
418| {
419|
420|   ;
421|   return 0;
422| }
423configure:6604: result: no
424configure:6629: checking dependency style of gcc
425configure:6738: result: none
426configure:6807: checking for g++
427configure:6823: found /usr/lib/ccache/bin/g++
428configure:6834: result: g++
429configure:6859: checking for Objective C++ compiler version
430configure:6868: g++ --version >&5
431g++ (GCC) 9.2.0
432Copyright (C) 2019 Free Software Foundation, Inc.
433This is free software; see the source for copying conditions.  There is NO
434warranty; not even for MERCHANTABILITY or FITNESS FOR A PARTICULAR PURPOSE.
435
436configure:6879: $? = 0
437configure:6868: g++ -v >&5
438Using built-in specs.
439COLLECT_GCC=/usr/bin/g++
440COLLECT_LTO_WRAPPER=/usr/lib/gcc/x86_64-pc-linux-gnu/9.2.0/lto-wrapper
441Target: x86_64-pc-linux-gnu
442Configured with: /build/gcc/src/gcc/configure --prefix=/usr --libdir=/usr/lib --libexecdir=/usr/lib --mandir=/usr/share/man --infodir=/usr/share/info --with-bugurl=https://bugs.archlinux.org/ --enable-languages=c,c++,ada,fortran,go,lto,objc,obj-c++,d --enable-shared --enable-threads=posix --with-system-zlib --with-isl --enable-__cxa_atexit --disable-libunwind-exceptions --enable-clocale=gnu --disable-libstdcxx-pch --disable-libssp --enable-gnu-unique-object --enable-linker-build-id --enable-lto --enable-plugin --enable-install-libiberty --with-linker-hash-style=gnu --enable-gnu-indirect-function --enable-multilib --disable-werror --enable-checking=release --enable-default-pie --enable-default-ssp --enable-cet=auto gdc_include_dir=/usr/include/dlang/gdc
443Thread model: posix
444gcc version 9.2.0 (GCC)
445configure:6879: $? = 0
446configure:6868: g++ -V >&5
447g++: error: unrecognized command line option '-V'
448g++: fatal error: no input files
449compilation terminated.
450configure:6879: $? = 1
451configure:6868: g++ -qversion >&5
452g++: error: unrecognized command line option '-qversion'; did you mean '--version'?
453g++: fatal error: no input files
454compilation terminated.
455configure:6879: $? = 1
456configure:6883: checking whether we are using the GNU Objective C++ compiler
457configure:6902: g++ -c   conftest.mm >&5
458g++: fatal error: cannot execute 'cc1objplus': execvp: No such file or directory
459compilation terminated.
460configure:6902: $? = 1
461configure: failed program was:
462| /* confdefs.h */
463| #define PACKAGE_NAME "Sage"
464| #define PACKAGE_TARNAME "sage"
465| #define PACKAGE_VERSION "9.1.beta1"
466| #define PACKAGE_STRING "Sage 9.1.beta1"
467| #define PACKAGE_BUGREPORT "sage-devel@googlegroups.com"
468| #define PACKAGE_URL ""
469| #define PACKAGE "sage"
470| #define VERSION "9.1.beta1"
471| /* end confdefs.h.  */
472|
473| int
474| main ()
475| {
476| #ifndef __GNUC__
477|        choke me
478| #endif
479|
480|   ;
481|   return 0;
482| }
483configure:6911: result: no
484configure:6920: checking whether g++ accepts -g
485configure:6940: g++ -c -g  conftest.mm >&5
486g++: fatal error: cannot execute 'cc1objplus': execvp: No such file or directory
487compilation terminated.
488configure:6940: $? = 1
489configure: failed program was:
490| /* confdefs.h */
491| #define PACKAGE_NAME "Sage"
492| #define PACKAGE_TARNAME "sage"
493| #define PACKAGE_VERSION "9.1.beta1"
494| #define PACKAGE_STRING "Sage 9.1.beta1"
495| #define PACKAGE_BUGREPORT "sage-devel@googlegroups.com"
496| #define PACKAGE_URL ""
497| #define PACKAGE "sage"
498| #define VERSION "9.1.beta1"
499| /* end confdefs.h.  */
500|
501| int
502| main ()
503| {
504|
505|   ;
506|   return 0;
507| }
508configure:6955: g++ -c   conftest.mm >&5
509g++: fatal error: cannot execute 'cc1objplus': execvp: No such file or directory
510compilation terminated.
511configure:6955: $? = 1
512configure: failed program was:
513| /* confdefs.h */
514| #define PACKAGE_NAME "Sage"
515| #define PACKAGE_TARNAME "sage"
516| #define PACKAGE_VERSION "9.1.beta1"
517| #define PACKAGE_STRING "Sage 9.1.beta1"
518| #define PACKAGE_BUGREPORT "sage-devel@googlegroups.com"
519| #define PACKAGE_URL ""
520| #define PACKAGE "sage"
521| #define VERSION "9.1.beta1"
522| /* end confdefs.h.  */
523|
524| int
525| main ()
526| {
527|
528|   ;
529|   return 0;
530| }
531configure:6971: g++ -c -g  conftest.mm >&5
532g++: fatal error: cannot execute 'cc1objplus': execvp: No such file or directory
533compilation terminated.
534configure:6971: $? = 1
535configure: failed program was:
536| /* confdefs.h */
537| #define PACKAGE_NAME "Sage"
538| #define PACKAGE_TARNAME "sage"
539| #define PACKAGE_VERSION "9.1.beta1"
540| #define PACKAGE_STRING "Sage 9.1.beta1"
541| #define PACKAGE_BUGREPORT "sage-devel@googlegroups.com"
542| #define PACKAGE_URL ""
543| #define PACKAGE "sage"
544| #define VERSION "9.1.beta1"
545| /* end confdefs.h.  */
546|
547| int
548| main ()
549| {
550|
551|   ;
552|   return 0;
553| }
554configure:6981: result: no
555configure:7006: checking dependency style of g++
556configure:7115: result: none
557configure:7156: checking how to run the C++ preprocessor
558configure:7183: g++ -E  conftest.cpp
559configure:7183: $? = 0
560configure:7197: g++ -E  conftest.cpp
561conftest.cpp:11:10: fatal error: ac_nonexistent.h: No such file or directory
562   11 | #include <ac_nonexistent.h>
563      |          ^~~~~~~~~~~~~~~~~~
564compilation terminated.
565configure:7197: $? = 1
566configure: failed program was:
567| /* confdefs.h */
568| #define PACKAGE_NAME "Sage"
569| #define PACKAGE_TARNAME "sage"
570| #define PACKAGE_VERSION "9.1.beta1"
571| #define PACKAGE_STRING "Sage 9.1.beta1"
572| #define PACKAGE_BUGREPORT "sage-devel@googlegroups.com"
573| #define PACKAGE_URL ""
574| #define PACKAGE "sage"
575| #define VERSION "9.1.beta1"
576| /* end confdefs.h.  */
577| #include <ac_nonexistent.h>
578configure:7222: result: g++ -E
579configure:7242: g++ -E  conftest.cpp
580configure:7242: $? = 0
581configure:7256: g++ -E  conftest.cpp
582conftest.cpp:11:10: fatal error: ac_nonexistent.h: No such file or directory
583   11 | #include <ac_nonexistent.h>
584      |          ^~~~~~~~~~~~~~~~~~
585compilation terminated.
586configure:7256: $? = 1
587configure: failed program was:
588| /* confdefs.h */
589| #define PACKAGE_NAME "Sage"
590| #define PACKAGE_TARNAME "sage"
591| #define PACKAGE_VERSION "9.1.beta1"
592| #define PACKAGE_STRING "Sage 9.1.beta1"
593| #define PACKAGE_BUGREPORT "sage-devel@googlegroups.com"
594| #define PACKAGE_URL ""
595| #define PACKAGE "sage"
596| #define VERSION "9.1.beta1"
597| /* end confdefs.h.  */
598| #include <ac_nonexistent.h>
599configure:7285: checking for grep that handles long lines and -e
600configure:7343: result: /usr/bin/grep
601configure:7348: checking for egrep
602configure:7410: result: /usr/bin/grep -E
603configure:7415: checking for ANSI C header files
604configure:7435: g++ -c -g -O2  conftest.cpp >&5
605configure:7435: $? = 0
606configure:7508: g++ -o conftest -g -O2   conftest.cpp  >&5
607configure:7508: $? = 0
608configure:7508: ./conftest
609configure:7508: $? = 0
610configure:7519: result: yes
611configure:7532: checking for sys/types.h
612configure:7532: g++ -c -g -O2  conftest.cpp >&5
613configure:7532: $? = 0
614configure:7532: result: yes
615configure:7532: checking for sys/stat.h
616configure:7532: g++ -c -g -O2  conftest.cpp >&5
617configure:7532: $? = 0
618configure:7532: result: yes
619configure:7532: checking for stdlib.h
620configure:7532: g++ -c -g -O2  conftest.cpp >&5
621configure:7532: $? = 0
622configure:7532: result: yes
623configure:7532: checking for string.h
624configure:7532: g++ -c -g -O2  conftest.cpp >&5
625configure:7532: $? = 0
626configure:7532: result: yes
627configure:7532: checking for memory.h
628configure:7532: g++ -c -g -O2  conftest.cpp >&5
629configure:7532: $? = 0
630configure:7532: result: yes
631configure:7532: checking for strings.h
632configure:7532: g++ -c -g -O2  conftest.cpp >&5
633configure:7532: $? = 0
634configure:7532: result: yes
635configure:7532: checking for inttypes.h
636configure:7532: g++ -c -g -O2  conftest.cpp >&5
637configure:7532: $? = 0
638configure:7532: result: yes
639configure:7532: checking for stdint.h
640configure:7532: g++ -c -g -O2  conftest.cpp >&5
641configure:7532: $? = 0
642configure:7532: result: yes
643configure:7532: checking for unistd.h
644configure:7532: g++ -c -g -O2  conftest.cpp >&5
645configure:7532: $? = 0
646configure:7532: result: yes
647configure:7544: checking complex.h usability
648configure:7544: g++ -c -g -O2  conftest.cpp >&5
649configure:7544: $? = 0
650configure:7544: result: yes
651configure:7544: checking complex.h presence
652configure:7544: g++ -E  conftest.cpp
653configure:7544: $? = 0
654configure:7544: result: yes
655configure:7544: checking for complex.h
656configure:7544: result: yes
657configure:7567: checking for sqrt in -lm
658configure:7592: g++ -o conftest -g -O2   conftest.cpp -lm   >&5
659conftest.cpp:28:6: warning: declaration of 'char sqrt()' conflicts with built-in declaration 'double sqrt(double)' [-Wbuiltin-declaration-mismatch]
660   28 | char sqrt ();
661      |      ^~~~
662configure:7592: $? = 0
663configure:7601: result: yes
664configure:7719: checking Python version to install
665configure:7736: result: 3
666configure:7753: === checking whether to install the gcc SPKG ===
667configure:7874: checking for C++ compiler vendor
668configure:7921: g++ -c -g -O2  conftest.cpp >&5
669conftest.cpp: In function 'int main()':
670conftest.cpp:28:9: error: 'thisisanerror' was not declared in this scope
671   28 |         thisisanerror;
672      |         ^~~~~~~~~~~~~
673configure:7921: $? = 1
674configure: failed program was:
675| /* confdefs.h */
676| #define PACKAGE_NAME "Sage"
677| #define PACKAGE_TARNAME "sage"
678| #define PACKAGE_VERSION "9.1.beta1"
679| #define PACKAGE_STRING "Sage 9.1.beta1"
680| #define PACKAGE_BUGREPORT "sage-devel@googlegroups.com"
681| #define PACKAGE_URL ""
682| #define PACKAGE "sage"
683| #define VERSION "9.1.beta1"
684| #define STDC_HEADERS 1
685| #define HAVE_SYS_TYPES_H 1
686| #define HAVE_SYS_STAT_H 1
687| #define HAVE_STDLIB_H 1
688| #define HAVE_STRING_H 1
689| #define HAVE_MEMORY_H 1
690| #define HAVE_STRINGS_H 1
691| #define HAVE_INTTYPES_H 1
692| #define HAVE_STDINT_H 1
693| #define HAVE_UNISTD_H 1
694| #define HAVE_LIBM 1
695| /* end confdefs.h.  */
696|
697| int
698| main ()
699| {
700|
701|       #if !(defined(__ICC) || defined(__ECC) || defined(__INTEL_COMPILER))
702|         thisisanerror;
703|       #endif
704|
705|   ;
706|   return 0;
707| }
708configure:7921: g++ -c -g -O2  conftest.cpp >&5
709conftest.cpp: In function 'int main()':
710conftest.cpp:28:9: error: 'thisisanerror' was not declared in this scope
711   28 |         thisisanerror;
712      |         ^~~~~~~~~~~~~
713configure:7921: $? = 1
714configure: failed program was:
715| /* confdefs.h */
716| #define PACKAGE_NAME "Sage"
717| #define PACKAGE_TARNAME "sage"
718| #define PACKAGE_VERSION "9.1.beta1"
719| #define PACKAGE_STRING "Sage 9.1.beta1"
720| #define PACKAGE_BUGREPORT "sage-devel@googlegroups.com"
721| #define PACKAGE_URL ""
722| #define PACKAGE "sage"
723| #define VERSION "9.1.beta1"
724| #define STDC_HEADERS 1
725| #define HAVE_SYS_TYPES_H 1
726| #define HAVE_SYS_STAT_H 1
727| #define HAVE_STDLIB_H 1
728| #define HAVE_STRING_H 1
729| #define HAVE_MEMORY_H 1
730| #define HAVE_STRINGS_H 1
731| #define HAVE_INTTYPES_H 1
732| #define HAVE_STDINT_H 1
733| #define HAVE_UNISTD_H 1
734| #define HAVE_LIBM 1
735| /* end confdefs.h.  */
736|
737| int
738| main ()
739| {
740|
741|       #if !(defined(__xlc__) || defined(__xlC__) || defined(__IBMC__) || defined(__IBMCPP__))
742|         thisisanerror;
743|       #endif
744|
745|   ;
746|   return 0;
747| }
748configure:7921: g++ -c -g -O2  conftest.cpp >&5
749conftest.cpp: In function 'int main()':
750conftest.cpp:28:9: error: 'thisisanerror' was not declared in this scope
751   28 |         thisisanerror;
752      |         ^~~~~~~~~~~~~
753configure:7921: $? = 1
754configure: failed program was:
755| /* confdefs.h */
756| #define PACKAGE_NAME "Sage"
757| #define PACKAGE_TARNAME "sage"
758| #define PACKAGE_VERSION "9.1.beta1"
759| #define PACKAGE_STRING "Sage 9.1.beta1"
760| #define PACKAGE_BUGREPORT "sage-devel@googlegroups.com"
761| #define PACKAGE_URL ""
762| #define PACKAGE "sage"
763| #define VERSION "9.1.beta1"
764| #define STDC_HEADERS 1
765| #define HAVE_SYS_TYPES_H 1
766| #define HAVE_SYS_STAT_H 1
767| #define HAVE_STDLIB_H 1
768| #define HAVE_STRING_H 1
769| #define HAVE_MEMORY_H 1
770| #define HAVE_STRINGS_H 1
771| #define HAVE_INTTYPES_H 1
772| #define HAVE_STDINT_H 1
773| #define HAVE_UNISTD_H 1
774| #define HAVE_LIBM 1
775| /* end confdefs.h.  */
776|
777| int
778| main ()
779| {
780|
781|       #if !(defined(__PATHCC__) || defined(__PATHSCALE__))
782|         thisisanerror;
783|       #endif
784|
785|   ;
786|   return 0;
787| }
788configure:7921: g++ -c -g -O2  conftest.cpp >&5
789conftest.cpp: In function 'int main()':
790conftest.cpp:28:9: error: 'thisisanerror' was not declared in this scope
791   28 |         thisisanerror;
792      |         ^~~~~~~~~~~~~
793configure:7921: $? = 1
794configure: failed program was:
795| /* confdefs.h */
796| #define PACKAGE_NAME "Sage"
797| #define PACKAGE_TARNAME "sage"
798| #define PACKAGE_VERSION "9.1.beta1"
799| #define PACKAGE_STRING "Sage 9.1.beta1"
800| #define PACKAGE_BUGREPORT "sage-devel@googlegroups.com"
801| #define PACKAGE_URL ""
802| #define PACKAGE "sage"
803| #define VERSION "9.1.beta1"
804| #define STDC_HEADERS 1
805| #define HAVE_SYS_TYPES_H 1
806| #define HAVE_SYS_STAT_H 1
807| #define HAVE_STDLIB_H 1
808| #define HAVE_STRING_H 1
809| #define HAVE_MEMORY_H 1
810| #define HAVE_STRINGS_H 1
811| #define HAVE_INTTYPES_H 1
812| #define HAVE_STDINT_H 1
813| #define HAVE_UNISTD_H 1
814| #define HAVE_LIBM 1
815| /* end confdefs.h.  */
816|
817| int
818| main ()
819| {
820|
821|       #if !(defined(__clang__))
822|         thisisanerror;
823|       #endif
824|
825|   ;
826|   return 0;
827| }
828configure:7921: g++ -c -g -O2  conftest.cpp >&5
829conftest.cpp: In function 'int main()':
830conftest.cpp:28:9: error: 'thisisanerror' was not declared in this scope
831   28 |         thisisanerror;
832      |         ^~~~~~~~~~~~~
833configure:7921: $? = 1
834configure: failed program was:
835| /* confdefs.h */
836| #define PACKAGE_NAME "Sage"
837| #define PACKAGE_TARNAME "sage"
838| #define PACKAGE_VERSION "9.1.beta1"
839| #define PACKAGE_STRING "Sage 9.1.beta1"
840| #define PACKAGE_BUGREPORT "sage-devel@googlegroups.com"
841| #define PACKAGE_URL ""
842| #define PACKAGE "sage"
843| #define VERSION "9.1.beta1"
844| #define STDC_HEADERS 1
845| #define HAVE_SYS_TYPES_H 1
846| #define HAVE_SYS_STAT_H 1
847| #define HAVE_STDLIB_H 1
848| #define HAVE_STRING_H 1
849| #define HAVE_MEMORY_H 1
850| #define HAVE_STRINGS_H 1
851| #define HAVE_INTTYPES_H 1
852| #define HAVE_STDINT_H 1
853| #define HAVE_UNISTD_H 1
854| #define HAVE_LIBM 1
855| /* end confdefs.h.  */
856|
857| int
858| main ()
859| {
860|
861|       #if !(defined(_CRAYC))
862|         thisisanerror;
863|       #endif
864|
865|   ;
866|   return 0;
867| }
868configure:7921: g++ -c -g -O2  conftest.cpp >&5
869conftest.cpp: In function 'int main()':
870conftest.cpp:28:9: error: 'thisisanerror' was not declared in this scope
871   28 |         thisisanerror;
872      |         ^~~~~~~~~~~~~
873configure:7921: $? = 1
874configure: failed program was:
875| /* confdefs.h */
876| #define PACKAGE_NAME "Sage"
877| #define PACKAGE_TARNAME "sage"
878| #define PACKAGE_VERSION "9.1.beta1"
879| #define PACKAGE_STRING "Sage 9.1.beta1"
880| #define PACKAGE_BUGREPORT "sage-devel@googlegroups.com"
881| #define PACKAGE_URL ""
882| #define PACKAGE "sage"
883| #define VERSION "9.1.beta1"
884| #define STDC_HEADERS 1
885| #define HAVE_SYS_TYPES_H 1
886| #define HAVE_SYS_STAT_H 1
887| #define HAVE_STDLIB_H 1
888| #define HAVE_STRING_H 1
889| #define HAVE_MEMORY_H 1
890| #define HAVE_STRINGS_H 1
891| #define HAVE_INTTYPES_H 1
892| #define HAVE_STDINT_H 1
893| #define HAVE_UNISTD_H 1
894| #define HAVE_LIBM 1
895| /* end confdefs.h.  */
896|
897| int
898| main ()
899| {
900|
901|       #if !(defined(__FUJITSU))
902|         thisisanerror;
903|       #endif
904|
905|   ;
906|   return 0;
907| }
908configure:7921: g++ -c -g -O2  conftest.cpp >&5
909configure:7921: $? = 0
910configure:7929: result: gnu
911configure:7949: checking whether g++ supports C++11 features with -std=gnu++11
912configure:8245: g++ -std=gnu++11 -c -g -O2  conftest.cpp >&5
913configure:8245: $? = 0
914configure:8254: result: yes
915configure:8655: checking for gcc option to accept ISO C99
916configure:8804: gcc  -c -g -O2  conftest.c >&5
917configure:8804: $? = 0
918configure:8817: result: none needed
919configure:8898: checking if gcc accepts -dumpversion option
920configure:8923: cat conftest.c 1>&5
921int main()
922{
923        return 0;
924}
925configure:8926: $? = 0
926configure:8930: gcc  -dumpversion -c conftest.c 1>&5
9279.2.0
928configure:8933: $? = 0
929configure:8936: result: yes
930configure:8963: checking gcc version
931configure:8977: result: 9.2.0
932configure:8991: checking if g++ accepts -dumpversion option
933configure:9016: cat conftest.c 1>&5
934int main()
935{
936        return 0;
937}
938configure:9019: $? = 0
939configure:9023: gcc  -dumpversion -c conftest.c 1>&5
9409.2.0
941configure:9026: $? = 0
942configure:9029: result: yes
943configure:9056: checking g++ version
944configure:9070: result: 9.2.0
945configure:9030: checking for the location of crti.o
946configure:9040: result: /usr/lib/gcc/x86_64-pc-linux-gnu/9.2.0/../../../../lib
947configure:9056: === checking whether to install the lrcalc SPKG ===
948configure:9101: checking for lrcalc/schublib.h
949configure:9101: g++ -std=gnu++11 -c -g -O2  conftest.cpp >&5
950configure:9101: $? = 0
951configure:9101: result: yes
952configure:9111: checking for library containing mult_poly_schubert
953configure:9142: g++ -std=gnu++11 -o conftest -g -O2   conftest.cpp -lm  >&5
954/usr/bin/ld: /tmp/ccD0ElLT.o: in function `main':
955/opt/sage/conftest.cpp:35: undefined reference to `mult_poly_schubert'
956collect2: error: ld returned 1 exit status
957configure:9142: $? = 1
958configure: failed program was:
959| /* confdefs.h */
960| #define PACKAGE_NAME "Sage"
961| #define PACKAGE_TARNAME "sage"
962| #define PACKAGE_VERSION "9.1.beta1"
963| #define PACKAGE_STRING "Sage 9.1.beta1"
964| #define PACKAGE_BUGREPORT "sage-devel@googlegroups.com"
965| #define PACKAGE_URL ""
966| #define PACKAGE "sage"
967| #define VERSION "9.1.beta1"
968| #define STDC_HEADERS 1
969| #define HAVE_SYS_TYPES_H 1
970| #define HAVE_SYS_STAT_H 1
971| #define HAVE_STDLIB_H 1
972| #define HAVE_STRING_H 1
973| #define HAVE_MEMORY_H 1
974| #define HAVE_STRINGS_H 1
975| #define HAVE_INTTYPES_H 1
976| #define HAVE_STDINT_H 1
977| #define HAVE_UNISTD_H 1
978| #define HAVE_LIBM 1
979| #define HAVE_CXX11 1
980| #define HAVE_LRCALC_SCHUBLIB_H 1
981| /* end confdefs.h.  */
982|
983| /* Override any GCC internal prototype to avoid an error.
984|    Use char because int might match the return type of a GCC
985|    builtin and then its argument prototype would still apply.  */
986| #ifdef __cplusplus
987| extern "C"
988| #endif
989| char mult_poly_schubert ();
990| int
991| main ()
992| {
993| return mult_poly_schubert ();
994|   ;
995|   return 0;
996| }
997configure:9142: g++ -std=gnu++11 -o conftest -g -O2   conftest.cpp -llrcalc  -lm  >&5
998configure:9142: $? = 0
999configure:9159: result: -llrcalc
1000configure:9206: === checking whether to install the zlib SPKG ===
1001configure:9249: checking for inflateEnd in -lz
1002configure:9274: g++ -std=gnu++11 -o conftest -g -O2   conftest.cpp -lz  -llrcalc -lm  >&5
1003configure:9274: $? = 0
1004configure:9283: result: yes
1005configure:9291: checking zlib.h usability
1006configure:9291: g++ -std=gnu++11 -c -g -O2  conftest.cpp >&5
1007configure:9291: $? = 0
1008configure:9291: result: yes
1009configure:9291: checking zlib.h presence
1010configure:9291: g++ -E -std=gnu++11  conftest.cpp
1011configure:9291: $? = 0
1012configure:9291: result: yes
1013configure:9291: checking for zlib.h
1014configure:9291: result: yes
1015configure:9302: checking for LIBPNG
1016configure:9309: $PKG_CONFIG --exists --print-errors "libpng >= 1.2"
1017configure:9312: $? = 0
1018configure:9326: $PKG_CONFIG --exists --print-errors "libpng >= 1.2"
1019configure:9329: $? = 0
1020configure:9463: result: yes
1021configure:9500: === checking whether to install the libpng SPKG ===
1022configure:9544: checking installing zlib?
1023configure:9551: result: no
1024configure:9555: checking for LIBPNG
1025configure:9766: result: yes
1026configure:9801: === checking whether to install the tachyon SPKG ===
1027configure:9846: checking for tachyon
1028configure:9864: found /usr/bin/tachyon
1029configure:9876: result: /usr/bin/tachyon
1030configure:9922: === checking whether to install the zeromq SPKG ===
1031configure:9988: checking zmq.h usability
1032configure:9988: gcc -c -g -O2   conftest.c >&5
1033configure:9988: $? = 0
1034configure:9988: result: yes
1035configure:9988: checking zmq.h presence
1036configure:9988: gcc -E   conftest.c
1037configure:9988: $? = 0
1038configure:9988: result: yes
1039configure:9988: checking for zmq.h
1040configure:9988: result: yes
1041configure:10005: checking for ZMQ version >= 4.2.5
1042configure:10020: result: yes
1043configure:10085: === checking whether to install the symmetrica SPKG ===
1044configure:10134: checking symmetrica/def.h usability
1045configure:10134: gcc -c -g -O2   conftest.c >&5
1046configure:10134: $? = 0
1047configure:10134: result: yes
1048configure:10134: checking symmetrica/def.h presence
1049configure:10134: gcc -E   conftest.c
1050configure:10134: $? = 0
1051configure:10134: result: yes
1052configure:10134: checking for symmetrica/def.h
1053configure:10134: result: yes
1054configure:10137: checking for library containing zykelind_tetraeder_edges_extended
1055configure:10168: gcc -o conftest -g -O2    conftest.c -llrcalc -lm  >&5
1056/usr/bin/ld: /tmp/ccTFqGQA.o: in function `main':
1057/opt/sage/conftest.c:36: undefined reference to `zykelind_tetraeder_edges_extended'
1058collect2: error: ld returned 1 exit status
1059configure:10168: $? = 1
1060configure: failed program was:
1061| /* confdefs.h */
1062| #define PACKAGE_NAME "Sage"
1063| #define PACKAGE_TARNAME "sage"
1064| #define PACKAGE_VERSION "9.1.beta1"
1065| #define PACKAGE_STRING "Sage 9.1.beta1"
1066| #define PACKAGE_BUGREPORT "sage-devel@googlegroups.com"
1067| #define PACKAGE_URL ""
1068| #define PACKAGE "sage"
1069| #define VERSION "9.1.beta1"
1070| #define STDC_HEADERS 1
1071| #define HAVE_SYS_TYPES_H 1
1072| #define HAVE_SYS_STAT_H 1
1073| #define HAVE_STDLIB_H 1
1074| #define HAVE_STRING_H 1
1075| #define HAVE_MEMORY_H 1
1076| #define HAVE_STRINGS_H 1
1077| #define HAVE_INTTYPES_H 1
1078| #define HAVE_STDINT_H 1
1079| #define HAVE_UNISTD_H 1
1080| #define HAVE_LIBM 1
1081| #define HAVE_CXX11 1
1082| #define HAVE_LRCALC_SCHUBLIB_H 1
1083| #define HAVE_ZMQ /**/
1084| /* end confdefs.h.  */
1085|
1086| /* Override any GCC internal prototype to avoid an error.
1087|    Use char because int might match the return type of a GCC
1088|    builtin and then its argument prototype would still apply.  */
1089| #ifdef __cplusplus
1090| extern "C"
1091| #endif
1092| char zykelind_tetraeder_edges_extended ();
1093| int
1094| main ()
1095| {
1096| return zykelind_tetraeder_edges_extended ();
1097|   ;
1098|   return 0;
1099| }
1100configure:10168: gcc -o conftest -g -O2    conftest.c -lsymmetrica  -llrcalc -lm  >&5
1101configure:10168: $? = 0
1102configure:10185: result: -lsymmetrica
1103configure:10191: checking that we have a properly patched Symmetrica version...
1104configure:10218: gcc -o conftest -g -O2    conftest.c -lsymmetrica -llrcalc -lm  >&5
1105configure:10218: $? = 0
1106configure:10218: ./conftest
1107configure:10218: $? = 0
1108configure:10219: result: appears to be a well-patched version.
1109configure:10277: === checking whether to install the libatomic_ops SPKG ===
1110configure:10322: checking for LIBATOMIC_OPS
1111configure:10329: $PKG_CONFIG --exists --print-errors "atomic_ops >= 7.6.2"
1112configure:10332: $? = 0
1113configure:10346: $PKG_CONFIG --exists --print-errors "atomic_ops >= 7.6.2"
1114configure:10349: $? = 0
1115configure:10387: result: yes
1116configure:10421: === checking whether to install the mpir SPKG ===
1117configure:10494: checking gmp.h usability
1118configure:10494: g++ -std=gnu++11 -c -g -O2   conftest.cpp >&5
1119configure:10494: $? = 0
1120configure:10494: result: yes
1121configure:10494: checking gmp.h presence
1122configure:10494: g++ -E -std=gnu++11   conftest.cpp
1123configure:10494: $? = 0
1124configure:10494: result: yes
1125configure:10494: checking for gmp.h
1126configure:10494: result: yes
1127configure:10502: checking gmpxx.h usability
1128configure:10502: g++ -std=gnu++11 -c -g -O2   conftest.cpp >&5
1129configure:10502: $? = 0
1130configure:10502: result: yes
1131configure:10502: checking gmpxx.h presence
1132configure:10502: g++ -E -std=gnu++11   conftest.cpp
1133configure:10502: $? = 0
1134configure:10502: result: yes
1135configure:10502: checking for gmpxx.h
1136configure:10502: result: yes
1137configure:10510: checking for library containing __gmpq_cmp_z
1138configure:10541: g++ -std=gnu++11 -o conftest -g -O2    conftest.cpp -lsymmetrica -llrcalc -lm  >&5
1139/usr/bin/ld: /tmp/ccm9oqny.o: in function `main':
1140/opt/sage/conftest.cpp:36: undefined reference to `__gmpq_cmp_z'
1141collect2: error: ld returned 1 exit status
1142configure:10541: $? = 1
1143configure: failed program was:
1144| /* confdefs.h */
1145| #define PACKAGE_NAME "Sage"
1146| #define PACKAGE_TARNAME "sage"
1147| #define PACKAGE_VERSION "9.1.beta1"
1148| #define PACKAGE_STRING "Sage 9.1.beta1"
1149| #define PACKAGE_BUGREPORT "sage-devel@googlegroups.com"
1150| #define PACKAGE_URL ""
1151| #define PACKAGE "sage"
1152| #define VERSION "9.1.beta1"
1153| #define STDC_HEADERS 1
1154| #define HAVE_SYS_TYPES_H 1
1155| #define HAVE_SYS_STAT_H 1
1156| #define HAVE_STDLIB_H 1
1157| #define HAVE_STRING_H 1
1158| #define HAVE_MEMORY_H 1
1159| #define HAVE_STRINGS_H 1
1160| #define HAVE_INTTYPES_H 1
1161| #define HAVE_STDINT_H 1
1162| #define HAVE_UNISTD_H 1
1163| #define HAVE_LIBM 1
1164| #define HAVE_CXX11 1
1165| #define HAVE_LRCALC_SCHUBLIB_H 1
1166| #define HAVE_ZMQ /**/
1167| /* end confdefs.h.  */
1168|
1169| /* Override any GCC internal prototype to avoid an error.
1170|    Use char because int might match the return type of a GCC
1171|    builtin and then its argument prototype would still apply.  */
1172| #ifdef __cplusplus
1173| extern "C"
1174| #endif
1175| char __gmpq_cmp_z ();
1176| int
1177| main ()
1178| {
1179| return __gmpq_cmp_z ();
1180|   ;
1181|   return 0;
1182| }
1183configure:10541: g++ -std=gnu++11 -o conftest -g -O2    conftest.cpp -lgmp  -lsymmetrica -llrcalc -lm  >&5
1184configure:10541: $? = 0
1185configure:10558: result: -lgmp
1186configure:10604: checking absolute name of <gmp.h>
1187configure:10611: checking for gmp.h
1188configure:10611: result: yes
1189configure:10635: result: ///usr/include/gmp.h
1190configure:10671: result: using GMP-compatible library from the system
1191configure:10688: === checking whether to install the gmp SPKG ===
1192configure:10765: === checking whether to install the glpk SPKG ===
1193configure:10814: checking installing any of gmp mpir zlib?
1194configure:10823: result: no
1195configure:10828: checking for glpsol
1196configure:10846: found /usr/bin/glpsol
1197configure:10858: result: /usr/bin/glpsol
1198configure:10907: checking glpk.h usability
1199configure:10907: g++ -std=gnu++11 -c -g -O2   conftest.cpp >&5
1200configure:10907: $? = 0
1201configure:10907: result: yes
1202configure:10907: checking glpk.h presence
1203configure:10907: g++ -E -std=gnu++11   conftest.cpp
1204configure:10907: $? = 0
1205configure:10907: result: yes
1206configure:10907: checking for glpk.h
1207configure:10907: result: yes
1208configure:10915: checking for library containing glp_config
1209configure:10946: g++ -std=gnu++11 -o conftest -g -O2    conftest.cpp -lgmp -lsymmetrica -llrcalc -lm  >&5
1210/usr/bin/ld: /tmp/ccLM9v5j.o: in function `main':
1211/opt/sage/conftest.cpp:38: undefined reference to `glp_config'
1212collect2: error: ld returned 1 exit status
1213configure:10946: $? = 1
1214configure: failed program was:
1215| /* confdefs.h */
1216| #define PACKAGE_NAME "Sage"
1217| #define PACKAGE_TARNAME "sage"
1218| #define PACKAGE_VERSION "9.1.beta1"
1219| #define PACKAGE_STRING "Sage 9.1.beta1"
1220| #define PACKAGE_BUGREPORT "sage-devel@googlegroups.com"
1221| #define PACKAGE_URL ""
1222| #define PACKAGE "sage"
1223| #define VERSION "9.1.beta1"
1224| #define STDC_HEADERS 1
1225| #define HAVE_SYS_TYPES_H 1
1226| #define HAVE_SYS_STAT_H 1
1227| #define HAVE_STDLIB_H 1
1228| #define HAVE_STRING_H 1
1229| #define HAVE_MEMORY_H 1
1230| #define HAVE_STRINGS_H 1
1231| #define HAVE_INTTYPES_H 1
1232| #define HAVE_STDINT_H 1
1233| #define HAVE_UNISTD_H 1
1234| #define HAVE_LIBM 1
1235| #define HAVE_CXX11 1
1236| #define HAVE_LRCALC_SCHUBLIB_H 1
1237| #define HAVE_ZMQ /**/
1238| #define HAVE_GMP_H 1
1239| #define ABSOLUTE_GMP_H "///usr/include/gmp.h"
1240| /* end confdefs.h.  */
1241|
1242| /* Override any GCC internal prototype to avoid an error.
1243|    Use char because int might match the return type of a GCC
1244|    builtin and then its argument prototype would still apply.  */
1245| #ifdef __cplusplus
1246| extern "C"
1247| #endif
1248| char glp_config ();
1249| int
1250| main ()
1251| {
1252| return glp_config ();
1253|   ;
1254|   return 0;
1255| }
1256configure:10946: g++ -std=gnu++11 -o conftest -g -O2    conftest.cpp -lglpk  -lgmp -lsymmetrica -llrcalc -lm  >&5
1257configure:10946: $? = 0
1258configure:10963: result: -lglpk
1259configure:10968: result: yes. Use system's glpk
1260configure:11012: result: using glpk from the system
1261configure:11029: === checking whether to install the cmake SPKG ===
1262configure:11072: checking for cmake >= 3.4
1263configure:11149: result: /usr/bin/cmake
1264configure:11184: === checking whether to install the ncurses SPKG ===
1265configure:11229: checking for NCURSES
1266configure:11236: $PKG_CONFIG --exists --print-errors "ncurses >= 6.0"
1267configure:11239: $? = 0
1268configure:11253: $PKG_CONFIG --exists --print-errors "ncurses >= 6.0"
1269configure:11256: $? = 0
1270configure:11434: result: yes
1271configure:11468: === checking whether to install the readline SPKG ===
1272configure:11512: checking Installing ncurses?
1273configure:11519: result: No.
1274configure:11523: checking for READLINE
1275configure:11530: $PKG_CONFIG --exists --print-errors "readline >= 6.0"
1276configure:11533: $? = 0
1277configure:11547: $PKG_CONFIG --exists --print-errors "readline >= 6.0"
1278configure:11550: $? = 0
1279configure:11728: result: yes
1280configure:11763: === checking whether to install the pari SPKG ===
1281configure:11809: checking installing gmp/mpir or readline?
1282configure:11815: result: no
1283configure:11817: checking installing PARI/GP packages?
1284configure:11821: checking for gp
1285configure:11839: found /usr/bin/gp
1286configure:11851: result: /usr/bin/gp
1287configure:11863: checking is pari_elldata installed?
1288  ***   at top-level: r=ellinit("11a1");r[11]
1289  ***                   ^---------------------
1290  *** ellinit: error opening elldata file: `/usr/share/pari/elldata/ell0'.
1291configure:11870: result: no; cannot use system pari/GP without elldata package
1292configure:11872: Install elldata package and reconfigure.
1293configure:11874: Otherwise Sage will build its own pari/GP.
1294configure:11878: checking is pari_galdata installed?
1295configure:11882: result: yes
1296configure:11893: checking is pari_galpol installed?
1297  ***   at top-level: galoisgetname(12,1)=="C3 : C4"
1298  ***                 ^------------------------------
1299  *** galoisgetname: error opening galpol file: `/usr/share/pari/galpol/12/nb'.
1300configure:11900: result: no; cannot use system pari/GP without galpol package
1301configure:11902: Install galpol package and reconfigure.
1302configure:11904: Otherwise Sage will build its own pari/GP.
1303configure:11908: checking is pari_seadata installed?
1304  ***   at top-level: poldegree(ellmodulareqn(211)[1])
1305  ***                           ^----------------------
1306  *** ellmodulareqn: error opening seadata file: `/usr/share/pari/seadata/sea211'.
1307configure:11915: result: no; cannot use system pari/GP without seadata package
1308configure:11917: Install seadata package and reconfigure.
1309configure:11919: Otherwise Sage will build its own pari/GP.
1310configure:12152: result: using Sage's pari SPKG
1311configure:12174: === checking whether to install the pari_galpol SPKG ===
1312configure:12219: checking installing pari?
1313configure:12222: result: yes; install pari_galpol as well
1314configure:12260: === checking whether to install the mpfr SPKG ===
1315configure:12304: checking installing gmp/mpir?
1316configure:12311: result: no
1317configure:12313: checking mpfr.h usability
1318configure:12313: g++ -std=gnu++11 -c -g -O2   conftest.cpp >&5
1319configure:12313: $? = 0
1320configure:12313: result: yes
1321configure:12313: checking mpfr.h presence
1322configure:12313: g++ -E -std=gnu++11   conftest.cpp
1323configure:12313: $? = 0
1324configure:12313: result: yes
1325configure:12313: checking for mpfr.h
1326configure:12313: result: yes
1327configure:12321: checking for library containing mpfr_free_pool
1328configure:12352: g++ -std=gnu++11 -o conftest -g -O2    conftest.cpp -lglpk -lgmp -lsymmetrica -llrcalc -lm  >&5
1329/usr/bin/ld: /tmp/ccwEwJWC.o: in function `main':
1330/opt/sage/conftest.cpp:38: undefined reference to `mpfr_free_pool'
1331collect2: error: ld returned 1 exit status
1332configure:12352: $? = 1
1333configure: failed program was:
1334| /* confdefs.h */
1335| #define PACKAGE_NAME "Sage"
1336| #define PACKAGE_TARNAME "sage"
1337| #define PACKAGE_VERSION "9.1.beta1"
1338| #define PACKAGE_STRING "Sage 9.1.beta1"
1339| #define PACKAGE_BUGREPORT "sage-devel@googlegroups.com"
1340| #define PACKAGE_URL ""
1341| #define PACKAGE "sage"
1342| #define VERSION "9.1.beta1"
1343| #define STDC_HEADERS 1
1344| #define HAVE_SYS_TYPES_H 1
1345| #define HAVE_SYS_STAT_H 1
1346| #define HAVE_STDLIB_H 1
1347| #define HAVE_STRING_H 1
1348| #define HAVE_MEMORY_H 1
1349| #define HAVE_STRINGS_H 1
1350| #define HAVE_INTTYPES_H 1
1351| #define HAVE_STDINT_H 1
1352| #define HAVE_UNISTD_H 1
1353| #define HAVE_LIBM 1
1354| #define HAVE_CXX11 1
1355| #define HAVE_LRCALC_SCHUBLIB_H 1
1356| #define HAVE_ZMQ /**/
1357| #define HAVE_GMP_H 1
1358| #define ABSOLUTE_GMP_H "///usr/include/gmp.h"
1359| /* end confdefs.h.  */
1360|
1361| /* Override any GCC internal prototype to avoid an error.
1362|    Use char because int might match the return type of a GCC
1363|    builtin and then its argument prototype would still apply.  */
1364| #ifdef __cplusplus
1365| extern "C"
1366| #endif
1367| char mpfr_free_pool ();
1368| int
1369| main ()
1370| {
1371| return mpfr_free_pool ();
1372|   ;
1373|   return 0;
1374| }
1375configure:12352: g++ -std=gnu++11 -o conftest -g -O2    conftest.cpp -lmpfr  -lglpk -lgmp -lsymmetrica -llrcalc -lm  >&5
1376configure:12352: $? = 0
1377configure:12369: result: -lmpfr
1378configure:12405: result: using mpfr library from the system
1379configure:12422: === checking whether to install the mpfi SPKG ===
1380configure:12466: checking installing mpfr?
1381configure:12473: result: no
1382configure:12481: checking mpfi.h usability
1383configure:12481: g++ -std=gnu++11 -c -g -O2   conftest.cpp >&5
1384configure:12481: $? = 0
1385configure:12481: result: yes
1386configure:12481: checking mpfi.h presence
1387configure:12481: g++ -E -std=gnu++11   conftest.cpp
1388configure:12481: $? = 0
1389configure:12481: result: yes
1390configure:12481: checking for mpfi.h
1391configure:12481: result: yes
1392configure:12489: checking for library containing mpfi_diam_abs
1393configure:12520: g++ -std=gnu++11 -o conftest -g -O2    conftest.cpp -lmpfr -lglpk -lgmp -lsymmetrica -llrcalc -lm  >&5
1394/usr/bin/ld: /tmp/ccBHjvEm.o: in function `main':
1395/opt/sage/conftest.cpp:38: undefined reference to `mpfi_diam_abs'
1396collect2: error: ld returned 1 exit status
1397configure:12520: $? = 1
1398configure: failed program was:
1399| /* confdefs.h */
1400| #define PACKAGE_NAME "Sage"
1401| #define PACKAGE_TARNAME "sage"
1402| #define PACKAGE_VERSION "9.1.beta1"
1403| #define PACKAGE_STRING "Sage 9.1.beta1"
1404| #define PACKAGE_BUGREPORT "sage-devel@googlegroups.com"
1405| #define PACKAGE_URL ""
1406| #define PACKAGE "sage"
1407| #define VERSION "9.1.beta1"
1408| #define STDC_HEADERS 1
1409| #define HAVE_SYS_TYPES_H 1
1410| #define HAVE_SYS_STAT_H 1
1411| #define HAVE_STDLIB_H 1
1412| #define HAVE_STRING_H 1
1413| #define HAVE_MEMORY_H 1
1414| #define HAVE_STRINGS_H 1
1415| #define HAVE_INTTYPES_H 1
1416| #define HAVE_STDINT_H 1
1417| #define HAVE_UNISTD_H 1
1418| #define HAVE_LIBM 1
1419| #define HAVE_CXX11 1
1420| #define HAVE_LRCALC_SCHUBLIB_H 1
1421| #define HAVE_ZMQ /**/
1422| #define HAVE_GMP_H 1
1423| #define ABSOLUTE_GMP_H "///usr/include/gmp.h"
1424| /* end confdefs.h.  */
1425|
1426| /* Override any GCC internal prototype to avoid an error.
1427|    Use char because int might match the return type of a GCC
1428|    builtin and then its argument prototype would still apply.  */
1429| #ifdef __cplusplus
1430| extern "C"
1431| #endif
1432| char mpfi_diam_abs ();
1433| int
1434| main ()
1435| {
1436| return mpfi_diam_abs ();
1437|   ;
1438|   return 0;
1439| }
1440configure:12520: g++ -std=gnu++11 -o conftest -g -O2    conftest.cpp -lmpfi  -lmpfr -lglpk -lgmp -lsymmetrica -llrcalc -lm  >&5
1441configure:12520: $? = 0
1442configure:12537: result: -lmpfi
1443configure:12549: checking MPFI version >= 1.5
1444configure:12577: gcc -o conftest -g -O2    conftest.c -lmpfi -lmpfr -lglpk -lgmp -lsymmetrica -llrcalc -lm  >&5
1445configure:12577: $? = 0
1446configure:12577: ./conftest
1447configure:12577: $? = 0
1448configure:12578: result: .. yes
1449configure:12634: === checking whether to install the pkgconf SPKG ===
1450configure:12677: checking for pkg-config >= 0.29
1451configure:12753: result: /usr/bin/pkg-config
1452configure:12766: result: using pkg-config from the system
1453configure:12800: === checking whether to install the pari_seadata SPKG ===
1454configure:12845: checking installing pari?
1455configure:12848: result: yes; install pari_seadata as well
1456configure:12886: === checking whether to install the ninja_build SPKG ===
1457configure:12929: checking for ninja >= 1.7.2
1458configure:13006: result: /usr/bin/ninja
1459configure:13041: === checking whether to install the freetype SPKG ===
1460configure:13085: checking Installing libpng?
1461configure:13092: result: no
1462configure:13096: checking for FREETYPE
1463configure:13103: $PKG_CONFIG --exists --print-errors "freetype2 >= 2.4"
1464configure:13106: $? = 0
1465configure:13120: $PKG_CONFIG --exists --print-errors "freetype2 >= 2.4"
1466configure:13123: $? = 0
1467configure:13161: result: yes
1468configure:13203: === checking whether to install the libgd SPKG ===
1469configure:13248: checking Installing freetype?
1470configure:13255: checking Installing libpng?
1471configure:13262: result: No.
1472configure:13266: checking for LIBGD
1473configure:13273: $PKG_CONFIG --exists --print-errors "gdlib >= 2.1"
1474configure:13276: $? = 0
1475configure:13290: $PKG_CONFIG --exists --print-errors "gdlib >= 2.1"
1476configure:13293: $? = 0
1477configure:13331: result: yes
1478configure:13367: === checking whether to install the pari_elldata SPKG ===
1479configure:13412: checking installing pari?
1480configure:13415: result: yes; install pari_elldata as well
1481configure:13453: === checking whether to install the pari_galdata SPKG ===
1482configure:13498: checking installing pari?
1483configure:13501: result: yes; install pari_galdata as well
1484configure:13538: checking for Fortran flag needed to accept free-form source
1485configure:13557: gfortran -c -g -O2  conftest.f >&5
1486conftest.f:2:3:
1487
1488    2 |   program freeform
1489      |   1
1490Error: Non-numeric character in statement label at (1)
1491conftest.f:4:26:
1492
1493    4 |        print *, 'Hello ', &
1494      |                          1
1495Error: Expected expression in PRINT statement at (1)
1496conftest.f:5:11:
1497
1498    5 |           'world.'
1499      |           1
1500Error: Invalid character in name at (1)
1501configure:13557: $? = 1
1502configure: failed program was:
1503|
1504|   program freeform
1505|        ! FIXME: how to best confuse non-freeform compilers?
1506|        print *, 'Hello ', &
1507|           'world.'
1508|        end
1509configure:13557: gfortran -c -g -O2 -ffree-form  conftest.f >&5
1510configure:13557: $? = 0
1511configure:13566: result: -ffree-form
1512configure:13595: === checking whether to install the gfortran SPKG ===
1513configure:13680: checking how to get verbose linking output from gfortran
1514configure:13690: gfortran -c -g -O2 -ffree-form  conftest.f >&5
1515configure:13690: $? = 0
1516configure:13708: gfortran -o conftest -g -O2 -ffree-form -v conftest.f -lmpfi -lmpfr -lglpk -lgmp -lsymmetrica -llrcalc -lm
1517Using built-in specs.
1518Target: x86_64-pc-linux-gnu
1519Thread model: posix
1520gcc version 9.2.0 (GCC)
1521 /usr/lib/gcc/x86_64-pc-linux-gnu/9.2.0/f951 conftest.f -quiet -dumpbase conftest.f -mtune=generic -march=x86-64 -auxbase conftest -g -O2 -version -ffree-form -fintrinsic-modules-path /usr/lib/gcc/x86_64-pc-linux-gnu/9.2.0/finclude -fpre-include=/usr/include/finclude/math-vector-fortran.h -o /tmp/cc6skucY.s
1522GNU Fortran (GCC) version 9.2.0 (x86_64-pc-linux-gnu)
1523        compiled by GNU C version 9.2.0, GMP version 6.1.2, MPFR version 4.0.2, MPC version 1.1.0, isl version isl-0.21-GMP
1524
1525GGC heuristics: --param ggc-min-expand=100 --param ggc-min-heapsize=131072
1526GNU Fortran2008 (GCC) version 9.2.0 (x86_64-pc-linux-gnu)
1527        compiled by GNU C version 9.2.0, GMP version 6.1.2, MPFR version 4.0.2, MPC version 1.1.0, isl version isl-0.21-GMP
1528
1529GGC heuristics: --param ggc-min-expand=100 --param ggc-min-heapsize=131072
1530 as -v --64 -o /tmp/ccfQEeXW.o /tmp/cc6skucY.s
1531GNU assembler version 2.33.1 (x86_64-pc-linux-gnu) using BFD version (GNU Binutils) 2.33.1
1532Reading specs from /usr/lib/gcc/x86_64-pc-linux-gnu/9.2.0/../../../../lib/libgfortran.spec
1533rename spec lib to liborig
1534 /usr/lib/gcc/x86_64-pc-linux-gnu/9.2.0/collect2 -plugin /usr/lib/gcc/x86_64-pc-linux-gnu/9.2.0/liblto_plugin.so -plugin-opt=/usr/lib/gcc/x86_64-pc-linux-gnu/9.2.0/lto-wrapper -plugin-opt=-fresolution=/tmp/ccU1LUW0.res -plugin-opt=-pass-through=-lgcc_s -plugin-opt=-pass-through=-lgcc -plugin-opt=-pass-through=-lquadmath -plugin-opt=-pass-through=-lm -plugin-opt=-pass-through=-lgcc_s -plugin-opt=-pass-through=-lgcc -plugin-opt=-pass-through=-lc -plugin-opt=-pass-through=-lgcc_s -plugin-opt=-pass-through=-lgcc --build-id --eh-frame-hdr --hash-style=gnu -m elf_x86_64 -dynamic-linker /lib64/ld-linux-x86-64.so.2 -pie -o conftest /usr/lib/gcc/x86_64-pc-linux-gnu/9.2.0/../../../../lib/Scrt1.o /usr/lib/gcc/x86_64-pc-linux-gnu/9.2.0/../../../../lib/crti.o /usr/lib/gcc/x86_64-pc-linux-gnu/9.2.0/crtbeginS.o -L/usr/lib/gcc/x86_64-pc-linux-gnu/9.2.0 -L/usr/lib/gcc/x86_64-pc-linux-gnu/9.2.0/../../../../lib -L/lib/../lib -L/usr/lib/../lib -L/usr/lib/gcc/x86_64-pc-linux-gnu/9.2.0/../../.. /tmp/ccfQEeXW.o -lmpfi -lmpfr -lglpk -lgmp -lsymmetrica -llrcalc -lgfortran -lm -lgfortran -lm -lgcc_s -lgcc -lquadmath -lm -lgcc_s -lgcc -lc -lgcc_s -lgcc /usr/lib/gcc/x86_64-pc-linux-gnu/9.2.0/crtendS.o /usr/lib/gcc/x86_64-pc-linux-gnu/9.2.0/../../../../lib/crtn.o
1535configure:13791: result: -v
1536configure:13793: checking for Fortran libraries of gfortran
1537configure:13816: gfortran -o conftest -g -O2 -ffree-form -v conftest.f -lmpfi -lmpfr -lglpk -lgmp -lsymmetrica -llrcalc -lm
1538Using built-in specs.
1539Target: x86_64-pc-linux-gnu
1540Thread model: posix
1541gcc version 9.2.0 (GCC)
1542 /usr/lib/gcc/x86_64-pc-linux-gnu/9.2.0/f951 conftest.f -quiet -dumpbase conftest.f -mtune=generic -march=x86-64 -auxbase conftest -g -O2 -version -ffree-form -fintrinsic-modules-path /usr/lib/gcc/x86_64-pc-linux-gnu/9.2.0/finclude -fpre-include=/usr/include/finclude/math-vector-fortran.h -o /tmp/ccfbdcf6.s
1543GNU Fortran (GCC) version 9.2.0 (x86_64-pc-linux-gnu)
1544        compiled by GNU C version 9.2.0, GMP version 6.1.2, MPFR version 4.0.2, MPC version 1.1.0, isl version isl-0.21-GMP
1545
1546GGC heuristics: --param ggc-min-expand=100 --param ggc-min-heapsize=131072
1547GNU Fortran2008 (GCC) version 9.2.0 (x86_64-pc-linux-gnu)
1548        compiled by GNU C version 9.2.0, GMP version 6.1.2, MPFR version 4.0.2, MPC version 1.1.0, isl version isl-0.21-GMP
1549
1550GGC heuristics: --param ggc-min-expand=100 --param ggc-min-heapsize=131072
1551 as -v --64 -o /tmp/ccvCWR67.o /tmp/ccfbdcf6.s
1552GNU assembler version 2.33.1 (x86_64-pc-linux-gnu) using BFD version (GNU Binutils) 2.33.1
1553Reading specs from /usr/lib/gcc/x86_64-pc-linux-gnu/9.2.0/../../../../lib/libgfortran.spec
1554rename spec lib to liborig
1555 /usr/lib/gcc/x86_64-pc-linux-gnu/9.2.0/collect2 -plugin /usr/lib/gcc/x86_64-pc-linux-gnu/9.2.0/liblto_plugin.so -plugin-opt=/usr/lib/gcc/x86_64-pc-linux-gnu/9.2.0/lto-wrapper -plugin-opt=-fresolution=/tmp/ccqBnVC5.res -plugin-opt=-pass-through=-lgcc_s -plugin-opt=-pass-through=-lgcc -plugin-opt=-pass-through=-lquadmath -plugin-opt=-pass-through=-lm -plugin-opt=-pass-through=-lgcc_s -plugin-opt=-pass-through=-lgcc -plugin-opt=-pass-through=-lc -plugin-opt=-pass-through=-lgcc_s -plugin-opt=-pass-through=-lgcc --build-id --eh-frame-hdr --hash-style=gnu -m elf_x86_64 -dynamic-linker /lib64/ld-linux-x86-64.so.2 -pie -o conftest /usr/lib/gcc/x86_64-pc-linux-gnu/9.2.0/../../../../lib/Scrt1.o /usr/lib/gcc/x86_64-pc-linux-gnu/9.2.0/../../../../lib/crti.o /usr/lib/gcc/x86_64-pc-linux-gnu/9.2.0/crtbeginS.o -L/usr/lib/gcc/x86_64-pc-linux-gnu/9.2.0 -L/usr/lib/gcc/x86_64-pc-linux-gnu/9.2.0/../../../../lib -L/lib/../lib -L/usr/lib/../lib -L/usr/lib/gcc/x86_64-pc-linux-gnu/9.2.0/../../.. /tmp/ccvCWR67.o -lmpfi -lmpfr -lglpk -lgmp -lsymmetrica -llrcalc -lgfortran -lm -lgfortran -lm -lgcc_s -lgcc -lquadmath -lm -lgcc_s -lgcc -lc -lgcc_s -lgcc /usr/lib/gcc/x86_64-pc-linux-gnu/9.2.0/crtendS.o /usr/lib/gcc/x86_64-pc-linux-gnu/9.2.0/../../../../lib/crtn.o
1556configure:14012: result:  -L/usr/lib/gcc/x86_64-pc-linux-gnu/9.2.0 -L/usr/lib/gcc/x86_64-pc-linux-gnu/9.2.0/../../../../lib -L/lib/../lib -L/usr/lib/../lib -L/usr/lib/gcc/x86_64-pc-linux-gnu/9.2.0/../../.. -lmpfi -lmpfr -lglpk -lgmp -lsymmetrica -llrcalc -lgfortran -lm -lquadmath
1557configure:14028: checking for dummy main to link with Fortran libraries
1558configure:14062: gcc -o conftest -g -O2    conftest.c -lmpfi -lmpfr -lglpk -lgmp -lsymmetrica -llrcalc -lm   -L/usr/lib/gcc/x86_64-pc-linux-gnu/9.2.0 -L/usr/lib/gcc/x86_64-pc-linux-gnu/9.2.0/../../../../lib -L/lib/../lib -L/usr/lib/../lib -L/usr/lib/gcc/x86_64-pc-linux-gnu/9.2.0/../../.. -lmpfi -lmpfr -lglpk -lgmp -lsymmetrica -llrcalc -lgfortran -lm -lquadmath >&5
1559configure:14062: $? = 0
1560configure:14107: result: none
1561configure:14140: checking for Fortran name-mangling scheme
1562configure:14153: gfortran -c -g -O2 -ffree-form  conftest.f >&5
1563configure:14153: $? = 0
1564configure:14194: gcc -o conftest -g -O2    conftest.c cfortran_test.o -lmpfi -lmpfr -lglpk -lgmp -lsymmetrica -llrcalc -lm   -L/usr/lib/gcc/x86_64-pc-linux-gnu/9.2.0 -L/usr/lib/gcc/x86_64-pc-linux-gnu/9.2.0/../../../../lib -L/lib/../lib -L/usr/lib/../lib -L/usr/lib/gcc/x86_64-pc-linux-gnu/9.2.0/../../.. -lmpfi -lmpfr -lglpk -lgmp -lsymmetrica -llrcalc -lgfortran -lm -lquadmath >&5
1565/usr/bin/ld: /tmp/ccRELtHA.o: in function `main':
1566/opt/sage/conftest.c:46: undefined reference to `foobar'
1567collect2: error: ld returned 1 exit status
1568configure:14194: $? = 1
1569configure: failed program was:
1570| /* confdefs.h */
1571| #define PACKAGE_NAME "Sage"
1572| #define PACKAGE_TARNAME "sage"
1573| #define PACKAGE_VERSION "9.1.beta1"
1574| #define PACKAGE_STRING "Sage 9.1.beta1"
1575| #define PACKAGE_BUGREPORT "sage-devel@googlegroups.com"
1576| #define PACKAGE_URL ""
1577| #define PACKAGE "sage"
1578| #define VERSION "9.1.beta1"
1579| #define STDC_HEADERS 1
1580| #define HAVE_SYS_TYPES_H 1
1581| #define HAVE_SYS_STAT_H 1
1582| #define HAVE_STDLIB_H 1
1583| #define HAVE_STRING_H 1
1584| #define HAVE_MEMORY_H 1
1585| #define HAVE_STRINGS_H 1
1586| #define HAVE_INTTYPES_H 1
1587| #define HAVE_STDINT_H 1
1588| #define HAVE_UNISTD_H 1
1589| #define HAVE_LIBM 1
1590| #define HAVE_CXX11 1
1591| #define HAVE_LRCALC_SCHUBLIB_H 1
1592| #define HAVE_ZMQ /**/
1593| #define HAVE_GMP_H 1
1594| #define ABSOLUTE_GMP_H "///usr/include/gmp.h"
1595| /* end confdefs.h.  */
1596|
1597| /* Override any GCC internal prototype to avoid an error.
1598|    Use char because int might match the return type of a GCC
1599|    builtin and then its argument prototype would still apply.  */
1600| #ifdef __cplusplus
1601| extern "C"
1602| #endif
1603| char foobar ();
1604| #ifdef FC_DUMMY_MAIN
1605| #ifndef FC_DUMMY_MAIN_EQ_F77
1606| #  ifdef __cplusplus
1607|      extern "C"
1608| #  endif
1609|    int FC_DUMMY_MAIN() { return 1; }
1610| #endif
1611| #endif
1612| int
1613| main ()
1614| {
1615| return foobar ();
1616|   ;
1617|   return 0;
1618| }
1619configure:14194: gcc -o conftest -g -O2    conftest.c cfortran_test.o -lmpfi -lmpfr -lglpk -lgmp -lsymmetrica -llrcalc -lm   -L/usr/lib/gcc/x86_64-pc-linux-gnu/9.2.0 -L/usr/lib/gcc/x86_64-pc-linux-gnu/9.2.0/../../../../lib -L/lib/../lib -L/usr/lib/../lib -L/usr/lib/gcc/x86_64-pc-linux-gnu/9.2.0/../../.. -lmpfi -lmpfr -lglpk -lgmp -lsymmetrica -llrcalc -lgfortran -lm -lquadmath >&5
1620configure:14194: $? = 0
1621configure:14252: gcc -o conftest -g -O2    conftest.c cfortran_test.o -lmpfi -lmpfr -lglpk -lgmp -lsymmetrica -llrcalc -lm   -L/usr/lib/gcc/x86_64-pc-linux-gnu/9.2.0 -L/usr/lib/gcc/x86_64-pc-linux-gnu/9.2.0/../../../../lib -L/lib/../lib -L/usr/lib/../lib -L/usr/lib/gcc/x86_64-pc-linux-gnu/9.2.0/../../.. -lmpfi -lmpfr -lglpk -lgmp -lsymmetrica -llrcalc -lgfortran -lm -lquadmath >&5
1622configure:14252: $? = 0
1623configure:14294: result: lower case, underscore, no extra underscore
1624configure:14309: === checking whether to install the openblas SPKG ===
1625configure:14327: checking BLAS library
1626configure:14346: result: openblas
1627configure:14389: checking installing any of gfortran?
1628configure:14398: result: no
1629configure:14403: checking for OPENBLAS
1630configure:14410: $PKG_CONFIG --exists --print-errors "openblas >= 0.2.20"
1631configure:14413: $? = 0
1632configure:14427: $PKG_CONFIG --exists --print-errors "openblas >= 0.2.20"
1633configure:14430: $? = 0
1634configure:14468: result: yes
1635configure:14476: $PKG_CONFIG --exists --print-errors "openblas"
1636configure:14479: $? = 0
1637configure:14500: checking for library containing cblas_dgemm
1638configure:14531: g++ -std=gnu++11 -o conftest -g -O2    conftest.cpp -lmpfi -lmpfr -lglpk -lgmp -lsymmetrica -llrcalc -lm  >&5
1639/usr/bin/ld: /tmp/ccPdHYm3.o: in function `main':
1640/opt/sage/conftest.cpp:38: undefined reference to `cblas_dgemm'
1641collect2: error: ld returned 1 exit status
1642configure:14531: $? = 1
1643configure: failed program was:
1644| /* confdefs.h */
1645| #define PACKAGE_NAME "Sage"
1646| #define PACKAGE_TARNAME "sage"
1647| #define PACKAGE_VERSION "9.1.beta1"
1648| #define PACKAGE_STRING "Sage 9.1.beta1"
1649| #define PACKAGE_BUGREPORT "sage-devel@googlegroups.com"
1650| #define PACKAGE_URL ""
1651| #define PACKAGE "sage"
1652| #define VERSION "9.1.beta1"
1653| #define STDC_HEADERS 1
1654| #define HAVE_SYS_TYPES_H 1
1655| #define HAVE_SYS_STAT_H 1
1656| #define HAVE_STDLIB_H 1
1657| #define HAVE_STRING_H 1
1658| #define HAVE_MEMORY_H 1
1659| #define HAVE_STRINGS_H 1
1660| #define HAVE_INTTYPES_H 1
1661| #define HAVE_STDINT_H 1
1662| #define HAVE_UNISTD_H 1
1663| #define HAVE_LIBM 1
1664| #define HAVE_CXX11 1
1665| #define HAVE_LRCALC_SCHUBLIB_H 1
1666| #define HAVE_ZMQ /**/
1667| #define HAVE_GMP_H 1
1668| #define ABSOLUTE_GMP_H "///usr/include/gmp.h"
1669| /* end confdefs.h.  */
1670|
1671| /* Override any GCC internal prototype to avoid an error.
1672|    Use char because int might match the return type of a GCC
1673|    builtin and then its argument prototype would still apply.  */
1674| #ifdef __cplusplus
1675| extern "C"
1676| #endif
1677| char cblas_dgemm ();
1678| int
1679| main ()
1680| {
1681| return cblas_dgemm ();
1682|   ;
1683|   return 0;
1684| }
1685configure:14531: g++ -std=gnu++11 -o conftest -g -O2    conftest.cpp -lopenblas  -lmpfi -lmpfr -lglpk -lgmp -lsymmetrica -llrcalc -lm  >&5
1686/usr/bin/ld: /tmp/cc0PsDh4.o: in function `main':
1687/opt/sage/conftest.cpp:38: undefined reference to `cblas_dgemm'
1688collect2: error: ld returned 1 exit status
1689configure:14531: $? = 1
1690configure: failed program was:
1691| /* confdefs.h */
1692| #define PACKAGE_NAME "Sage"
1693| #define PACKAGE_TARNAME "sage"
1694| #define PACKAGE_VERSION "9.1.beta1"
1695| #define PACKAGE_STRING "Sage 9.1.beta1"
1696| #define PACKAGE_BUGREPORT "sage-devel@googlegroups.com"
1697| #define PACKAGE_URL ""
1698| #define PACKAGE "sage"
1699| #define VERSION "9.1.beta1"
1700| #define STDC_HEADERS 1
1701| #define HAVE_SYS_TYPES_H 1
1702| #define HAVE_SYS_STAT_H 1
1703| #define HAVE_STDLIB_H 1
1704| #define HAVE_STRING_H 1
1705| #define HAVE_MEMORY_H 1
1706| #define HAVE_STRINGS_H 1
1707| #define HAVE_INTTYPES_H 1
1708| #define HAVE_STDINT_H 1
1709| #define HAVE_UNISTD_H 1
1710| #define HAVE_LIBM 1
1711| #define HAVE_CXX11 1
1712| #define HAVE_LRCALC_SCHUBLIB_H 1
1713| #define HAVE_ZMQ /**/
1714| #define HAVE_GMP_H 1
1715| #define ABSOLUTE_GMP_H "///usr/include/gmp.h"
1716| /* end confdefs.h.  */
1717|
1718| /* Override any GCC internal prototype to avoid an error.
1719|    Use char because int might match the return type of a GCC
1720|    builtin and then its argument prototype would still apply.  */
1721| #ifdef __cplusplus
1722| extern "C"
1723| #endif
1724| char cblas_dgemm ();
1725| int
1726| main ()
1727| {
1728| return cblas_dgemm ();
1729|   ;
1730|   return 0;
1731| }
1732configure:14548: result: no
1733configure:14559: checking for CBLAS
1734configure:14566: $PKG_CONFIG --exists --print-errors "cblas"
1735configure:14569: $? = 0
1736configure:14583: $PKG_CONFIG --exists --print-errors "cblas"
1737configure:14586: $? = 0
1738configure:14624: result: yes
1739configure:14651: checking for library containing dgeqrf_
1740configure:14690: g++ -std=gnu++11 -o conftest -g -O2    conftest.cpp -lmpfi -lmpfr -lglpk -lgmp -lsymmetrica -llrcalc -lm  >&5
1741/usr/bin/ld: /tmp/ccfWHZhW.o: in function `main':
1742/opt/sage/conftest.cpp:46: undefined reference to `dgeqrf_'
1743collect2: error: ld returned 1 exit status
1744configure:14690: $? = 1
1745configure: failed program was:
1746| /* confdefs.h */
1747| #define PACKAGE_NAME "Sage"
1748| #define PACKAGE_TARNAME "sage"
1749| #define PACKAGE_VERSION "9.1.beta1"
1750| #define PACKAGE_STRING "Sage 9.1.beta1"
1751| #define PACKAGE_BUGREPORT "sage-devel@googlegroups.com"
1752| #define PACKAGE_URL ""
1753| #define PACKAGE "sage"
1754| #define VERSION "9.1.beta1"
1755| #define STDC_HEADERS 1
1756| #define HAVE_SYS_TYPES_H 1
1757| #define HAVE_SYS_STAT_H 1
1758| #define HAVE_STDLIB_H 1
1759| #define HAVE_STRING_H 1
1760| #define HAVE_MEMORY_H 1
1761| #define HAVE_STRINGS_H 1
1762| #define HAVE_INTTYPES_H 1
1763| #define HAVE_STDINT_H 1
1764| #define HAVE_UNISTD_H 1
1765| #define HAVE_LIBM 1
1766| #define HAVE_CXX11 1
1767| #define HAVE_LRCALC_SCHUBLIB_H 1
1768| #define HAVE_ZMQ /**/
1769| #define HAVE_GMP_H 1
1770| #define ABSOLUTE_GMP_H "///usr/include/gmp.h"
1771| /* end confdefs.h.  */
1772|
1773| /* Override any GCC internal prototype to avoid an error.
1774|    Use char because int might match the return type of a GCC
1775|    builtin and then its argument prototype would still apply.  */
1776| #ifdef __cplusplus
1777| extern "C"
1778| #endif
1779| char dgeqrf_ ();
1780| #ifdef FC_DUMMY_MAIN
1781| #ifndef FC_DUMMY_MAIN_EQ_F77
1782| #  ifdef __cplusplus
1783|      extern "C"
1784| #  endif
1785|    int FC_DUMMY_MAIN() { return 1; }
1786| #endif
1787| #endif
1788| int
1789| main ()
1790| {
1791| return dgeqrf_ ();
1792|   ;
1793|   return 0;
1794| }
1795configure:14690: g++ -std=gnu++11 -o conftest -g -O2    conftest.cpp -lopenblas  -lmpfi -lmpfr -lglpk -lgmp -lsymmetrica -llrcalc -lm  >&5
1796/usr/bin/ld: /tmp/cc4nv1QW.o: in function `main':
1797/opt/sage/conftest.cpp:46: undefined reference to `dgeqrf_'
1798collect2: error: ld returned 1 exit status
1799configure:14690: $? = 1
1800configure: failed program was:
1801| /* confdefs.h */
1802| #define PACKAGE_NAME "Sage"
1803| #define PACKAGE_TARNAME "sage"
1804| #define PACKAGE_VERSION "9.1.beta1"
1805| #define PACKAGE_STRING "Sage 9.1.beta1"
1806| #define PACKAGE_BUGREPORT "sage-devel@googlegroups.com"
1807| #define PACKAGE_URL ""
1808| #define PACKAGE "sage"
1809| #define VERSION "9.1.beta1"
1810| #define STDC_HEADERS 1
1811| #define HAVE_SYS_TYPES_H 1
1812| #define HAVE_SYS_STAT_H 1
1813| #define HAVE_STDLIB_H 1
1814| #define HAVE_STRING_H 1
1815| #define HAVE_MEMORY_H 1
1816| #define HAVE_STRINGS_H 1
1817| #define HAVE_INTTYPES_H 1
1818| #define HAVE_STDINT_H 1
1819| #define HAVE_UNISTD_H 1
1820| #define HAVE_LIBM 1
1821| #define HAVE_CXX11 1
1822| #define HAVE_LRCALC_SCHUBLIB_H 1
1823| #define HAVE_ZMQ /**/
1824| #define HAVE_GMP_H 1
1825| #define ABSOLUTE_GMP_H "///usr/include/gmp.h"
1826| /* end confdefs.h.  */
1827|
1828| /* Override any GCC internal prototype to avoid an error.
1829|    Use char because int might match the return type of a GCC
1830|    builtin and then its argument prototype would still apply.  */
1831| #ifdef __cplusplus
1832| extern "C"
1833| #endif
1834| char dgeqrf_ ();
1835| #ifdef FC_DUMMY_MAIN
1836| #ifndef FC_DUMMY_MAIN_EQ_F77
1837| #  ifdef __cplusplus
1838|      extern "C"
1839| #  endif
1840|    int FC_DUMMY_MAIN() { return 1; }
1841| #endif
1842| #endif
1843| int
1844| main ()
1845| {
1846| return dgeqrf_ ();
1847|   ;
1848|   return 0;
1849| }
1850configure:14708: result: no
1851configure:14719: checking for LAPACK
1852configure:14726: $PKG_CONFIG --exists --print-errors "lapack"
1853configure:14729: $? = 0
1854configure:14743: $PKG_CONFIG --exists --print-errors "lapack"
1855configure:14746: $? = 0
1856configure:14784: result: yes
1857configure:14852: === checking whether to install the atlas SPKG ===
1858configure:14935: === checking whether to install the gsl SPKG ===
1859configure:14983: checking installing any of atlas openblas?
1860configure:14992: result: no
1861configure:14997: checking for GSL
1862configure:15004: $PKG_CONFIG --exists --print-errors "gsl >= $2.4"
1863configure:15007: $? = 0
1864configure:15021: $PKG_CONFIG --exists --print-errors "gsl >= $2.4"
1865configure:15024: $? = 0
1866configure:15062: result: yes
1867configure:15070: $PKG_CONFIG --exists --print-errors "gsl"
1868configure:15073: $? = 0
1869configure:15134: === checking whether to install the gfan SPKG ===
1870configure:15177: checking for gfan >= 0.6.2
1871configure:15253: result:
1872configure:15288: === checking whether to install the bzip2 SPKG ===
1873configure:15331: checking bzlib.h usability
1874configure:15331: g++ -std=gnu++11 -c -g -O2   conftest.cpp >&5
1875configure:15331: $? = 0
1876configure:15331: result: yes
1877configure:15331: checking bzlib.h presence
1878configure:15331: g++ -E -std=gnu++11   conftest.cpp
1879configure:15331: $? = 0
1880configure:15331: result: yes
1881configure:15331: checking for bzlib.h
1882configure:15331: result: yes
1883configure:15334: checking for library containing BZ2_bzCompress
1884configure:15373: g++ -std=gnu++11 -o conftest -g -O2    conftest.cpp -lmpfi -lmpfr -lglpk -lgmp -lsymmetrica -llrcalc -lm  >&5
1885/usr/bin/ld: /tmp/ccPu6klD.o: in function `main':
1886/opt/sage/conftest.cpp:46: undefined reference to `BZ2_bzCompress'
1887collect2: error: ld returned 1 exit status
1888configure:15373: $? = 1
1889configure: failed program was:
1890| /* confdefs.h */
1891| #define PACKAGE_NAME "Sage"
1892| #define PACKAGE_TARNAME "sage"
1893| #define PACKAGE_VERSION "9.1.beta1"
1894| #define PACKAGE_STRING "Sage 9.1.beta1"
1895| #define PACKAGE_BUGREPORT "sage-devel@googlegroups.com"
1896| #define PACKAGE_URL ""
1897| #define PACKAGE "sage"
1898| #define VERSION "9.1.beta1"
1899| #define STDC_HEADERS 1
1900| #define HAVE_SYS_TYPES_H 1
1901| #define HAVE_SYS_STAT_H 1
1902| #define HAVE_STDLIB_H 1
1903| #define HAVE_STRING_H 1
1904| #define HAVE_MEMORY_H 1
1905| #define HAVE_STRINGS_H 1
1906| #define HAVE_INTTYPES_H 1
1907| #define HAVE_STDINT_H 1
1908| #define HAVE_UNISTD_H 1
1909| #define HAVE_LIBM 1
1910| #define HAVE_CXX11 1
1911| #define HAVE_LRCALC_SCHUBLIB_H 1
1912| #define HAVE_ZMQ /**/
1913| #define HAVE_GMP_H 1
1914| #define ABSOLUTE_GMP_H "///usr/include/gmp.h"
1915| /* end confdefs.h.  */
1916|
1917| /* Override any GCC internal prototype to avoid an error.
1918|    Use char because int might match the return type of a GCC
1919|    builtin and then its argument prototype would still apply.  */
1920| #ifdef __cplusplus
1921| extern "C"
1922| #endif
1923| char BZ2_bzCompress ();
1924| #ifdef FC_DUMMY_MAIN
1925| #ifndef FC_DUMMY_MAIN_EQ_F77
1926| #  ifdef __cplusplus
1927|      extern "C"
1928| #  endif
1929|    int FC_DUMMY_MAIN() { return 1; }
1930| #endif
1931| #endif
1932| int
1933| main ()
1934| {
1935| return BZ2_bzCompress ();
1936|   ;
1937|   return 0;
1938| }
1939configure:15373: g++ -std=gnu++11 -o conftest -g -O2    conftest.cpp -lbz2  -lmpfi -lmpfr -lglpk -lgmp -lsymmetrica -llrcalc -lm  >&5
1940configure:15373: $? = 0
1941configure:15390: result: -lbz2
1942configure:15398: checking for bzip2
1943configure:15416: found /usr/bin/bzip2
1944configure:15428: result: /usr/bin/bzip2
1945configure:15480: === checking whether to install the cbc SPKG ===
1946configure:15529: checking installing any of atlas openblas zlib bzip2?
1947configure:15538: result: no
1948configure:15543: checking for CBC
1949configure:15550: $PKG_CONFIG --exists --print-errors "cbc >= 2.9.4"
1950configure:15553: $? = 0
1951configure:15567: $PKG_CONFIG --exists --print-errors "cbc >= 2.9.4"
1952configure:15570: $? = 0
1953configure:15608: result: yes
1954configure:15646: === checking whether to install the cliquer SPKG ===
1955configure:15689: checking for library containing clique_unweighted_max_weight
1956configure:15728: g++ -std=gnu++11 -o conftest -g -O2    conftest.cpp -lbz2 -lmpfi -lmpfr -lglpk -lgmp -lsymmetrica -llrcalc -lm  >&5
1957/usr/bin/ld: /tmp/ccVZBb1b.o: in function `main':
1958/opt/sage/conftest.cpp:46: undefined reference to `clique_unweighted_max_weight'
1959collect2: error: ld returned 1 exit status
1960configure:15728: $? = 1
1961configure: failed program was:
1962| /* confdefs.h */
1963| #define PACKAGE_NAME "Sage"
1964| #define PACKAGE_TARNAME "sage"
1965| #define PACKAGE_VERSION "9.1.beta1"
1966| #define PACKAGE_STRING "Sage 9.1.beta1"
1967| #define PACKAGE_BUGREPORT "sage-devel@googlegroups.com"
1968| #define PACKAGE_URL ""
1969| #define PACKAGE "sage"
1970| #define VERSION "9.1.beta1"
1971| #define STDC_HEADERS 1
1972| #define HAVE_SYS_TYPES_H 1
1973| #define HAVE_SYS_STAT_H 1
1974| #define HAVE_STDLIB_H 1
1975| #define HAVE_STRING_H 1
1976| #define HAVE_MEMORY_H 1
1977| #define HAVE_STRINGS_H 1
1978| #define HAVE_INTTYPES_H 1
1979| #define HAVE_STDINT_H 1
1980| #define HAVE_UNISTD_H 1
1981| #define HAVE_LIBM 1
1982| #define HAVE_CXX11 1
1983| #define HAVE_LRCALC_SCHUBLIB_H 1
1984| #define HAVE_ZMQ /**/
1985| #define HAVE_GMP_H 1
1986| #define ABSOLUTE_GMP_H "///usr/include/gmp.h"
1987| /* end confdefs.h.  */
1988|
1989| /* Override any GCC internal prototype to avoid an error.
1990|    Use char because int might match the return type of a GCC
1991|    builtin and then its argument prototype would still apply.  */
1992| #ifdef __cplusplus
1993| extern "C"
1994| #endif
1995| char clique_unweighted_max_weight ();
1996| #ifdef FC_DUMMY_MAIN
1997| #ifndef FC_DUMMY_MAIN_EQ_F77
1998| #  ifdef __cplusplus
1999|      extern "C"
2000| #  endif
2001|    int FC_DUMMY_MAIN() { return 1; }
2002| #endif
2003| #endif
2004| int
2005| main ()
2006| {
2007| return clique_unweighted_max_weight ();
2008|   ;
2009|   return 0;
2010| }
2011configure:15728: g++ -std=gnu++11 -o conftest -g -O2    conftest.cpp -lcliquer  -lbz2 -lmpfi -lmpfr -lglpk -lgmp -lsymmetrica -llrcalc -lm  >&5
2012configure:15728: $? = 0
2013configure:15745: result: -lcliquer
2014configure:15757: checking cliquer/cliquer.h usability
2015configure:15757: gcc -c -g -O2   conftest.c >&5
2016configure:15757: $? = 0
2017configure:15757: result: yes
2018configure:15757: checking cliquer/cliquer.h presence
2019configure:15757: gcc -E   conftest.c
2020configure:15757: $? = 0
2021configure:15757: result: yes
2022configure:15757: checking for cliquer/cliquer.h
2023configure:15757: result: yes
2024configure:15762: checking for cl
2025configure:15780: found /usr/bin/cl
2026configure:15792: result: /usr/bin/cl
2027configure:15855: === checking whether to install the pari_nftables SPKG ===
2028configure:15899: checking installing pari?
2029configure:15902: result: yes; install pari_nftables as well
2030configure:15943: === checking whether to install the curl SPKG ===
2031configure:15988: checking for curl 7.22
2032configure:16023: result: /usr/bin/curl
2033configure:16067: checking for gawk
2034configure:16094: result: gawk
2035configure:16156: checking for curl-config
2036configure:16174: found /usr/bin/curl-config
2037configure:16186: result: /usr/bin/curl-config
2038configure:16197: checking for the version of libcurl
2039configure:16204: result: 7.68.0
2040configure:16211: checking for libcurl >= version 7.22
2041configure:16224: result: yes
2042configure:16265: checking whether libcurl is usable
2043configure:16307: g++ -std=gnu++11 -o conftest -g -O2     conftest.cpp -lcurl -lcliquer -lbz2 -lmpfi -lmpfr -lglpk -lgmp -lsymmetrica -llrcalc -lm  >&5
2044configure:16307: $? = 0
2045configure:16321: result: yes
2046configure:16334: checking for curl_free
2047configure:16334: g++ -std=gnu++11 -o conftest -g -O2     conftest.cpp -lcliquer -lbz2 -lmpfi -lmpfr -lglpk -lgmp -lsymmetrica -llrcalc -lm  -lcurl >&5
2048configure:16334: $? = 0
2049configure:16334: result: yes
2050configure:16422: checking whether programs linking to libcurl can be executed
2051configure:16460: g++ -std=gnu++11 -o conftest -g -O2     conftest.cpp -lcurl -lcliquer -lbz2 -lmpfi -lmpfr -lglpk -lgmp -lsymmetrica -llrcalc -lm  >&5
2052configure:16460: $? = 0
2053configure:16460: ./conftest
2054configure:16460: $? = 0
2055configure:16471: result: yes
2056configure:16506: === checking whether to install the patch SPKG ===
2057configure:16549: checking for GNU patch >= 2.7.0
2058configure:16626: result: /usr/bin/patch
2059configure:16661: === checking whether to install the pari_seadata_small SPKG ===
2060configure:16706: checking installing pari?
2061configure:16709: result: yes; install pari_seadata_small as well
2062configure:16747: === checking whether to install the givaro SPKG ===
2063configure:16795: checking installing any of gmp mpir?
2064configure:16804: result: no
2065configure:16809: checking for givaro-config
2066configure:16827: found /usr/local/bin/givaro-config
2067configure:16839: result: /usr/local/bin/givaro-config
2068configure:16854: checking is givaro's version good enough?
2069configure:16893: result: no. Install givaro
2070configure:16935: === checking whether to install the ntl SPKG ===
2071configure:16979: checking installing gmp/mpir?
2072configure:16986: result: no
2073configure:16994: checking NTL/ZZ.h usability
2074configure:16994: g++ -std=gnu++11 -c -g -O2    conftest.cpp >&5
2075configure:16994: $? = 0
2076configure:16994: result: yes
2077configure:16994: checking NTL/ZZ.h presence
2078configure:16994: g++ -E -std=gnu++11    conftest.cpp
2079configure:16994: $? = 0
2080configure:16994: result: yes
2081configure:16994: checking for NTL/ZZ.h
2082configure:16994: result: yes
2083configure:17002: checking whether we can link a program using NTL
2084configure:17027: g++ -std=gnu++11 -o conftest -g -O2     conftest.cpp -lcurl -lcliquer -lbz2 -lmpfi -lmpfr -lglpk -lgmp -lsymmetrica -llrcalc -lm  -lntl >&5
2085configure:17027: $? = 0
2086configure:17028: result: yes
2087configure:17039: checking NTL version >= 10.3
2088configure:17075: g++ -std=gnu++11 -o conftest -g -O2     conftest.cpp -lcurl -lcliquer -lbz2 -lmpfi -lmpfr -lglpk -lgmp -lsymmetrica -llrcalc -lm  -lntl >&5
2089configure:17075: $? = 0
2090configure:17075: ./conftest
2091configure:17075: $? = 0
2092configure:17113: result: using ntl library from the system
2093configure:17130: === checking whether to install the flint SPKG ===
2094configure:17175: checking installing mpfr or ntl?
2095configure:17182: checking flint/flint.h usability
2096configure:17182: g++ -std=gnu++11 -c -g -O2    conftest.cpp >&5
2097configure:17182: $? = 0
2098configure:17182: result: yes
2099configure:17182: checking flint/flint.h presence
2100configure:17182: g++ -E -std=gnu++11    conftest.cpp
2101configure:17182: $? = 0
2102configure:17182: result: yes
2103configure:17182: checking for flint/flint.h
2104configure:17182: result: yes
2105configure:17185: checking for library containing fmpz_mat_is_hadamard
2106configure:17224: g++ -std=gnu++11 -o conftest -g -O2     conftest.cpp -lcurl -lcliquer -lbz2 -lmpfi -lmpfr -lglpk -lgmp -lsymmetrica -llrcalc -lm  -lntl >&5
2107/usr/bin/ld: /tmp/cc8J9rOw.o: in function `main':
2108/opt/sage/conftest.cpp:82: undefined reference to `fmpz_mat_is_hadamard'
2109collect2: error: ld returned 1 exit status
2110configure:17224: $? = 1
2111configure: failed program was:
2112| /* confdefs.h */
2113| #define PACKAGE_NAME "Sage"
2114| #define PACKAGE_TARNAME "sage"
2115| #define PACKAGE_VERSION "9.1.beta1"
2116| #define PACKAGE_STRING "Sage 9.1.beta1"
2117| #define PACKAGE_BUGREPORT "sage-devel@googlegroups.com"
2118| #define PACKAGE_URL ""
2119| #define PACKAGE "sage"
2120| #define VERSION "9.1.beta1"
2121| #define STDC_HEADERS 1
2122| #define HAVE_SYS_TYPES_H 1
2123| #define HAVE_SYS_STAT_H 1
2124| #define HAVE_STDLIB_H 1
2125| #define HAVE_STRING_H 1
2126| #define HAVE_MEMORY_H 1
2127| #define HAVE_STRINGS_H 1
2128| #define HAVE_INTTYPES_H 1
2129| #define HAVE_STDINT_H 1
2130| #define HAVE_UNISTD_H 1
2131| #define HAVE_LIBM 1
2132| #define HAVE_CXX11 1
2133| #define HAVE_LRCALC_SCHUBLIB_H 1
2134| #define HAVE_ZMQ /**/
2135| #define HAVE_GMP_H 1
2136| #define ABSOLUTE_GMP_H "///usr/include/gmp.h"
2137| #define HAVE_LIBCURL 1
2138| #define LIBCURL_FEATURE_SSL 1
2139| #define LIBCURL_FEATURE_IPV6 1
2140| #define LIBCURL_FEATURE_UNIXSOCKETS 1
2141| #define LIBCURL_FEATURE_LIBZ 1
2142| #define LIBCURL_FEATURE_ASYNCHDNS 1
2143| #define LIBCURL_FEATURE_IDN 1
2144| #define LIBCURL_FEATURE_GSS_API 1
2145| #define LIBCURL_FEATURE_PSL 1
2146| #define LIBCURL_FEATURE_SPNEGO 1
2147| #define LIBCURL_FEATURE_KERBEROS 1
2148| #define LIBCURL_FEATURE_NTLM 1
2149| #define LIBCURL_FEATURE_NTLM_WB 1
2150| #define LIBCURL_FEATURE_TLS_SRP 1
2151| #define LIBCURL_FEATURE_HTTP2 1
2152| #define LIBCURL_FEATURE_HTTPS_PROXY 1
2153| #define LIBCURL_PROTOCOL_DICT 1
2154| #define LIBCURL_PROTOCOL_FILE 1
2155| #define LIBCURL_PROTOCOL_FTP 1
2156| #define LIBCURL_PROTOCOL_FTPS 1
2157| #define LIBCURL_PROTOCOL_GOPHER 1
2158| #define LIBCURL_PROTOCOL_HTTP 1
2159| #define LIBCURL_PROTOCOL_HTTPS 1
2160| #define LIBCURL_PROTOCOL_IMAP 1
2161| #define LIBCURL_PROTOCOL_IMAPS 1
2162| #define LIBCURL_PROTOCOL_POP3 1
2163| #define LIBCURL_PROTOCOL_POP3S 1
2164| #define LIBCURL_PROTOCOL_RTSP 1
2165| #define LIBCURL_PROTOCOL_SCP 1
2166| #define LIBCURL_PROTOCOL_SFTP 1
2167| #define LIBCURL_PROTOCOL_SMB 1
2168| #define LIBCURL_PROTOCOL_SMBS 1
2169| #define LIBCURL_PROTOCOL_SMTP 1
2170| #define LIBCURL_PROTOCOL_SMTPS 1
2171| #define LIBCURL_PROTOCOL_TELNET 1
2172| #define LIBCURL_PROTOCOL_TFTP 1
2173| /* end confdefs.h.  */
2174|
2175| /* Override any GCC internal prototype to avoid an error.
2176|    Use char because int might match the return type of a GCC
2177|    builtin and then its argument prototype would still apply.  */
2178| #ifdef __cplusplus
2179| extern "C"
2180| #endif
2181| char fmpz_mat_is_hadamard ();
2182| #ifdef FC_DUMMY_MAIN
2183| #ifndef FC_DUMMY_MAIN_EQ_F77
2184| #  ifdef __cplusplus
2185|      extern "C"
2186| #  endif
2187|    int FC_DUMMY_MAIN() { return 1; }
2188| #endif
2189| #endif
2190| int
2191| main ()
2192| {
2193| return fmpz_mat_is_hadamard ();
2194|   ;
2195|   return 0;
2196| }
2197configure:17224: g++ -std=gnu++11 -o conftest -g -O2     conftest.cpp -lflint  -lcurl -lcliquer -lbz2 -lmpfi -lmpfr -lglpk -lgmp -lsymmetrica -llrcalc -lm  -lntl >&5
2198configure:17224: $? = 0
2199configure:17241: result: -lflint
2200configure:17247: checking for library containing fmpz_poly_get_ZZX
2201configure:17286: g++ -std=gnu++11 -o conftest -g -O2     conftest.cpp -lflint -lcurl -lcliquer -lbz2 -lmpfi -lmpfr -lglpk -lgmp -lsymmetrica -llrcalc -lm  -lntl >&5
2202configure:17286: $? = 0
2203configure:17303: result: none required
2204configure:17310: checking that GC is not enabled in Flint...
2205configure:17338: g++ -std=gnu++11 -o conftest -g -O2     conftest.cpp -lflint -lcurl -lcliquer -lbz2 -lmpfi -lmpfr -lglpk -lgmp -lsymmetrica -llrcalc -lm  -lntl >&5
2206configure:17338: $? = 0
2207configure:17338: ./conftest
2208configure:17338: $? = 0
2209configure:17339: result: GC not enabled. Good.
2210configure:17392: result: using flint library from the system
2211configure:17409: === checking whether to install the nauty SPKG ===
2212configure:17454: checking for geng
2213configure:17472: found /usr/bin/geng
2214configure:17484: result: /usr/bin/geng
2215configure:17725: checking for directg
2216configure:17743: found /usr/bin/directg
2217configure:17755: result: /usr/bin/directg
2218configure:17769: checking for gentourng
2219configure:17787: found /usr/bin/gentourng
2220configure:17799: result: /usr/bin/gentourng
2221configure:17813: checking for geng
2222configure:17831: found /usr/bin/geng
2223configure:17843: result: /usr/bin/geng
2224configure:17857: checking for genbg
2225configure:17875: found /usr/bin/genbg
2226configure:17887: result: /usr/bin/genbg
2227configure:17976: checking for ld used by gcc
2228configure:18101: result: /usr/bin/ld
2229configure:18108: checking if the linker (/usr/bin/ld) is GNU ld
2230configure:18123: result: yes
2231configure:18130: checking for shared library run path origin
2232configure:18143: result: done
2233configure:18164: checking 32-bit host C ABI
2234configure:18202: g++ -std=gnu++11 -c -g -O2    conftest.cpp >&5
2235configure:18202: $? = 0
2236configure:18389: result: no
2237configure:18426: checking for the common suffixes of directories in the library search path
2238configure:18477: result: lib,lib
2239configure:18977: checking for iconv
2240configure:19009: g++ -std=gnu++11 -o conftest -g -O2     conftest.cpp -lflint -lcurl -lcliquer -lbz2 -lmpfi -lmpfr -lglpk -lgmp -lsymmetrica -llrcalc -lm  -lntl >&5
2241configure:19009: $? = 0
2242configure:19051: result: yes
2243configure:19054: checking for working iconv
2244configure:19203: g++ -std=gnu++11 -o conftest -g -O2     conftest.cpp -lflint -lcurl -lcliquer -lbz2 -lmpfi -lmpfr -lglpk -lgmp -lsymmetrica -llrcalc -lm  -lntl >&5
2245configure:19203: $? = 0
2246configure:19203: ./conftest
2247configure:19203: $? = 0
2248configure:19215: result: yes
2249configure:19243: checking for iconv declaration
2250configure:19280: g++ -std=gnu++11 -c -g -O2    conftest.cpp >&5
2251configure:19280: $? = 0
2252configure:19291: result:
2253         extern size_t iconv (iconv_t cd, char * *inbuf, size_t *inbytesleft, char * *outbuf, size_t *outbytesleft);
2254configure:19310: === checking whether to install the iconv SPKG ===
2255configure:19387: === checking whether to install the xz SPKG ===
2256configure:19430: checking for lzma_raw_decoder in -llzma
2257configure:19463: g++ -std=gnu++11 -o conftest -g -O2     conftest.cpp -llzma  -lflint -lcurl -lcliquer -lbz2 -lmpfi -lmpfr -lglpk -lgmp -lsymmetrica -llrcalc -lm  -lntl >&5
2258configure:19463: $? = 0
2259configure:19472: result: yes
2260configure:19480: checking lzma.h usability
2261configure:19480: g++ -std=gnu++11 -c -g -O2    conftest.cpp >&5
2262configure:19480: $? = 0
2263configure:19480: result: yes
2264configure:19480: checking lzma.h presence
2265configure:19480: g++ -E -std=gnu++11    conftest.cpp
2266configure:19480: $? = 0
2267configure:19480: result: yes
2268configure:19480: checking for lzma.h
2269configure:19480: result: yes
2270configure:19489: checking for xz >= 5.0.0
2271configure:19568: result: /usr/bin/xz
2272configure:19603: === checking whether to install the pcre SPKG ===
2273configure:19647: checking installing bzip2?
2274configure:19654: result: no
2275configure:19658: checking for PCRE
2276configure:19665: $PKG_CONFIG --exists --print-errors "libpcre >= 8.39 libpcreposix libpcrecpp"
2277configure:19668: $? = 0
2278configure:19682: $PKG_CONFIG --exists --print-errors "libpcre >= 8.39 libpcreposix libpcrecpp"
2279configure:19685: $? = 0
2280configure:19887: result: yes
2281configure:19922: === checking whether to install the r SPKG ===
2282configure:19976: checking installing any of atlas openblas iconv readline bzip2 xz pcre curl?
2283configure:19985: result: no
2284configure:19990: checking for R
2285configure:19997: $PKG_CONFIG --exists --print-errors "libR >= $3.4.4"
2286configure:20000: $? = 0
2287configure:20014: $PKG_CONFIG --exists --print-errors "libR >= $3.4.4"
2288configure:20017: $? = 0
2289configure:20055: result: yes
2290configure:20060: checking for R
2291configure:20078: found /usr/bin/R
2292configure:20090: result: /usr/bin/R
2293configure:20146: === checking whether to install the lcalc SPKG ===
2294configure:20194: checking installing any of pari mpfr?
2295configure:20198: result: yes; install lcalc as well
2296configure:20393: === checking whether to install the gf2x SPKG ===
2297configure:20436: checking gf2x.h usability
2298configure:20436: g++ -std=gnu++11 -c -g -O2    conftest.cpp >&5
2299configure:20436: $? = 0
2300configure:20436: result: yes
2301configure:20436: checking gf2x.h presence
2302configure:20436: g++ -E -std=gnu++11    conftest.cpp
2303configure:20436: $? = 0
2304configure:20436: result: yes
2305configure:20436: checking for gf2x.h
2306configure:20436: result: yes
2307configure:20444: checking for library containing gf2x_mul_r
2308configure:20483: g++ -std=gnu++11 -o conftest -g -O2     conftest.cpp -lflint -lcurl -lcliquer -lbz2 -lmpfi -lmpfr -lglpk -lgmp -lsymmetrica -llrcalc -lm  -lntl >&5
2309/usr/bin/ld: /tmp/ccICbidz.o: undefined reference to symbol 'gf2x_mul_r'
2310/usr/bin/ld: /usr/lib/libgf2x.so.3: error adding symbols: DSO missing from command line
2311collect2: error: ld returned 1 exit status
2312configure:20483: $? = 1
2313configure: failed program was:
2314| /* confdefs.h */
2315| #define PACKAGE_NAME "Sage"
2316| #define PACKAGE_TARNAME "sage"
2317| #define PACKAGE_VERSION "9.1.beta1"
2318| #define PACKAGE_STRING "Sage 9.1.beta1"
2319| #define PACKAGE_BUGREPORT "sage-devel@googlegroups.com"
2320| #define PACKAGE_URL ""
2321| #define PACKAGE "sage"
2322| #define VERSION "9.1.beta1"
2323| #define STDC_HEADERS 1
2324| #define HAVE_SYS_TYPES_H 1
2325| #define HAVE_SYS_STAT_H 1
2326| #define HAVE_STDLIB_H 1
2327| #define HAVE_STRING_H 1
2328| #define HAVE_MEMORY_H 1
2329| #define HAVE_STRINGS_H 1
2330| #define HAVE_INTTYPES_H 1
2331| #define HAVE_STDINT_H 1
2332| #define HAVE_UNISTD_H 1
2333| #define HAVE_LIBM 1
2334| #define HAVE_CXX11 1
2335| #define HAVE_LRCALC_SCHUBLIB_H 1
2336| #define HAVE_ZMQ /**/
2337| #define HAVE_GMP_H 1
2338| #define ABSOLUTE_GMP_H "///usr/include/gmp.h"
2339| #define HAVE_LIBCURL 1
2340| #define LIBCURL_FEATURE_SSL 1
2341| #define LIBCURL_FEATURE_IPV6 1
2342| #define LIBCURL_FEATURE_UNIXSOCKETS 1
2343| #define LIBCURL_FEATURE_LIBZ 1
2344| #define LIBCURL_FEATURE_ASYNCHDNS 1
2345| #define LIBCURL_FEATURE_IDN 1
2346| #define LIBCURL_FEATURE_GSS_API 1
2347| #define LIBCURL_FEATURE_PSL 1
2348| #define LIBCURL_FEATURE_SPNEGO 1
2349| #define LIBCURL_FEATURE_KERBEROS 1
2350| #define LIBCURL_FEATURE_NTLM 1
2351| #define LIBCURL_FEATURE_NTLM_WB 1
2352| #define LIBCURL_FEATURE_TLS_SRP 1
2353| #define LIBCURL_FEATURE_HTTP2 1
2354| #define LIBCURL_FEATURE_HTTPS_PROXY 1
2355| #define LIBCURL_PROTOCOL_DICT 1
2356| #define LIBCURL_PROTOCOL_FILE 1
2357| #define LIBCURL_PROTOCOL_FTP 1
2358| #define LIBCURL_PROTOCOL_FTPS 1
2359| #define LIBCURL_PROTOCOL_GOPHER 1
2360| #define LIBCURL_PROTOCOL_HTTP 1
2361| #define LIBCURL_PROTOCOL_HTTPS 1
2362| #define LIBCURL_PROTOCOL_IMAP 1
2363| #define LIBCURL_PROTOCOL_IMAPS 1
2364| #define LIBCURL_PROTOCOL_POP3 1
2365| #define LIBCURL_PROTOCOL_POP3S 1
2366| #define LIBCURL_PROTOCOL_RTSP 1
2367| #define LIBCURL_PROTOCOL_SCP 1
2368| #define LIBCURL_PROTOCOL_SFTP 1
2369| #define LIBCURL_PROTOCOL_SMB 1
2370| #define LIBCURL_PROTOCOL_SMBS 1
2371| #define LIBCURL_PROTOCOL_SMTP 1
2372| #define LIBCURL_PROTOCOL_SMTPS 1
2373| #define LIBCURL_PROTOCOL_TELNET 1
2374| #define LIBCURL_PROTOCOL_TFTP 1
2375| #define HAVE_ICONV 1
2376| #define ICONV_CONST
2377| /* end confdefs.h.  */
2378|
2379| /* Override any GCC internal prototype to avoid an error.
2380|    Use char because int might match the return type of a GCC
2381|    builtin and then its argument prototype would still apply.  */
2382| #ifdef __cplusplus
2383| extern "C"
2384| #endif
2385| char gf2x_mul_r ();
2386| #ifdef FC_DUMMY_MAIN
2387| #ifndef FC_DUMMY_MAIN_EQ_F77
2388| #  ifdef __cplusplus
2389|      extern "C"
2390| #  endif
2391|    int FC_DUMMY_MAIN() { return 1; }
2392| #endif
2393| #endif
2394| int
2395| main ()
2396| {
2397| return gf2x_mul_r ();
2398|   ;
2399|   return 0;
2400| }
2401configure:20483: g++ -std=gnu++11 -o conftest -g -O2     conftest.cpp -lgf2x  -lflint -lcurl -lcliquer -lbz2 -lmpfi -lmpfr -lglpk -lgmp -lsymmetrica -llrcalc -lm  -lntl >&5
2402configure:20483: $? = 0
2403configure:20500: result: -lgf2x
2404configure:20506: checking for GF2X 1.2 or later
2405configure:20538: gcc -c -g -O2 -Werror=incompatible-pointer-types    conftest.c >&5
2406conftest.c: In function 'main':
2407conftest.c:79:19: error: assignment to 'void (*)(long unsigned int *, const long unsigned int *, long unsigned int,  const long unsigned int *, long unsigned int,  struct gf2x_mul_pool_s *)' from incompatible pointer type 'int (*)(long unsigned int *, const long unsigned int *, long unsigned int,  const long unsigned int *, long unsigned int,  struct gf2x_mul_pool_s *)' [-Werror=incompatible-pointer-types]
2408   79 |              fptr = gf2x_mul_r;
2409      |                   ^
2410cc1: some warnings being treated as errors
2411configure:20538: $? = 1
2412configure: failed program was:
2413| /* confdefs.h */
2414| #define PACKAGE_NAME "Sage"
2415| #define PACKAGE_TARNAME "sage"
2416| #define PACKAGE_VERSION "9.1.beta1"
2417| #define PACKAGE_STRING "Sage 9.1.beta1"
2418| #define PACKAGE_BUGREPORT "sage-devel@googlegroups.com"
2419| #define PACKAGE_URL ""
2420| #define PACKAGE "sage"
2421| #define VERSION "9.1.beta1"
2422| #define STDC_HEADERS 1
2423| #define HAVE_SYS_TYPES_H 1
2424| #define HAVE_SYS_STAT_H 1
2425| #define HAVE_STDLIB_H 1
2426| #define HAVE_STRING_H 1
2427| #define HAVE_MEMORY_H 1
2428| #define HAVE_STRINGS_H 1
2429| #define HAVE_INTTYPES_H 1
2430| #define HAVE_STDINT_H 1
2431| #define HAVE_UNISTD_H 1
2432| #define HAVE_LIBM 1
2433| #define HAVE_CXX11 1
2434| #define HAVE_LRCALC_SCHUBLIB_H 1
2435| #define HAVE_ZMQ /**/
2436| #define HAVE_GMP_H 1
2437| #define ABSOLUTE_GMP_H "///usr/include/gmp.h"
2438| #define HAVE_LIBCURL 1
2439| #define LIBCURL_FEATURE_SSL 1
2440| #define LIBCURL_FEATURE_IPV6 1
2441| #define LIBCURL_FEATURE_UNIXSOCKETS 1
2442| #define LIBCURL_FEATURE_LIBZ 1
2443| #define LIBCURL_FEATURE_ASYNCHDNS 1
2444| #define LIBCURL_FEATURE_IDN 1
2445| #define LIBCURL_FEATURE_GSS_API 1
2446| #define LIBCURL_FEATURE_PSL 1
2447| #define LIBCURL_FEATURE_SPNEGO 1
2448| #define LIBCURL_FEATURE_KERBEROS 1
2449| #define LIBCURL_FEATURE_NTLM 1
2450| #define LIBCURL_FEATURE_NTLM_WB 1
2451| #define LIBCURL_FEATURE_TLS_SRP 1
2452| #define LIBCURL_FEATURE_HTTP2 1
2453| #define LIBCURL_FEATURE_HTTPS_PROXY 1
2454| #define LIBCURL_PROTOCOL_DICT 1
2455| #define LIBCURL_PROTOCOL_FILE 1
2456| #define LIBCURL_PROTOCOL_FTP 1
2457| #define LIBCURL_PROTOCOL_FTPS 1
2458| #define LIBCURL_PROTOCOL_GOPHER 1
2459| #define LIBCURL_PROTOCOL_HTTP 1
2460| #define LIBCURL_PROTOCOL_HTTPS 1
2461| #define LIBCURL_PROTOCOL_IMAP 1
2462| #define LIBCURL_PROTOCOL_IMAPS 1
2463| #define LIBCURL_PROTOCOL_POP3 1
2464| #define LIBCURL_PROTOCOL_POP3S 1
2465| #define LIBCURL_PROTOCOL_RTSP 1
2466| #define LIBCURL_PROTOCOL_SCP 1
2467| #define LIBCURL_PROTOCOL_SFTP 1
2468| #define LIBCURL_PROTOCOL_SMB 1
2469| #define LIBCURL_PROTOCOL_SMBS 1
2470| #define LIBCURL_PROTOCOL_SMTP 1
2471| #define LIBCURL_PROTOCOL_SMTPS 1
2472| #define LIBCURL_PROTOCOL_TELNET 1
2473| #define LIBCURL_PROTOCOL_TFTP 1
2474| #define HAVE_ICONV 1
2475| #define ICONV_CONST
2476| /* end confdefs.h.  */
2477| #include <gf2x.h>
2478| #ifdef FC_DUMMY_MAIN
2479| #ifndef FC_DUMMY_MAIN_EQ_F77
2480| #  ifdef __cplusplus
2481|      extern "C"
2482| #  endif
2483|    int FC_DUMMY_MAIN() { return 1; }
2484| #endif
2485| #endif
2486| int
2487| main ()
2488| {
2489| const void (*fptr)(unsigned long *, const unsigned long *, unsigned long,
2490|                                 const unsigned long *, unsigned long, gf2x_mul_pool_t);
2491|              fptr = gf2x_mul_r;
2492|   ;
2493|   return 0;
2494| }
2495|
2496configure:20546: result: no
2497configure:20593: === checking whether to install the gp2c SPKG ===
2498configure:20637: checking installing pari?
2499configure:20640: result: yes; install gp2c as well
2500configure:20644: pari.cfg is $SAGE_LOCAL/lib/pari/pari.cfg
2501configure:20726: result: using Sage's gp2c SPKG
2502configure:20748: === checking whether to install the mpc SPKG ===
2503configure:20792: checking installing mpfr?
2504configure:20799: result: no
2505configure:20801: checking mpc.h usability
2506configure:20801: g++ -std=gnu++11 -c -g -O2    conftest.cpp >&5
2507configure:20801: $? = 0
2508configure:20801: result: yes
2509configure:20801: checking mpc.h presence
2510configure:20801: g++ -E -std=gnu++11    conftest.cpp
2511configure:20801: $? = 0
2512configure:20801: result: yes
2513configure:20801: checking for mpc.h
2514configure:20801: result: yes
2515configure:20809: checking for library containing mpc_cmp_abs
2516configure:20848: g++ -std=gnu++11 -o conftest -g -O2     conftest.cpp -lgf2x -lflint -lcurl -lcliquer -lbz2 -lmpfi -lmpfr -lglpk -lgmp -lsymmetrica -llrcalc -lm  -lntl >&5
2517/usr/bin/ld: /tmp/ccJstUpq.o: in function `main':
2518/opt/sage/conftest.cpp:84: undefined reference to `mpc_cmp_abs'
2519collect2: error: ld returned 1 exit status
2520configure:20848: $? = 1
2521configure: failed program was:
2522| /* confdefs.h */
2523| #define PACKAGE_NAME "Sage"
2524| #define PACKAGE_TARNAME "sage"
2525| #define PACKAGE_VERSION "9.1.beta1"
2526| #define PACKAGE_STRING "Sage 9.1.beta1"
2527| #define PACKAGE_BUGREPORT "sage-devel@googlegroups.com"
2528| #define PACKAGE_URL ""
2529| #define PACKAGE "sage"
2530| #define VERSION "9.1.beta1"
2531| #define STDC_HEADERS 1
2532| #define HAVE_SYS_TYPES_H 1
2533| #define HAVE_SYS_STAT_H 1
2534| #define HAVE_STDLIB_H 1
2535| #define HAVE_STRING_H 1
2536| #define HAVE_MEMORY_H 1
2537| #define HAVE_STRINGS_H 1
2538| #define HAVE_INTTYPES_H 1
2539| #define HAVE_STDINT_H 1
2540| #define HAVE_UNISTD_H 1
2541| #define HAVE_LIBM 1
2542| #define HAVE_CXX11 1
2543| #define HAVE_LRCALC_SCHUBLIB_H 1
2544| #define HAVE_ZMQ /**/
2545| #define HAVE_GMP_H 1
2546| #define ABSOLUTE_GMP_H "///usr/include/gmp.h"
2547| #define HAVE_LIBCURL 1
2548| #define LIBCURL_FEATURE_SSL 1
2549| #define LIBCURL_FEATURE_IPV6 1
2550| #define LIBCURL_FEATURE_UNIXSOCKETS 1
2551| #define LIBCURL_FEATURE_LIBZ 1
2552| #define LIBCURL_FEATURE_ASYNCHDNS 1
2553| #define LIBCURL_FEATURE_IDN 1
2554| #define LIBCURL_FEATURE_GSS_API 1
2555| #define LIBCURL_FEATURE_PSL 1
2556| #define LIBCURL_FEATURE_SPNEGO 1
2557| #define LIBCURL_FEATURE_KERBEROS 1
2558| #define LIBCURL_FEATURE_NTLM 1
2559| #define LIBCURL_FEATURE_NTLM_WB 1
2560| #define LIBCURL_FEATURE_TLS_SRP 1
2561| #define LIBCURL_FEATURE_HTTP2 1
2562| #define LIBCURL_FEATURE_HTTPS_PROXY 1
2563| #define LIBCURL_PROTOCOL_DICT 1
2564| #define LIBCURL_PROTOCOL_FILE 1
2565| #define LIBCURL_PROTOCOL_FTP 1
2566| #define LIBCURL_PROTOCOL_FTPS 1
2567| #define LIBCURL_PROTOCOL_GOPHER 1
2568| #define LIBCURL_PROTOCOL_HTTP 1
2569| #define LIBCURL_PROTOCOL_HTTPS 1
2570| #define LIBCURL_PROTOCOL_IMAP 1
2571| #define LIBCURL_PROTOCOL_IMAPS 1
2572| #define LIBCURL_PROTOCOL_POP3 1
2573| #define LIBCURL_PROTOCOL_POP3S 1
2574| #define LIBCURL_PROTOCOL_RTSP 1
2575| #define LIBCURL_PROTOCOL_SCP 1
2576| #define LIBCURL_PROTOCOL_SFTP 1
2577| #define LIBCURL_PROTOCOL_SMB 1
2578| #define LIBCURL_PROTOCOL_SMBS 1
2579| #define LIBCURL_PROTOCOL_SMTP 1
2580| #define LIBCURL_PROTOCOL_SMTPS 1
2581| #define LIBCURL_PROTOCOL_TELNET 1
2582| #define LIBCURL_PROTOCOL_TFTP 1
2583| #define HAVE_ICONV 1
2584| #define ICONV_CONST
2585| /* end confdefs.h.  */
2586|
2587| /* Override any GCC internal prototype to avoid an error.
2588|    Use char because int might match the return type of a GCC
2589|    builtin and then its argument prototype would still apply.  */
2590| #ifdef __cplusplus
2591| extern "C"
2592| #endif
2593| char mpc_cmp_abs ();
2594| #ifdef FC_DUMMY_MAIN
2595| #ifndef FC_DUMMY_MAIN_EQ_F77
2596| #  ifdef __cplusplus
2597|      extern "C"
2598| #  endif
2599|    int FC_DUMMY_MAIN() { return 1; }
2600| #endif
2601| #endif
2602| int
2603| main ()
2604| {
2605| return mpc_cmp_abs ();
2606|   ;
2607|   return 0;
2608| }
2609configure:20848: g++ -std=gnu++11 -o conftest -g -O2     conftest.cpp -lmpc  -lgf2x -lflint -lcurl -lcliquer -lbz2 -lmpfi -lmpfr -lglpk -lgmp -lsymmetrica -llrcalc -lm  -lntl >&5
2610configure:20848: $? = 0
2611configure:20865: result: -lmpc
2612configure:20901: result: using mpc library from the system
2613configure:20918: === checking whether to install the perl_term_readline_gnu SPKG ===
2614configure:21010: checking for perl module Term::ReadLine
2615configure:21020: result: ok
2616configure:21028: checking Term::ReadLine module...
2617configure:21036: result: GNU
2618configure:21078: === checking whether to install the yasm SPKG ===
2619configure:21131: checking for yasm supporting the adox instruction
2620configure:21158: result: /usr/bin/yasm
2621configure:21189: === checking whether to install the rw SPKG ===
2622configure:21233: checking rw.h usability
2623configure:21233: g++ -std=gnu++11 -c -g -O2    conftest.cpp >&5
2624configure:21233: $? = 0
2625configure:21233: result: yes
2626configure:21233: checking rw.h presence
2627configure:21233: g++ -E -std=gnu++11    conftest.cpp
2628configure:21233: $? = 0
2629configure:21233: result: yes
2630configure:21233: checking for rw.h
2631configure:21233: result: yes
2632configure:21247: checking for library containing calculate_level
2633configure:21286: g++ -std=gnu++11 -o conftest -g -O2     conftest.cpp -lmpc -lgf2x -lflint -lcurl -lcliquer -lbz2 -lmpfi -lmpfr -lglpk -lgmp -lsymmetrica -llrcalc -lm  -lntl >&5
2634/usr/bin/ld: /tmp/cc2MN3dK.o: in function `main':
2635/opt/sage/conftest.cpp:84: undefined reference to `calculate_level'
2636collect2: error: ld returned 1 exit status
2637configure:21286: $? = 1
2638configure: failed program was:
2639| /* confdefs.h */
2640| #define PACKAGE_NAME "Sage"
2641| #define PACKAGE_TARNAME "sage"
2642| #define PACKAGE_VERSION "9.1.beta1"
2643| #define PACKAGE_STRING "Sage 9.1.beta1"
2644| #define PACKAGE_BUGREPORT "sage-devel@googlegroups.com"
2645| #define PACKAGE_URL ""
2646| #define PACKAGE "sage"
2647| #define VERSION "9.1.beta1"
2648| #define STDC_HEADERS 1
2649| #define HAVE_SYS_TYPES_H 1
2650| #define HAVE_SYS_STAT_H 1
2651| #define HAVE_STDLIB_H 1
2652| #define HAVE_STRING_H 1
2653| #define HAVE_MEMORY_H 1
2654| #define HAVE_STRINGS_H 1
2655| #define HAVE_INTTYPES_H 1
2656| #define HAVE_STDINT_H 1
2657| #define HAVE_UNISTD_H 1
2658| #define HAVE_LIBM 1
2659| #define HAVE_CXX11 1
2660| #define HAVE_LRCALC_SCHUBLIB_H 1
2661| #define HAVE_ZMQ /**/
2662| #define HAVE_GMP_H 1
2663| #define ABSOLUTE_GMP_H "///usr/include/gmp.h"
2664| #define HAVE_LIBCURL 1
2665| #define LIBCURL_FEATURE_SSL 1
2666| #define LIBCURL_FEATURE_IPV6 1
2667| #define LIBCURL_FEATURE_UNIXSOCKETS 1
2668| #define LIBCURL_FEATURE_LIBZ 1
2669| #define LIBCURL_FEATURE_ASYNCHDNS 1
2670| #define LIBCURL_FEATURE_IDN 1
2671| #define LIBCURL_FEATURE_GSS_API 1
2672| #define LIBCURL_FEATURE_PSL 1
2673| #define LIBCURL_FEATURE_SPNEGO 1
2674| #define LIBCURL_FEATURE_KERBEROS 1
2675| #define LIBCURL_FEATURE_NTLM 1
2676| #define LIBCURL_FEATURE_NTLM_WB 1
2677| #define LIBCURL_FEATURE_TLS_SRP 1
2678| #define LIBCURL_FEATURE_HTTP2 1
2679| #define LIBCURL_FEATURE_HTTPS_PROXY 1
2680| #define LIBCURL_PROTOCOL_DICT 1
2681| #define LIBCURL_PROTOCOL_FILE 1
2682| #define LIBCURL_PROTOCOL_FTP 1
2683| #define LIBCURL_PROTOCOL_FTPS 1
2684| #define LIBCURL_PROTOCOL_GOPHER 1
2685| #define LIBCURL_PROTOCOL_HTTP 1
2686| #define LIBCURL_PROTOCOL_HTTPS 1
2687| #define LIBCURL_PROTOCOL_IMAP 1
2688| #define LIBCURL_PROTOCOL_IMAPS 1
2689| #define LIBCURL_PROTOCOL_POP3 1
2690| #define LIBCURL_PROTOCOL_POP3S 1
2691| #define LIBCURL_PROTOCOL_RTSP 1
2692| #define LIBCURL_PROTOCOL_SCP 1
2693| #define LIBCURL_PROTOCOL_SFTP 1
2694| #define LIBCURL_PROTOCOL_SMB 1
2695| #define LIBCURL_PROTOCOL_SMBS 1
2696| #define LIBCURL_PROTOCOL_SMTP 1
2697| #define LIBCURL_PROTOCOL_SMTPS 1
2698| #define LIBCURL_PROTOCOL_TELNET 1
2699| #define LIBCURL_PROTOCOL_TFTP 1
2700| #define HAVE_ICONV 1
2701| #define ICONV_CONST
2702| /* end confdefs.h.  */
2703|
2704| /* Override any GCC internal prototype to avoid an error.
2705|    Use char because int might match the return type of a GCC
2706|    builtin and then its argument prototype would still apply.  */
2707| #ifdef __cplusplus
2708| extern "C"
2709| #endif
2710| char calculate_level ();
2711| #ifdef FC_DUMMY_MAIN
2712| #ifndef FC_DUMMY_MAIN_EQ_F77
2713| #  ifdef __cplusplus
2714|      extern "C"
2715| #  endif
2716|    int FC_DUMMY_MAIN() { return 1; }
2717| #endif
2718| #endif
2719| int
2720| main ()
2721| {
2722| return calculate_level ();
2723|   ;
2724|   return 0;
2725| }
2726configure:21286: g++ -std=gnu++11 -o conftest -g -O2     conftest.cpp -lrw  -lmpc -lgf2x -lflint -lcurl -lcliquer -lbz2 -lmpfi -lmpfr -lglpk -lgmp -lsymmetrica -llrcalc -lm  -lntl >&5
2727configure:21286: $? = 0
2728configure:21303: result: -lrw
2729configure:21343: === checking whether to install the m4ri SPKG ===
2730configure:21389: checking installing any of libpng?
2731configure:21398: result: no
2732configure:21403: checking for M4RI
2733configure:21410: $PKG_CONFIG --exists --print-errors "m4ri >= 20140914"
2734configure:21413: $? = 0
2735configure:21427: $PKG_CONFIG --exists --print-errors "m4ri >= 20140914"
2736configure:21430: $? = 0
2737configure:21470: result: yes
2738configure:21508: === checking whether to install the m4rie SPKG ===
2739configure:21554: checking installing any of m4ri?
2740configure:21563: result: no
2741configure:21566: checking m4rie/m4rie.h usability
2742configure:21566: g++ -std=gnu++11 -c -g -O2    conftest.cpp >&5
2743configure:21566: $? = 0
2744configure:21566: result: yes
2745configure:21566: checking m4rie/m4rie.h presence
2746configure:21566: g++ -E -std=gnu++11    conftest.cpp
2747configure:21566: $? = 0
2748configure:21566: result: yes
2749configure:21566: checking for m4rie/m4rie.h
2750configure:21566: result: yes
2751configure:21569: checking for library containing gf2e_init
2752configure:21608: g++ -std=gnu++11 -o conftest -g -O2     conftest.cpp -lrw -lmpc -lgf2x -lflint -lcurl -lcliquer -lbz2 -lmpfi -lmpfr -lglpk -lgmp -lsymmetrica -llrcalc -lm  -lntl >&5
2753/usr/bin/ld: /tmp/cc6P7JF6.o: in function `main':
2754/opt/sage/conftest.cpp:84: undefined reference to `gf2e_init'
2755collect2: error: ld returned 1 exit status
2756configure:21608: $? = 1
2757configure: failed program was:
2758| /* confdefs.h */
2759| #define PACKAGE_NAME "Sage"
2760| #define PACKAGE_TARNAME "sage"
2761| #define PACKAGE_VERSION "9.1.beta1"
2762| #define PACKAGE_STRING "Sage 9.1.beta1"
2763| #define PACKAGE_BUGREPORT "sage-devel@googlegroups.com"
2764| #define PACKAGE_URL ""
2765| #define PACKAGE "sage"
2766| #define VERSION "9.1.beta1"
2767| #define STDC_HEADERS 1
2768| #define HAVE_SYS_TYPES_H 1
2769| #define HAVE_SYS_STAT_H 1
2770| #define HAVE_STDLIB_H 1
2771| #define HAVE_STRING_H 1
2772| #define HAVE_MEMORY_H 1
2773| #define HAVE_STRINGS_H 1
2774| #define HAVE_INTTYPES_H 1
2775| #define HAVE_STDINT_H 1
2776| #define HAVE_UNISTD_H 1
2777| #define HAVE_LIBM 1
2778| #define HAVE_CXX11 1
2779| #define HAVE_LRCALC_SCHUBLIB_H 1
2780| #define HAVE_ZMQ /**/
2781| #define HAVE_GMP_H 1
2782| #define ABSOLUTE_GMP_H "///usr/include/gmp.h"
2783| #define HAVE_LIBCURL 1
2784| #define LIBCURL_FEATURE_SSL 1
2785| #define LIBCURL_FEATURE_IPV6 1
2786| #define LIBCURL_FEATURE_UNIXSOCKETS 1
2787| #define LIBCURL_FEATURE_LIBZ 1
2788| #define LIBCURL_FEATURE_ASYNCHDNS 1
2789| #define LIBCURL_FEATURE_IDN 1
2790| #define LIBCURL_FEATURE_GSS_API 1
2791| #define LIBCURL_FEATURE_PSL 1
2792| #define LIBCURL_FEATURE_SPNEGO 1
2793| #define LIBCURL_FEATURE_KERBEROS 1
2794| #define LIBCURL_FEATURE_NTLM 1
2795| #define LIBCURL_FEATURE_NTLM_WB 1
2796| #define LIBCURL_FEATURE_TLS_SRP 1
2797| #define LIBCURL_FEATURE_HTTP2 1
2798| #define LIBCURL_FEATURE_HTTPS_PROXY 1
2799| #define LIBCURL_PROTOCOL_DICT 1
2800| #define LIBCURL_PROTOCOL_FILE 1
2801| #define LIBCURL_PROTOCOL_FTP 1
2802| #define LIBCURL_PROTOCOL_FTPS 1
2803| #define LIBCURL_PROTOCOL_GOPHER 1
2804| #define LIBCURL_PROTOCOL_HTTP 1
2805| #define LIBCURL_PROTOCOL_HTTPS 1
2806| #define LIBCURL_PROTOCOL_IMAP 1
2807| #define LIBCURL_PROTOCOL_IMAPS 1
2808| #define LIBCURL_PROTOCOL_POP3 1
2809| #define LIBCURL_PROTOCOL_POP3S 1
2810| #define LIBCURL_PROTOCOL_RTSP 1
2811| #define LIBCURL_PROTOCOL_SCP 1
2812| #define LIBCURL_PROTOCOL_SFTP 1
2813| #define LIBCURL_PROTOCOL_SMB 1
2814| #define LIBCURL_PROTOCOL_SMBS 1
2815| #define LIBCURL_PROTOCOL_SMTP 1
2816| #define LIBCURL_PROTOCOL_SMTPS 1
2817| #define LIBCURL_PROTOCOL_TELNET 1
2818| #define LIBCURL_PROTOCOL_TFTP 1
2819| #define HAVE_ICONV 1
2820| #define ICONV_CONST
2821| /* end confdefs.h.  */
2822|
2823| /* Override any GCC internal prototype to avoid an error.
2824|    Use char because int might match the return type of a GCC
2825|    builtin and then its argument prototype would still apply.  */
2826| #ifdef __cplusplus
2827| extern "C"
2828| #endif
2829| char gf2e_init ();
2830| #ifdef FC_DUMMY_MAIN
2831| #ifndef FC_DUMMY_MAIN_EQ_F77
2832| #  ifdef __cplusplus
2833|      extern "C"
2834| #  endif
2835|    int FC_DUMMY_MAIN() { return 1; }
2836| #endif
2837| #endif
2838| int
2839| main ()
2840| {
2841| return gf2e_init ();
2842|   ;
2843|   return 0;
2844| }
2845configure:21608: g++ -std=gnu++11 -o conftest -g -O2     conftest.cpp -lm4rie  -lrw -lmpc -lgf2x -lflint -lcurl -lcliquer -lbz2 -lmpfi -lmpfr -lglpk -lgmp -lsymmetrica -llrcalc -lm  -lntl >&5
2846configure:21608: $? = 0
2847configure:21625: result: -lm4rie
2848configure:21676: === checking whether to install the arb SPKG ===
2849configure:21721: checking installing flint?
2850configure:21728: checking arb.h usability
2851configure:21728: g++ -std=gnu++11 -c -g -O2    conftest.cpp >&5
2852configure:21728: $? = 0
2853configure:21728: result: yes
2854configure:21728: checking arb.h presence
2855configure:21728: g++ -E -std=gnu++11    conftest.cpp
2856configure:21728: $? = 0
2857configure:21728: result: yes
2858configure:21728: checking for arb.h
2859configure:21728: result: yes
2860configure:21731: checking for acb_mat_eig_simple in -larb
2861configure:21764: g++ -std=gnu++11 -o conftest -g -O2     conftest.cpp -larb  -lm4rie -lrw -lmpc -lgf2x -lflint -lcurl -lcliquer -lbz2 -lmpfi -lmpfr -lglpk -lgmp -lsymmetrica -llrcalc -lm  -lntl >&5
2862configure:21764: $? = 0
2863configure:21773: result: yes
2864configure:21880: === checking whether to install the isl SPKG ===
2865configure:21924: checking installing gmp/mpir?
2866configure:21931: result: no
2867configure:21935: checking for ISL
2868configure:21942: $PKG_CONFIG --exists --print-errors "isl >= 0.20"
2869configure:21945: $? = 0
2870configure:21959: $PKG_CONFIG --exists --print-errors "isl >= 0.20"
2871configure:21962: $? = 0
2872configure:22002: result: yes
2873configure:22037: === checking whether to install the git SPKG ===
2874configure:22081: checking for git
2875configure:22113: result: /usr/bin/git
2876configure:22145: === checking whether to install the ecm SPKG ===
2877configure:22190: checking installing gmp/mpir?
2878configure:22197: result: no.
2879configure:22199: checking ecm.h usability
2880configure:22199: g++ -std=gnu++11 -c -g -O2    conftest.cpp >&5
2881configure:22199: $? = 0
2882configure:22199: result: yes
2883configure:22199: checking ecm.h presence
2884configure:22199: g++ -E -std=gnu++11    conftest.cpp
2885configure:22199: $? = 0
2886configure:22199: result: yes
2887configure:22199: checking for ecm.h
2888configure:22199: result: yes
2889configure:22202: checking absolute name of <ecm.h>
2890configure:22209: checking for ecm.h
2891configure:22209: result: yes
2892configure:22233: result: ///usr/include/ecm.h
2893configure:22282: checking for library containing ecm_factor
2894configure:22321: g++ -std=gnu++11 -o conftest -g -O2     conftest.cpp -larb -lm4rie -lrw -lmpc -lgf2x -lflint -lcurl -lcliquer -lbz2 -lmpfi -lmpfr -lglpk -lgmp -lsymmetrica -llrcalc -lm  -lntl >&5
2895/usr/bin/ld: /tmp/cczcF6C7.o: in function `main':
2896/opt/sage/conftest.cpp:87: undefined reference to `ecm_factor'
2897collect2: error: ld returned 1 exit status
2898configure:22321: $? = 1
2899configure: failed program was:
2900| /* confdefs.h */
2901| #define PACKAGE_NAME "Sage"
2902| #define PACKAGE_TARNAME "sage"
2903| #define PACKAGE_VERSION "9.1.beta1"
2904| #define PACKAGE_STRING "Sage 9.1.beta1"
2905| #define PACKAGE_BUGREPORT "sage-devel@googlegroups.com"
2906| #define PACKAGE_URL ""
2907| #define PACKAGE "sage"
2908| #define VERSION "9.1.beta1"
2909| #define STDC_HEADERS 1
2910| #define HAVE_SYS_TYPES_H 1
2911| #define HAVE_SYS_STAT_H 1
2912| #define HAVE_STDLIB_H 1
2913| #define HAVE_STRING_H 1
2914| #define HAVE_MEMORY_H 1
2915| #define HAVE_STRINGS_H 1
2916| #define HAVE_INTTYPES_H 1
2917| #define HAVE_STDINT_H 1
2918| #define HAVE_UNISTD_H 1
2919| #define HAVE_LIBM 1
2920| #define HAVE_CXX11 1
2921| #define HAVE_LRCALC_SCHUBLIB_H 1
2922| #define HAVE_ZMQ /**/
2923| #define HAVE_GMP_H 1
2924| #define ABSOLUTE_GMP_H "///usr/include/gmp.h"
2925| #define HAVE_LIBCURL 1
2926| #define LIBCURL_FEATURE_SSL 1
2927| #define LIBCURL_FEATURE_IPV6 1
2928| #define LIBCURL_FEATURE_UNIXSOCKETS 1
2929| #define LIBCURL_FEATURE_LIBZ 1
2930| #define LIBCURL_FEATURE_ASYNCHDNS 1
2931| #define LIBCURL_FEATURE_IDN 1
2932| #define LIBCURL_FEATURE_GSS_API 1
2933| #define LIBCURL_FEATURE_PSL 1
2934| #define LIBCURL_FEATURE_SPNEGO 1
2935| #define LIBCURL_FEATURE_KERBEROS 1
2936| #define LIBCURL_FEATURE_NTLM 1
2937| #define LIBCURL_FEATURE_NTLM_WB 1
2938| #define LIBCURL_FEATURE_TLS_SRP 1
2939| #define LIBCURL_FEATURE_HTTP2 1
2940| #define LIBCURL_FEATURE_HTTPS_PROXY 1
2941| #define LIBCURL_PROTOCOL_DICT 1
2942| #define LIBCURL_PROTOCOL_FILE 1
2943| #define LIBCURL_PROTOCOL_FTP 1
2944| #define LIBCURL_PROTOCOL_FTPS 1
2945| #define LIBCURL_PROTOCOL_GOPHER 1
2946| #define LIBCURL_PROTOCOL_HTTP 1
2947| #define LIBCURL_PROTOCOL_HTTPS 1
2948| #define LIBCURL_PROTOCOL_IMAP 1
2949| #define LIBCURL_PROTOCOL_IMAPS 1
2950| #define LIBCURL_PROTOCOL_POP3 1
2951| #define LIBCURL_PROTOCOL_POP3S 1
2952| #define LIBCURL_PROTOCOL_RTSP 1
2953| #define LIBCURL_PROTOCOL_SCP 1
2954| #define LIBCURL_PROTOCOL_SFTP 1
2955| #define LIBCURL_PROTOCOL_SMB 1
2956| #define LIBCURL_PROTOCOL_SMBS 1
2957| #define LIBCURL_PROTOCOL_SMTP 1
2958| #define LIBCURL_PROTOCOL_SMTPS 1
2959| #define LIBCURL_PROTOCOL_TELNET 1
2960| #define LIBCURL_PROTOCOL_TFTP 1
2961| #define HAVE_ICONV 1
2962| #define ICONV_CONST
2963| #define HAVE_LIBARB 1
2964| #define HAVE_ECM_H 1
2965| #define ABSOLUTE_ECM_H "///usr/include/ecm.h"
2966| /* end confdefs.h.  */
2967|
2968| /* Override any GCC internal prototype to avoid an error.
2969|    Use char because int might match the return type of a GCC
2970|    builtin and then its argument prototype would still apply.  */
2971| #ifdef __cplusplus
2972| extern "C"
2973| #endif
2974| char ecm_factor ();
2975| #ifdef FC_DUMMY_MAIN
2976| #ifndef FC_DUMMY_MAIN_EQ_F77
2977| #  ifdef __cplusplus
2978|      extern "C"
2979| #  endif
2980|    int FC_DUMMY_MAIN() { return 1; }
2981| #endif
2982| #endif
2983| int
2984| main ()
2985| {
2986| return ecm_factor ();
2987|   ;
2988|   return 0;
2989| }
2990configure:22321: g++ -std=gnu++11 -o conftest -g -O2     conftest.cpp -lecm  -larb -lm4rie -lrw -lmpc -lgf2x -lflint -lcurl -lcliquer -lbz2 -lmpfi -lmpfr -lglpk -lgmp -lsymmetrica -llrcalc -lm  -lntl >&5
2991configure:22321: $? = 0
2992configure:22338: result: -lecm
2993configure:22355: checking for ecm
2994configure:22373: found /usr/bin/ecm
2995configure:22385: result: /usr/bin/ecm
2996configure:22483: === checking whether to install the eclib SPKG ===
2997configure:22528: checking installing ntl or pari?
2998configure:22531: result: yes; install eclib as well
2999configure:22624: === checking whether to install the libffi SPKG ===
3000configure:22669: checking for LIBFFI
3001configure:22676: $PKG_CONFIG --exists --print-errors "libffi"
3002configure:22679: $? = 0
3003configure:22693: $PKG_CONFIG --exists --print-errors "libffi"
3004configure:22696: $? = 0
3005configure:22898: result: yes
3006configure:22932: === checking whether to install the libsemigroups SPKG ===
3007configure:22977: checking for LIBSEMIGROUPS
3008configure:22984: $PKG_CONFIG --exists --print-errors "libsemigroups >= 0.6.7"
3009Package libsemigroups was not found in the pkg-config search path.
3010Perhaps you should add the directory containing `libsemigroups.pc'
3011to the PKG_CONFIG_PATH environment variable
3012Package 'libsemigroups', required by 'virtual:world', not found
3013configure:22987: $? = 1
3014configure:23001: $PKG_CONFIG --exists --print-errors "libsemigroups >= 0.6.7"
3015Package libsemigroups was not found in the pkg-config search path.
3016Perhaps you should add the directory containing `libsemigroups.pc'
3017to the PKG_CONFIG_PATH environment variable
3018Package 'libsemigroups', required by 'virtual:world', not found
3019configure:23004: $? = 1
3020configure:23018: result: no
3021Package 'libsemigroups', required by 'virtual:world', not found
3022configure:23530: checking SPKGs to install
3023configure:23532: result:
3024configure:23621: result:     4ti2-1.6.7.p0
3025configure:23621: result:     alabaster-0.7.12
3026configure:23621: result:     appnope-0.1.0.p0
3027configure:23625: result:     arb-2.16.0.p0 will not be installed (configure check)
3028configure:23625: result:     atlas-3.10.2.p3 will not be installed (configure check)
3029configure:23621: result:     autotools-20141105.p0
3030configure:23621: result:     awali-1.0.2-190218
3031configure:23621: result:     babel-2.6.0
3032configure:23621: result:     backports_abc-0.5
3033configure:23621: result:     backports_functools_lru_cache-1.5
3034configure:23621: result:     backports_shutil_get_terminal_size-1.0.0.p1
3035configure:23621: result:     backports_ssl_match_hostname-3.5.0.1.p0
3036configure:23621: result:     barvinok-0.41.1
3037configure:23621: result:     benzene-20130630
3038configure:23621: result:     bleach-3.1.0
3039configure:23621: result:     bliss-0.73+debian-1+sage-2016-08-02.p0
3040configure:23621: result:     boost-1_66_0
3041configure:23621: result:     boost_cropped-1.66.0.p0
3042configure:23621: result:     brial-1.2.5
3043configure:23621: result:     buckygen-1.1
3044configure:23625: result:     bzip2-1.0.6-20150304.p0 will not be installed (configure check)
3045configure:23625: result:     cbc-2.9.4.p0 will not be installed (configure check)
3046configure:23621: result:     ccache-3.3.4
3047configure:23621: result:     cddlib-0.94j
3048configure:23621: result:     certifi-2019.3.9
3049configure:23625: result:     cliquer-1.21.p4 will not be installed (configure check)
3050configure:23625: result:     cmake-3.11.0 will not be installed (configure check)
3051configure:23621: result:     cocoalib-0.99564
3052configure:23621: result:     combinatorial_designs-20140630.p0
3053configure:23621: result:     compilerwrapper-1.2
3054configure:23621: result:     configparser-3.7.4
3055configure:23621: result:     configure-4fd5d56ecea2c81d58e9e43bd5f07b05e863bc7c
3056configure:23621: result:     conway_polynomials-0.5
3057configure:23621: result:     coxeter3-8ac9c71723c8ca57a836d6381aed125261e44e9e
3058configure:23621: result:     cryptominisat-5.6.8
3059configure:23621: result:     csdp-6.2.p0
3060configure:23625: result:     curl-7.62.0.p0 will not be installed (configure check)
3061configure:23621: result:     cvxopt-1.2.3
3062configure:23621: result:     cycler-0.10.0.p0
3063configure:23621: result:     cypari-2.1.1
3064configure:23621: result:     cysignals-1.10.2
3065configure:23621: result:     cython-0.29.12.p0
3066configure:23621: result:     d3js-3.4.8
3067configure:23621: result:     database_cremona_ellcurve-20190911
3068configure:23621: result:     database_jones_numfield-4
3069configure:23621: result:     database_kohel-20160724
3070configure:23621: result:     database_mutation_class-1.0
3071configure:23621: result:     database_odlyzko_zeta-20061209
3072configure:23621: result:     database_stein_watkins-20110713
3073configure:23621: result:     database_stein_watkins_mini-20070827
3074configure:23621: result:     database_symbolic_data-20070206
3075configure:23621: result:     dateutil-2.5.3
3076configure:23621: result:     decorator-4.4.0
3077configure:23621: result:     deformation-d05941b.p0
3078configure:23621: result:     defusedxml-0.6.0
3079configure:23621: result:     docutils-0.14
3080configure:23621: result:     dot2tex-2.11.3.p0
3081configure:23621: result:     e_antic-0.1.3
3082configure:23621: result:     ecl-16.1.2.p5
3083configure:23621: result:     eclib-20190909
3084configure:23625: result:     ecm-7.0.4.p1 will not be installed (configure check)
3085configure:23621: result:     elliptic_curves-0.8.1
3086configure:23621: result:     entrypoints-0.3
3087configure:23621: result:     enum34-1.1.6
3088configure:23621: result:     fflas_ffpack-2.4.3
3089configure:23621: result:     flask-0.10.1.p0
3090configure:23621: result:     flask_autoindex-0.6.p0
3091configure:23621: result:     flask_babel-0.9.p0
3092configure:23621: result:     flask_oldsessions-0.10.p0
3093configure:23621: result:     flask_openid-1.2.5.p0
3094configure:23621: result:     flask_silk-0.2.p0
3095configure:23625: result:     flint-2.5.2.p5 will not be installed (configure check)
3096configure:23621: result:     flintqs-1.0.p0
3097configure:23621: result:     fplll-5.3.2
3098configure:23621: result:     fpylll-0.5.1dev
3099configure:23625: result:     freetype-2.9.1 will not be installed (configure check)
3100configure:23621: result:     fricas-1.3.5
3101configure:23621: result:     frobby-0.9.0.p2
3102configure:23621: result:     functools32-3.2.3-2.p0
3103configure:23621: result:     future-0.17.1
3104configure:23621: result:     gambit-15.1.1.p0
3105configure:23621: result:     gap-4.10.2.p1
3106configure:23621: result:     gap3-04jul17
3107configure:23621: result:     gap_jupyter-0.9
3108configure:23621: result:     gap_packages-4.10.2.p1
3109configure:23621: result:     gc-7.6.4.p0
3110configure:23625: result:     gcc-9.2.0 will not be installed (configure check)
3111configure:23621: result:     gdb-8.2
3112configure:23621: result:     gf2x-1.2.p0
3113configure:23625: result:     gfan-0.6.2.p1 will not be installed (configure check)
3114configure:23625: result:     gfortran-9.2.0 will not be installed (configure check)
3115configure:23621: result:     giac-1.5.0.63.p0
3116configure:23621: result:     giacpy_sage-0.6.8
3117configure:23625: result:     git-2.11.0 will not be installed (configure check)
3118configure:23621: result:     git_trac-20160625.p0
3119configure:23621: result:     givaro-4.1.1
3120configure:23625: result:     glpk-4.65.p0 will not be installed (configure check)
3121configure:23621: result:     glucose-4.1
3122configure:23625: result:     gmp-6.1.2 will not be installed (configure check)
3123configure:23621: result:     gmpy2-2.1.0b1
3124configure:23621: result:     gp2c-0.0.10.p0
3125configure:23621: result:     graphs-20161026.p0
3126configure:23625: result:     gsl-2.5 will not be installed (configure check)
3127configure:23621: result:     html5lib-1.0.1
3128configure:23625: result:     iconv-1.15 will not be installed (configure check)
3129configure:23621: result:     igraph-0.7.1999.p0
3130configure:23621: result:     imagesize-1.1.0
3131configure:23621: result:     iml-1.0.4p1.p2
3132configure:23621: result:     ipaddress-1.0.22
3133configure:23621: result:     ipykernel-4.8.2
3134configure:23621: result:     ipython-5.8.0
3135configure:23621: result:     ipython_genutils-0.2.0
3136configure:23621: result:     ipywidgets-7.4.2
3137configure:23625: result:     isl-0.20 will not be installed (configure check)
3138configure:23621: result:     itsdangerous-1.1.0
3139configure:23621: result:     jinja2-2.10
3140configure:23621: result:     jmol-14.29.52
3141configure:23621: result:     jsonschema-2.6.0
3142configure:23621: result:     jupymake-0.9
3143configure:23621: result:     jupyter_client-5.2.4
3144configure:23621: result:     jupyter_core-4.4.0
3145configure:23621: result:     kenzo-1.1.7-r3
3146configure:23621: result:     kiwisolver-1.0.1
3147configure:23621: result:     latte_int-1.7.5.p0
3148configure:23621: result:     lcalc-1.23.p19
3149configure:23625: result:     libatomic_ops-7.6.2 will not be installed (configure check)
3150configure:23621: result:     libbraiding-1.0.p0
3151configure:23625: result:     libffi-3.2.1 will not be installed (configure check)
3152configure:23625: result:     libgd-2.1.1.1.p1 will not be installed (configure check)
3153configure:23621: result:     libhomfly-1.02r4.p0
3154configure:23621: result:     libogg-1.3.1.p0
3155configure:23625: result:     libpng-1.6.29.p1 will not be installed (configure check)
3156configure:23621: result:     libsemigroups-0.6.7
3157configure:23621: result:     libtheora-1.1.1
3158configure:23621: result:     lidia-2.3.0+latte-patches-2019-05-02
3159configure:23621: result:     lie-2.2.2
3160configure:23621: result:     linbox-1.6.3
3161configure:23625: result:     lrcalc-1.2.p1 will not be installed (configure check)
3162configure:23621: result:     lrslib-062+autotools-2017-03-03.p1
3163configure:23625: result:     m4ri-20140914.p0 will not be installed (configure check)
3164configure:23625: result:     m4rie-20150908.p0 will not be installed (configure check)
3165configure:23621: result:     markupsafe-1.1.0
3166configure:23621: result:     mathjax-2.7.4.p0
3167configure:23621: result:     matplotlib-2.2.4.p0
3168configure:23621: result:     maxima-5.42.2
3169configure:23621: result:     mcqd-1.0
3170configure:23621: result:     meataxe-1.0.p0
3171configure:23621: result:     mistune-0.8.4
3172configure:23621: result:     modular_decomposition-20100607
3173configure:23625: result:     mpc-1.1.0 will not be installed (configure check)
3174configure:23625: result:     mpfi-1.5.2 will not be installed (configure check)
3175configure:23625: result:     mpfr-4.0.1.p0 will not be installed (configure check)
3176configure:23621: result:     mpfrcx-0.5
3177configure:23625: result:     mpir-3.0.0-644faf502c56f97d9accd301965fc57d6ec70868.p0 will not be installed (configure check)
3178configure:23621: result:     mpmath-1.1.0
3179configure:23625: result:     nauty-26r1.p0 will not be installed (configure check)
3180configure:23621: result:     nbconvert-5.4.0
3181configure:23621: result:     nbformat-4.4.0
3182configure:23625: result:     ncurses-6.0.p0 will not be installed (configure check)
3183configure:23621: result:     networkx-2.2
3184configure:23625: result:     ninja_build-1.8.2 will not be installed (configure check)
3185configure:23621: result:     normaliz-3.7.2
3186configure:23621: result:     nose-1.3.7
3187configure:23621: result:     notebook-5.7.6.p0
3188configure:23621: result:     notedown-1.5.1
3189configure:23625: result:     ntl-11.3.2 will not be installed (configure check)
3190configure:23621: result:     numpy-1.16.1
3191configure:23625: result:     openblas-0.3.6.p0 will not be installed (configure check)
3192configure:23621: result:     openssl-1.1.1b
3193configure:23621: result:     p_group_cohomology-3.3
3194configure:23621: result:     packaging-18.0
3195configure:23621: result:     palp-2.1.p2
3196configure:23621: result:     pandoc_attributes-8bc82f6d
3197configure:23621: result:     pandocfilters-1.4.2
3198configure:23621: result:     pari-2.11.2
3199configure:23621: result:     pari_elldata-20161017
3200configure:23621: result:     pari_galdata-20080411.p0
3201configure:23621: result:     pari_galpol-20180625
3202configure:23621: result:     pari_jupyter-1.3.2
3203configure:23621: result:     pari_nftables-20080929
3204configure:23621: result:     pari_seadata-20090618
3205configure:23621: result:     pari_seadata_small-20090618.p0
3206configure:23625: result:     patch-2.7.5 will not be installed (configure check)
3207configure:23621: result:     pathlib2-2.3.3
3208configure:23621: result:     pathpy-7.1.p0
3209configure:23625: result:     pcre-8.40.p2 will not be installed (configure check)
3210configure:23625: result:     perl_term_readline_gnu-1.35 will not be installed (configure check)
3211configure:23621: result:     pexpect-4.6.0.p0
3212configure:23621: result:     pickleshare-0.7.5
3213configure:23621: result:     pillow-5.3.0.p0
3214configure:23621: result:     pip-18.1
3215configure:23625: result:     pkgconf-0.9.7.p2 will not be installed (configure check)
3216configure:23621: result:     pkgconfig-1.5.1
3217configure:23621: result:     planarity-3.0.0.5.p0
3218configure:23621: result:     plantri-4.5
3219configure:23621: result:     polylib-5.22.5
3220configure:23621: result:     polymake-3.4
3221configure:23621: result:     polytopes_db-20170220.p0
3222configure:23621: result:     ppl-1.2.p1
3223configure:23621: result:     pplpy-0.8.4
3224configure:23621: result:     primecount-5.1
3225configure:23621: result:     prometheus_client-0.5.0
3226configure:23621: result:     prompt_toolkit-1.0.15
3227configure:23621: result:     psutil-5.2.0.p2
3228configure:23621: result:     ptyprocess-0.5.1.p0
3229configure:23621: result:     pycosat-0.6.3
3230configure:23621: result:     pycygwin-0.1
3231configure:23621: result:     pygments-2.3.1.p0
3232configure:23621: result:     pynac-0.7.26
3233configure:23621: result:     pynormaliz-2.7
3234configure:23621: result:     pyparsing-2.3.0
3235configure:23621: result:     pysingular-0.9.5
3236configure:23621: result:     python2-2.7.15.p1
3237configure:23621: result:     python3-3.7.3.p1
3238configure:23621: result:     python_igraph-0.7.1999
3239configure:23621: result:     python_openid-2.2.5.p0
3240configure:23621: result:     pytz-2018.7
3241configure:23621: result:     pyzmq-18.1.0
3242configure:23621: result:     qepcad-B.1.71
3243configure:23621: result:     qhull-2015-src-7.2.0.p1
3244configure:23625: result:     r-3.6.2 will not be installed (configure check)
3245configure:23621: result:     ratpoints-2.1.3.p5
3246configure:23625: result:     readline-6.3.008.p0 will not be installed (configure check)
3247configure:23621: result:     requests-2.13.0
3248configure:23621: result:     rpy2-2.8.2.p1
3249configure:23621: result:     rst2ipynb-0.2.2.p0
3250configure:23621: result:     rubiks-20070912.p21
3251configure:23625: result:     rw-0.7.p0 will not be installed (configure check)
3252configure:23621: result:     saclib-2.2.7
3253configure:23621: result:     sage_numerical_backends_coin-9.0b12
3254configure:23621: result:     sage_numerical_backends_cplex-9.0b12
3255configure:23621: result:     sage_numerical_backends_gurobi-9.0.0
3256configure:23621: result:     sagenb-1.1.3
3257configure:23621: result:     sagenb_export-3.3
3258configure:23621: result:     sagetex-3.4
3259configure:23621: result:     scandir-1.9.0
3260configure:23621: result:     scipoptsuite-5.0.1
3261configure:23621: result:     scipy-1.2.0
3262configure:23621: result:     scons-1.2.0
3263configure:23621: result:     send2trash-1.5.0
3264configure:23621: result:     setuptools-40.6.3
3265configure:23621: result:     setuptools_scm-3.1.0
3266configure:23621: result:     simplegeneric-0.8.1.p0
3267configure:23621: result:     singledispatch-3.4.0.3.p0
3268configure:23621: result:     singular-4.1.1p2.p0
3269configure:23621: result:     singular_jupyter-0.9.7
3270configure:23621: result:     sip-4.18
3271configure:23621: result:     sirocco-2.0.p0
3272configure:23621: result:     six-1.12.0
3273configure:23621: result:     snowballstemmer-1.2.1.p0
3274configure:23621: result:     speaklater-1.3.p0
3275configure:23621: result:     sphinx-1.8.5.p0
3276configure:23621: result:     sphinxcontrib_websupport-1.1.0
3277configure:23621: result:     sqlite-3290000
3278configure:23621: result:     subprocess32-3.5.3
3279configure:23621: result:     suitesparse-5.6.0
3280configure:23621: result:     surf-1.0.6-gcc6
3281configure:23625: result:     symmetrica-2.0.p11 will not be installed (configure check)
3282configure:23621: result:     sympow-1.018.1.p13
3283configure:23621: result:     sympy-1.5
3284configure:23625: result:     tachyon-0.98.9.p7 will not be installed (configure check)
3285configure:23621: result:     tdlib-0.3.1.p0
3286configure:23621: result:     termcap-1.3.1.p3
3287configure:23621: result:     terminado-0.8.1
3288configure:23621: result:     testpath-0.4.2
3289configure:23621: result:     thebe-9624e0a0.p0
3290configure:23621: result:     threejs-r110
3291configure:23621: result:     tides-2.0.p0
3292configure:23621: result:     topcom-0.17.7
3293configure:23621: result:     tornado-4.5.2
3294configure:23621: result:     traitlets-4.3.2
3295configure:23621: result:     twisted-16.3.0.p0
3296configure:23621: result:     typing-3.6.6
3297configure:23621: result:     valgrind-3.14.0
3298configure:23621: result:     vcversioner-2.16.0.0.p0
3299configure:23621: result:     wcwidth-0.1.7.p0
3300configure:23621: result:     webencodings-0.5.1
3301configure:23621: result:     werkzeug-0.14.1
3302configure:23621: result:     widgetsnbextension-3.4.2
3303configure:23625: result:     xz-5.2.2.p0 will not be installed (configure check)
3304configure:23625: result:     yasm-1.3.0.p0 will not be installed (configure check)
3305configure:23625: result:     zeromq-4.2.5 will not be installed (configure check)
3306configure:23625: result:     zlib-1.2.11.p0 will not be installed (configure check)
3307configure:23621: result:     zn_poly-0.9.1.p0
3308configure:23621: result:     zope_interface-4.6.0
3309configure:23865: checking that generated files are newer than configure
3310configure:23871: result: done
3311configure:23910: creating ./config.status
3312
3313## ---------------------- ##
3314## Running config.status. ##
3315## ---------------------- ##
3316
3317This file was extended by Sage config.status 9.1.beta1, which was
3318generated by GNU Autoconf 2.69.  Invocation command line was
3319
3320  CONFIG_FILES    =
3321  CONFIG_HEADERS  =
3322  CONFIG_LINKS    =
3323  CONFIG_COMMANDS =
3324  $ ./config.status
3325
3326on mangouste
3327
3328config.status:2673: creating build/make/Makefile-auto
3329config.status:2673: creating build/make/Makefile
3330config.status:2673: creating src/Makefile
3331config.status:2673: creating src/bin/sage-env-config
3332config.status:2862: linking /usr/lib/pkgconfig/openblas.pc to /opt/sage/src/lib/pkgconfig/blas.pc
3333config.status:2881: executing depfiles commands
3334config.status:2881: executing GSLPCPROCESS commands
3335config.status:2881: executing mkdirs commands
3336config.status:3013: creating directory /opt/sage/logs/pkgs
3337config.status:3013: creating directory local
3338config.status:3013: creating directory local/bin
3339config.status:3013: creating directory local/etc
3340config.status:3013: creating directory local/include
3341config.status:3013: creating directory local/lib
3342config.status:3013: creating directory local/share
3343config.status:3013: creating directory local/var/lib/sage/installed
3344config.status:3025: creating symbolic link lib64 -> lib
3345
3346## ---------------- ##
3347## Cache variables. ##
3348## ---------------- ##
3349
3350ac_cv_ECM=7.0.4
3351ac_cv_ECMBIN=7.0.4
3352ac_cv_build=x86_64-pc-linux-gnu
3353ac_cv_c_compiler_gnu=yes
3354ac_cv_cxx_compiler_gnu=yes
3355ac_cv_env_CBC_CFLAGS_set=
3356ac_cv_env_CBC_CFLAGS_value=
3357ac_cv_env_CBC_LIBS_set=
3358ac_cv_env_CBC_LIBS_value=
3359ac_cv_env_CBLAS_CFLAGS_set=
3360ac_cv_env_CBLAS_CFLAGS_value=
3361ac_cv_env_CBLAS_LIBS_set=
3362ac_cv_env_CBLAS_LIBS_value=
3363ac_cv_env_CCC_set=
3364ac_cv_env_CCC_value=
3365ac_cv_env_CC_set=
3366ac_cv_env_CC_value=
3367ac_cv_env_CFLAGS_set=
3368ac_cv_env_CFLAGS_value=
3369ac_cv_env_CPPFLAGS_set=
3370ac_cv_env_CPPFLAGS_value=
3371ac_cv_env_CPP_set=
3372ac_cv_env_CPP_value=
3373ac_cv_env_CXXCPP_set=
3374ac_cv_env_CXXCPP_value=
3375ac_cv_env_CXXFLAGS_set=
3376ac_cv_env_CXXFLAGS_value=
3377ac_cv_env_CXX_set=
3378ac_cv_env_CXX_value=
3379ac_cv_env_FCFLAGS_set=
3380ac_cv_env_FCFLAGS_value=
3381ac_cv_env_FC_set=
3382ac_cv_env_FC_value=
3383ac_cv_env_FREETYPE_CFLAGS_set=
3384ac_cv_env_FREETYPE_CFLAGS_value=
3385ac_cv_env_FREETYPE_LIBS_set=
3386ac_cv_env_FREETYPE_LIBS_value=
3387ac_cv_env_GSLPCDIR_set=
3388ac_cv_env_GSLPCDIR_value=
3389ac_cv_env_GSL_CFLAGS_set=
3390ac_cv_env_GSL_CFLAGS_value=
3391ac_cv_env_GSL_LIBS_set=
3392ac_cv_env_GSL_LIBS_value=
3393ac_cv_env_ISL_CFLAGS_set=
3394ac_cv_env_ISL_CFLAGS_value=
3395ac_cv_env_ISL_LIBS_set=
3396ac_cv_env_ISL_LIBS_value=
3397ac_cv_env_LAPACK_CFLAGS_set=
3398ac_cv_env_LAPACK_CFLAGS_value=
3399ac_cv_env_LAPACK_LIBS_set=
3400ac_cv_env_LAPACK_LIBS_value=
3401ac_cv_env_LDFLAGS_set=
3402ac_cv_env_LDFLAGS_value=
3403ac_cv_env_LIBATOMIC_OPS_CFLAGS_set=
3404ac_cv_env_LIBATOMIC_OPS_CFLAGS_value=
3405ac_cv_env_LIBATOMIC_OPS_LIBS_set=
3406ac_cv_env_LIBATOMIC_OPS_LIBS_value=
3407ac_cv_env_LIBFFI_CFLAGS_set=
3408ac_cv_env_LIBFFI_CFLAGS_value=
3409ac_cv_env_LIBFFI_LIBS_set=
3410ac_cv_env_LIBFFI_LIBS_value=
3411ac_cv_env_LIBGD_CFLAGS_set=
3412ac_cv_env_LIBGD_CFLAGS_value=
3413ac_cv_env_LIBGD_LIBS_set=
3414ac_cv_env_LIBGD_LIBS_value=
3415ac_cv_env_LIBPNG_CFLAGS_set=
3416ac_cv_env_LIBPNG_CFLAGS_value=
3417ac_cv_env_LIBPNG_LIBS_set=
3418ac_cv_env_LIBPNG_LIBS_value=
3419ac_cv_env_LIBSEMIGROUPS_CFLAGS_set=
3420ac_cv_env_LIBSEMIGROUPS_CFLAGS_value=
3421ac_cv_env_LIBSEMIGROUPS_LIBS_set=
3422ac_cv_env_LIBSEMIGROUPS_LIBS_value=
3423ac_cv_env_LIBS_set=
3424ac_cv_env_LIBS_value=
3425ac_cv_env_M4RI_CFLAGS_set=
3426ac_cv_env_M4RI_CFLAGS_value=
3427ac_cv_env_M4RI_LIBS_set=
3428ac_cv_env_M4RI_LIBS_value=
3429ac_cv_env_NCURSES_CFLAGS_set=
3430ac_cv_env_NCURSES_CFLAGS_value=
3431ac_cv_env_NCURSES_LIBS_set=
3432ac_cv_env_NCURSES_LIBS_value=
3433ac_cv_env_OBJCFLAGS_set=
3434ac_cv_env_OBJCFLAGS_value=
3435ac_cv_env_OBJCXXFLAGS_set=
3436ac_cv_env_OBJCXXFLAGS_value=
3437ac_cv_env_OBJCXX_set=
3438ac_cv_env_OBJCXX_value=
3439ac_cv_env_OBJC_set=
3440ac_cv_env_OBJC_value=
3441ac_cv_env_OPENBLASPCDIR_set=
3442ac_cv_env_OPENBLASPCDIR_value=
3443ac_cv_env_OPENBLAS_CFLAGS_set=
3444ac_cv_env_OPENBLAS_CFLAGS_value=
3445ac_cv_env_OPENBLAS_LIBS_set=
3446ac_cv_env_OPENBLAS_LIBS_value=
3447ac_cv_env_PCRE_CFLAGS_set=
3448ac_cv_env_PCRE_CFLAGS_value=
3449ac_cv_env_PCRE_LIBS_set=
3450ac_cv_env_PCRE_LIBS_value=
3451ac_cv_env_PKG_CONFIG_LIBDIR_set=
3452ac_cv_env_PKG_CONFIG_LIBDIR_value=
3453ac_cv_env_PKG_CONFIG_PATH_set=
3454ac_cv_env_PKG_CONFIG_PATH_value=
3455ac_cv_env_PKG_CONFIG_set=
3456ac_cv_env_PKG_CONFIG_value=
3457ac_cv_env_READLINE_CFLAGS_set=
3458ac_cv_env_READLINE_CFLAGS_value=
3459ac_cv_env_READLINE_LIBS_set=
3460ac_cv_env_READLINE_LIBS_value=
3461ac_cv_env_R_CFLAGS_set=
3462ac_cv_env_R_CFLAGS_value=
3463ac_cv_env_R_LIBS_set=
3464ac_cv_env_R_LIBS_value=
3465ac_cv_env_build_alias_set=
3466ac_cv_env_build_alias_value=
3467ac_cv_env_host_alias_set=
3468ac_cv_env_host_alias_value=
3469ac_cv_env_target_alias_set=
3470ac_cv_env_target_alias_value=
3471ac_cv_fc_compiler_gnu=yes
3472ac_cv_fc_dummy_main=none
3473ac_cv_fc_freeform=-ffree-form
3474ac_cv_fc_libs=' -L/usr/lib/gcc/x86_64-pc-linux-gnu/9.2.0 -L/usr/lib/gcc/x86_64-pc-linux-gnu/9.2.0/../../../../lib -L/lib/../lib -L/usr/lib/../lib -L/usr/lib/gcc/x86_64-pc-linux-gnu/9.2.0/../../.. -lmpfi -lmpfr -lglpk -lgmp -lsymmetrica -llrcalc -lgfortran -lm -lquadmath'
3475ac_cv_fc_mangling='lower case, underscore, no extra underscore'
3476ac_cv_fortran_dummy_main=none
3477ac_cv_func_curl_free=yes
3478ac_cv_header_NTL_ZZ_h=yes
3479ac_cv_header_arb_h=yes
3480ac_cv_header_bzlib_h=yes
3481ac_cv_header_cliquer_cliquer_h=yes
3482ac_cv_header_complex_h=yes
3483ac_cv_header_ecm_h=yes
3484ac_cv_header_flint_flint_h=yes
3485ac_cv_header_gf2x_h=yes
3486ac_cv_header_glpk_h=yes
3487ac_cv_header_gmp_h=yes
3488ac_cv_header_gmpxx_h=yes
3489ac_cv_header_inttypes_h=yes
3490ac_cv_header_lrcalc_schublib_h=yes
3491ac_cv_header_lzma_h=yes
3492ac_cv_header_m4rie_m4rie_h=yes
3493ac_cv_header_memory_h=yes
3494ac_cv_header_mpc_h=yes
3495ac_cv_header_mpfi_h=yes
3496ac_cv_header_mpfr_h=yes
3497ac_cv_header_rw_h=yes
3498ac_cv_header_stdc=yes
3499ac_cv_header_stdint_h=yes
3500ac_cv_header_stdlib_h=yes
3501ac_cv_header_string_h=yes
3502ac_cv_header_strings_h=yes
3503ac_cv_header_symmetrica_def_h=yes
3504ac_cv_header_sys_stat_h=yes
3505ac_cv_header_sys_types_h=yes
3506ac_cv_header_unistd_h=yes
3507ac_cv_header_zlib_h=yes
3508ac_cv_header_zmq_h=yes
3509ac_cv_host=x86_64-pc-linux-gnu
3510ac_cv_lib_arb_acb_mat_eig_simple=yes
3511ac_cv_lib_lzma_lzma_raw_decoder=yes
3512ac_cv_lib_m_sqrt=yes
3513ac_cv_lib_z_inflateEnd=yes
3514ac_cv_objc_compiler_gnu=no
3515ac_cv_objcxx_compiler_gnu=no
3516ac_cv_objext=o
3517ac_cv_path_CL=/usr/bin/cl
3518ac_cv_path_CMAKE=/usr/bin/cmake
3519ac_cv_path_CURL=/usr/bin/curl
3520ac_cv_path_ECMBIN=/usr/bin/ecm
3521ac_cv_path_EGREP='/usr/bin/grep -E'
3522ac_cv_path_GENGCHECK=/usr/bin/geng
3523ac_cv_path_GFAN_VERSION=/usr/bin/gfan_version
3524ac_cv_path_GIT=/usr/bin/git
3525ac_cv_path_GIVAROCONFIG=/usr/local/bin/givaro-config
3526ac_cv_path_GLPSOL=/usr/bin/glpsol
3527ac_cv_path_GP=/usr/bin/gp
3528ac_cv_path_GREP=/usr/bin/grep
3529ac_cv_path_MAKE=/usr/bin/make
3530ac_cv_path_NINJA=/usr/bin/ninja
3531ac_cv_path_PATCH=/usr/bin/patch
3532ac_cv_path_PERL=/usr/bin/perl
3533ac_cv_path_PKGCONF=/usr/bin/pkg-config
3534ac_cv_path_R=/usr/bin/R
3535ac_cv_path_SED=/usr/bin/sed
3536ac_cv_path_TACHYON=/usr/bin/tachyon
3537ac_cv_path_TAR=/usr/bin/tar
3538ac_cv_path_XZ=/usr/bin/xz
3539ac_cv_path_YASM=/usr/bin/yasm
3540ac_cv_path__libcurl_config=/usr/bin/curl-config
3541ac_cv_path_ac_pt_PKG_CONFIG=/usr/bin/pkg-config
3542ac_cv_path_bzip2_prog=/usr/bin/bzip2
3543ac_cv_path_foodirectg=/usr/bin/directg
3544ac_cv_path_foogenbg=/usr/bin/genbg
3545ac_cv_path_foogeng=/usr/bin/geng
3546ac_cv_path_foogentourng=/usr/bin/gentourng
3547ac_cv_path_install='/usr/bin/install -c'
3548ac_cv_path_mkdir=/usr/bin/mkdir
3549ac_cv_prog_AWK=gawk
3550ac_cv_prog_CPP='gcc -E'
3551ac_cv_prog_CXXCPP='g++ -E'
3552ac_cv_prog_ac_ct_CC=gcc
3553ac_cv_prog_ac_ct_CXX=g++
3554ac_cv_prog_ac_ct_FC=gfortran
3555ac_cv_prog_ac_ct_OBJC=gcc
3556ac_cv_prog_ac_ct_OBJCXX=g++
3557ac_cv_prog_cc_c89=
3558ac_cv_prog_cc_c99=
3559ac_cv_prog_cc_g=yes
3560ac_cv_prog_cxx_g=yes
3561ac_cv_prog_fc_g=yes
3562ac_cv_prog_fc_v=-v
3563ac_cv_prog_found_ar=yes
3564ac_cv_prog_found_latex=yes
3565ac_cv_prog_found_m4=yes
3566ac_cv_prog_found_ranlib=yes
3567ac_cv_prog_found_strip=yes
3568ac_cv_prog_make_make_set=yes
3569ac_cv_prog_objc_g=no
3570ac_cv_prog_objcxx_g=no
3571ac_cv_search_BZ2_bzCompress=-lbz2
3572ac_cv_search___gmpq_cmp_z=-lgmp
3573ac_cv_search_calculate_level=-lrw
3574ac_cv_search_cblas_dgemm=no
3575ac_cv_search_clique_unweighted_max_weight=-lcliquer
3576ac_cv_search_dgeqrf_=no
3577ac_cv_search_ecm_factor=-lecm
3578ac_cv_search_fmpz_mat_is_hadamard=-lflint
3579ac_cv_search_fmpz_poly_get_ZZX='none required'
3580ac_cv_search_gf2e_init=-lm4rie
3581ac_cv_search_gf2x_mul_r=-lgf2x
3582ac_cv_search_glp_config=-lglpk
3583ac_cv_search_mpc_cmp_abs=-lmpc
3584ac_cv_search_mpfi_diam_abs=-lmpfi
3585ac_cv_search_mpfr_free_pool=-lmpfr
3586ac_cv_search_mult_poly_schubert=-llrcalc
3587ac_cv_search_zykelind_tetraeder_edges_extended=-lsymmetrica
3588acl_cv_hardcode_direct=no
3589acl_cv_hardcode_libdir_flag_spec='${wl}-rpath ${wl}$libdir'
3590acl_cv_hardcode_libdir_separator=
3591acl_cv_hardcode_minus_L=no
3592acl_cv_libdirstems=lib,lib
3593acl_cv_libext=a
3594acl_cv_libname_spec='lib$name'
3595acl_cv_library_names_spec='$libname$shrext'
3596acl_cv_path_LD=/usr/bin/ld
3597acl_cv_prog_gnu_ld=yes
3598acl_cv_rpath=done
3599acl_cv_shlibext=so
3600acl_cv_wl=-Wl,
3601am_cv_CC_dependencies_compiler_type=none
3602am_cv_CXX_dependencies_compiler_type=none
3603am_cv_OBJCXX_dependencies_compiler_type=none
3604am_cv_OBJC_dependencies_compiler_type=none
3605am_cv_func_iconv=yes
3606am_cv_func_iconv_works=yes
3607am_cv_lib_iconv=no
3608am_cv_make_support_nested_variables=yes
3609am_cv_prog_cc_c_o=yes
3610am_cv_proto_iconv='extern size_t iconv (iconv_t cd, char * *inbuf, size_t *inbytesleft, char * *outbuf, size_t *outbytesleft);'
3611am_cv_proto_iconv_arg1=
3612ax_cv_cxx_compile_cxx11__std_gnupp11=yes
3613ax_cv_cxx_compiler_vendor=gnu
3614ax_cv_gcc_version=9.2.0
3615ax_cv_gxx_version=9.2.0
3616ax_cv_prog_perl_version=yes
3617gl_cv_absolute_ecm_h=///usr/include/ecm.h
3618gl_cv_absolute_gmp_h=///usr/include/gmp.h
3619gl_cv_host_cpu_c_abi_32bit=no
3620libcurl_cv_lib_curl_usable=yes
3621libcurl_cv_lib_curl_version=7.68.0
3622libcurl_cv_lib_version_ok=yes
3623lzma_cv_liblzma=yes
3624lzma_cv_lzma_h=yes
3625pkg_cv_CBC_CFLAGS='-I/usr/include/coin '
3626pkg_cv_CBC_LIBS='-lCbcSolver -lCbc -lpthread -lrt -lCgl -lOsiClp -lClpSolver -lClp -lcholmod -lOsi -lCoinUtils -lbz2 -lz -lglpk -llapack -lblas -lm '
3627pkg_cv_CBLAS_CFLAGS=
3628pkg_cv_CBLAS_LIBS='-lcblas '
3629pkg_cv_FREETYPE_CFLAGS='-I/usr/include/freetype2 -I/usr/include/libpng16 -I/usr/include/harfbuzz -I/usr/include/glib-2.0 -I/usr/lib/glib-2.0/include '
3630pkg_cv_FREETYPE_LIBS='-lfreetype '
3631pkg_cv_GSLPCDIR=/usr/lib/pkgconfig
3632pkg_cv_GSL_CFLAGS=
3633pkg_cv_GSL_LIBS='-lgsl -lgslcblas -lm '
3634pkg_cv_ISL_CFLAGS=
3635pkg_cv_ISL_LIBS='-lisl -lgmp '
3636pkg_cv_LAPACK_CFLAGS=
3637pkg_cv_LAPACK_LIBS='-llapack '
3638pkg_cv_LIBATOMIC_OPS_CFLAGS=
3639pkg_cv_LIBATOMIC_OPS_LIBS='-latomic_ops '
3640pkg_cv_LIBFFI_CFLAGS='-I/usr/lib/libffi-3.2.1/include '
3641pkg_cv_LIBFFI_LIBS='-L/usr/lib/../lib -lffi '
3642pkg_cv_LIBGD_CFLAGS=
3643pkg_cv_LIBGD_LIBS='-lgd '
3644pkg_cv_LIBPNG_CFLAGS='-I/usr/include/libpng16 '
3645pkg_cv_LIBPNG_LIBS='-lpng16 -lz '
3646pkg_cv_M4RI_CFLAGS='-mmmx -msse -msse2 -msse3 -I/usr/include/libpng16 '
3647pkg_cv_M4RI_LIBS='-lm4ri -lm -lpng16 -lz '
3648pkg_cv_NCURSES_CFLAGS='-D_GNU_SOURCE -D_DEFAULT_SOURCE '
3649pkg_cv_NCURSES_LIBS='-lncursesw '
3650pkg_cv_OPENBLASPCDIR=/usr/lib/pkgconfig
3651pkg_cv_OPENBLAS_CFLAGS=
3652pkg_cv_OPENBLAS_LIBS='-lopenblas '
3653pkg_cv_PCRE_CFLAGS=
3654pkg_cv_PCRE_LIBS='-lpcreposix -lpcre -lpcrecpp '
3655pkg_cv_READLINE_CFLAGS='-I/usr/include/readline -D_GNU_SOURCE -D_DEFAULT_SOURCE '
3656pkg_cv_READLINE_LIBS='-lreadline '
3657pkg_cv_R_CFLAGS='-I/usr/include/R/ '
3658pkg_cv_R_LIBS='-Wl,--export-dynamic -fopenmp -Wl,-O1,--sort-common,--as-needed,-z,relro,-z,now -L/usr/lib/R/lib -lR '
3659sage_libcurl_cv_lib_curl_executable=yes
3660zlib_cv_libz=yes
3661zlib_cv_zlib_h=yes
3662
3663## ----------------- ##
3664## Output variables. ##
3665## ----------------- ##
3666
3667    $(SAGE_EXTCODE)/doctest/invalid/syntax_error.tachyon \
3668    $(SAGE_EXTCODE)/doctest/rich_output/example.avi \
3669    $(SAGE_EXTCODE)/doctest/rich_output/example.canvas3d \
3670    $(SAGE_EXTCODE)/doctest/rich_output/example.dvi \
3671    $(SAGE_EXTCODE)/doctest/rich_output/example.flv \
3672    $(SAGE_EXTCODE)/doctest/rich_output/example.gif \
3673    $(SAGE_EXTCODE)/doctest/rich_output/example.jpg \
3674    $(SAGE_EXTCODE)/doctest/rich_output/example.mkv \
3675    $(SAGE_EXTCODE)/doctest/rich_output/example.mov \
3676    $(SAGE_EXTCODE)/doctest/rich_output/example.mp4 \
3677    $(SAGE_EXTCODE)/doctest/rich_output/example.ogv \
3678    $(SAGE_EXTCODE)/doctest/rich_output/example.pdf \
3679    $(SAGE_EXTCODE)/doctest/rich_output/example.png \
3680    $(SAGE_EXTCODE)/doctest/rich_output/example.svg \
3681    $(SAGE_EXTCODE)/doctest/rich_output/example.webm \
3682    $(SAGE_EXTCODE)/doctest/rich_output/example.wmv \
3683    $(SAGE_EXTCODE)/doctest/rich_output/example_jmol.spt.zip \
3684    $(SAGE_EXTCODE)/doctest/rich_output/example_wavefront/scene.mtl \
3685    $(SAGE_EXTCODE)/doctest/rich_output/example_wavefront/scene.obj \
3686    $(SAGE_EXTCODE)/gap/console.g \
3687    $(SAGE_EXTCODE)/gap/joyner/hurwitz_crv_rr_sp.gap \
3688    $(SAGE_EXTCODE)/gap/joyner/modular_crv_rr_sp.gap \
3689    $(SAGE_EXTCODE)/gap/sage.g \
3690    $(SAGE_EXTCODE)/graphs/graph_plot_js.html \
3691    $(SAGE_EXTCODE)/images/corner.png \
3692    $(SAGE_EXTCODE)/images/evaluate.png \
3693    $(SAGE_EXTCODE)/images/evaluate_over.png \
3694    $(SAGE_EXTCODE)/images/favicon.ico \
3695    $(SAGE_EXTCODE)/images/sagelogo.png \
3696    $(SAGE_EXTCODE)/kenzo/CP2.txt \
3697    $(SAGE_EXTCODE)/kenzo/CP3.txt \
3698    $(SAGE_EXTCODE)/kenzo/CP4.txt \
3699    $(SAGE_EXTCODE)/kenzo/README.txt \
3700    $(SAGE_EXTCODE)/kenzo/S4.txt \
3701    $(SAGE_EXTCODE)/magma/latex/latex.m \
3702    $(SAGE_EXTCODE)/magma/latex/latex.spec \
3703    $(SAGE_EXTCODE)/magma/sage/basic.m \
3704    $(SAGE_EXTCODE)/magma/sage/sage.spec \
3705    $(SAGE_EXTCODE)/magma/spec \
3706    $(SAGE_EXTCODE)/mwrank/PRIMES \
3707    $(SAGE_EXTCODE)/nbconvert/postprocess.py \
3708    $(SAGE_EXTCODE)/nbconvert/rst_sage.tpl \
3709    $(SAGE_EXTCODE)/notebook-ipython/logo-64x64.png \
3710    $(SAGE_EXTCODE)/notebook-ipython/logo.svg \
3711    $(SAGE_EXTCODE)/pari/buzzard/DimensionSk.g \
3712    $(SAGE_EXTCODE)/pari/buzzard/Tpprog.g \
3713    $(SAGE_EXTCODE)/pari/buzzard/genusn.g \
3714    $(SAGE_EXTCODE)/pari/dokchitser/computel.gp \
3715    $(SAGE_EXTCODE)/pari/dokchitser/computel.gp.template \
3716    $(SAGE_EXTCODE)/pari/dokchitser/ex-bsw \
3717    $(SAGE_EXTCODE)/pari/dokchitser/ex-chgen \
3718    $(SAGE_EXTCODE)/pari/dokchitser/ex-chqua \
3719    $(SAGE_EXTCODE)/pari/dokchitser/ex-delta \
3720    $(SAGE_EXTCODE)/pari/dokchitser/ex-eisen \
3721    $(SAGE_EXTCODE)/pari/dokchitser/ex-gen2 \
3722    $(SAGE_EXTCODE)/pari/dokchitser/ex-gen3 \
3723    $(SAGE_EXTCODE)/pari/dokchitser/ex-gen4 \
3724    $(SAGE_EXTCODE)/pari/dokchitser/ex-nf \
3725    $(SAGE_EXTCODE)/pari/dokchitser/ex-shin \
3726    $(SAGE_EXTCODE)/pari/dokchitser/ex-tau2 \
3727    $(SAGE_EXTCODE)/pari/dokchitser/ex-zeta \
3728    $(SAGE_EXTCODE)/pari/dokchitser/ex-zeta2 \
3729    $(SAGE_EXTCODE)/pari/dokchitser/testall \
3730    $(SAGE_EXTCODE)/pari/simon/ell.gp \
3731    $(SAGE_EXTCODE)/pari/simon/ellQ.gp \
3732    $(SAGE_EXTCODE)/pari/simon/ellcommon.gp \
3733    $(SAGE_EXTCODE)/pari/simon/qfsolve.gp \
3734    $(SAGE_EXTCODE)/pari/simon/resultant3.gp \
3735    $(SAGE_EXTCODE)/singular/function_field/core.lib \
3736    $(SAGE_EXTCODE)/threejs/threejs_template.html \
3737    $(SAGE_EXTCODE)/valgrind/pyalloc.supp \
3738    $(SAGE_EXTCODE)/valgrind/sage-additional.supp \
3739    $(SAGE_EXTCODE)/valgrind/sage.supp \
3740    $(SAGE_LOCAL)/bin/math-readline \
3741    $(SAGE_LOCAL)/bin/sage \
3742    $(SAGE_LOCAL)/bin/sage-README-osx.txt \
3743    $(SAGE_LOCAL)/bin/sage-cachegrind \
3744    $(SAGE_LOCAL)/bin/sage-callgrind \
3745    $(SAGE_LOCAL)/bin/sage-cleaner \
3746    $(SAGE_LOCAL)/bin/sage-clone-source \
3747    $(SAGE_LOCAL)/bin/sage-coverage \
3748    $(SAGE_LOCAL)/bin/sage-coverageall \
3749    $(SAGE_LOCAL)/bin/sage-cython \
3750    $(SAGE_LOCAL)/bin/sage-download-upstream \
3751    $(SAGE_LOCAL)/bin/sage-env \
3752    $(SAGE_LOCAL)/bin/sage-env-config \
3753    $(SAGE_LOCAL)/bin/sage-eval \
3754    $(SAGE_LOCAL)/bin/sage-fix-pkg-checksums \
3755    $(SAGE_LOCAL)/bin/sage-fixdoctests \
3756    $(SAGE_LOCAL)/bin/sage-gdb-commands \
3757    $(SAGE_LOCAL)/bin/sage-grep \
3758    $(SAGE_LOCAL)/bin/sage-grepdoc \
3759    $(SAGE_LOCAL)/bin/sage-inline-fortran \
3760    $(SAGE_LOCAL)/bin/sage-ipynb2rst \
3761    $(SAGE_LOCAL)/bin/sage-ipython \
3762    $(SAGE_LOCAL)/bin/sage-list-experimental \
3763    $(SAGE_LOCAL)/bin/sage-list-optional \
3764    $(SAGE_LOCAL)/bin/sage-list-packages \
3765    $(SAGE_LOCAL)/bin/sage-list-standard \
3766    $(SAGE_LOCAL)/bin/sage-location \
3767    $(SAGE_LOCAL)/bin/sage-massif \
3768    $(SAGE_LOCAL)/bin/sage-maxima.lisp \
3769    $(SAGE_LOCAL)/bin/sage-native-execute \
3770    $(SAGE_LOCAL)/bin/sage-notebook \
3771    $(SAGE_LOCAL)/bin/sage-num-threads.py \
3772    $(SAGE_LOCAL)/bin/sage-omega \
3773    $(SAGE_LOCAL)/bin/sage-open \
3774    $(SAGE_LOCAL)/bin/sage-pkg \
3775    $(SAGE_LOCAL)/bin/sage-preparse \
3776    $(SAGE_LOCAL)/bin/sage-pypkg-location \
3777    $(SAGE_LOCAL)/bin/sage-python \
3778    $(SAGE_LOCAL)/bin/sage-rebase.bat \
3779    $(SAGE_LOCAL)/bin/sage-rebase.sh \
3780    $(SAGE_LOCAL)/bin/sage-rebaseall.bat \
3781    $(SAGE_LOCAL)/bin/sage-rebaseall.sh \
3782    $(SAGE_LOCAL)/bin/sage-rst2sws \
3783    $(SAGE_LOCAL)/bin/sage-rst2txt \
3784    $(SAGE_LOCAL)/bin/sage-rsyncdist \
3785    $(SAGE_LOCAL)/bin/sage-run \
3786    $(SAGE_LOCAL)/bin/sage-run-cython \
3787    $(SAGE_LOCAL)/bin/sage-runtests \
3788    $(SAGE_LOCAL)/bin/sage-sdist \
3789    $(SAGE_LOCAL)/bin/sage-starts \
3790    $(SAGE_LOCAL)/bin/sage-startuptime.py \
3791    $(SAGE_LOCAL)/bin/sage-sws2rst \
3792    $(SAGE_LOCAL)/bin/sage-unzip \
3793    $(SAGE_LOCAL)/bin/sage-update-src \
3794    $(SAGE_LOCAL)/bin/sage-update-version \
3795    $(SAGE_LOCAL)/bin/sage-upgrade \
3796    $(SAGE_LOCAL)/bin/sage-valgrind \
3797    $(SAGE_LOCAL)/bin/sage-version.sh \
3798    $(SAGE_LOCAL)/bin/testcc.sh \
3799    $(SAGE_LOCAL)/bin/testcflags.sh \
3800    $(SAGE_LOCAL)/bin/testcxx.sh \
3801    4ti2 \
3802    4ti2 \
3803    alabaster \
3804    alabaster \
3805    alabaster \
3806    alabaster \
3807    appnope \
3808    appnope \
3809    appnope \
3810    appnope \
3811    arb \
3812    arb \
3813    arb \
3814    arb \
3815    atlas \
3816    atlas \
3817    autotools \
3818    autotools \
3819    awali \
3820    awali \
3821    babel \
3822    babel \
3823    babel \
3824    babel \
3825    backports_abc \
3826    backports_abc \
3827    backports_abc \
3828    backports_abc \
3829    backports_functools_lru_cache \
3830    backports_functools_lru_cache \
3831    backports_functools_lru_cache \
3832    backports_functools_lru_cache \
3833    backports_shutil_get_terminal_size \
3834    backports_shutil_get_terminal_size \
3835    backports_shutil_get_terminal_size \
3836    backports_shutil_get_terminal_size \
3837    backports_ssl_match_hostname \
3838    backports_ssl_match_hostname \
3839    backports_ssl_match_hostname \
3840    backports_ssl_match_hostname \
3841    barvinok \
3842    barvinok \
3843    beautifulsoup4 \
3844    benzene \
3845    benzene \
3846    biopython \
3847    bleach \
3848    bleach \
3849    bleach \
3850    bleach \
3851    bliss \
3852    bliss \
3853    boost \
3854    boost \
3855    boost_cropped \
3856    boost_cropped \
3857    boost_cropped \
3858    boost_cropped \
3859    brial \
3860    brial \
3861    brial \
3862    brial \
3863    buckygen \
3864    buckygen \
3865    bzip2 \
3866    bzip2 \
3867    bzip2 \
3868    bzip2 \
3869    cbc \
3870    cbc \
3871    ccache \
3872    ccache \
3873    cddlib \
3874    cddlib \
3875    cddlib \
3876    cddlib \
3877    certifi \
3878    certifi \
3879    certifi \
3880    certifi \
3881    cliquer \
3882    cliquer \
3883    cliquer \
3884    cliquer \
3885    cmake \
3886    cmake \
3887    cocoalib \
3888    cocoalib \
3889    combinatorial_designs \
3890    combinatorial_designs \
3891    combinatorial_designs \
3892    combinatorial_designs \
3893    compilerwrapper \
3894    compilerwrapper \
3895    configparser \
3896    configparser \
3897    configparser \
3898    configparser \
3899    configure \
3900    configure \
3901    conway_polynomials \
3902    conway_polynomials \
3903    conway_polynomials \
3904    conway_polynomials \
3905    coxeter3 \
3906    coxeter3 \
3907    cryptominisat \
3908    cryptominisat \
3909    csdp \
3910    csdp \
3911    curl \
3912    curl \
3913    curl \
3914    curl \
3915    cvxopt \
3916    cvxopt \
3917    cvxopt \
3918    cvxopt \
3919    cycler \
3920    cycler \
3921    cycler \
3922    cycler \
3923    cypari \
3924    cypari \
3925    cypari \
3926    cypari \
3927    cysignals \
3928    cysignals \
3929    cysignals \
3930    cysignals \
3931    cython \
3932    cython \
3933    cython \
3934    cython \
3935    d3js \
3936    d3js \
3937    database_cremona_ellcurve \
3938    database_cremona_ellcurve \
3939    database_jones_numfield \
3940    database_jones_numfield \
3941    database_kohel \
3942    database_kohel \
3943    database_mutation_class \
3944    database_mutation_class \
3945    database_odlyzko_zeta \
3946    database_odlyzko_zeta \
3947    database_stein_watkins \
3948    database_stein_watkins \
3949    database_stein_watkins_mini \
3950    database_stein_watkins_mini \
3951    database_symbolic_data \
3952    database_symbolic_data \
3953    dateutil \
3954    dateutil \
3955    dateutil \
3956    dateutil \
3957    decorator \
3958    decorator \
3959    decorator \
3960    decorator \
3961    deformation \
3962    deformation \
3963    defusedxml \
3964    defusedxml \
3965    defusedxml \
3966    defusedxml \
3967    docutils \
3968    docutils \
3969    docutils \
3970    docutils \
3971    dot2tex \
3972    dot2tex \
3973    e_antic \
3974    e_antic \
3975    ecl \
3976    ecl \
3977    ecl \
3978    ecl \
3979    eclib \
3980    eclib \
3981    eclib \
3982    eclib \
3983    ecm \
3984    ecm \
3985    ecm \
3986    ecm \
3987    elliptic_curves \
3988    elliptic_curves \
3989    elliptic_curves \
3990    elliptic_curves \
3991    entrypoints \
3992    entrypoints \
3993    entrypoints \
3994    entrypoints \
3995    enum34 \
3996    enum34 \
3997    enum34 \
3998    enum34 \
3999    fflas_ffpack \
4000    fflas_ffpack \
4001    fflas_ffpack \
4002    fflas_ffpack \
4003    flask \
4004    flask \
4005    flask \
4006    flask \
4007    flask_autoindex \
4008    flask_autoindex \
4009    flask_autoindex \
4010    flask_autoindex \
4011    flask_babel \
4012    flask_babel \
4013    flask_babel \
4014    flask_babel \
4015    flask_oldsessions \
4016    flask_oldsessions \
4017    flask_oldsessions \
4018    flask_oldsessions \
4019    flask_openid \
4020    flask_openid \
4021    flask_openid \
4022    flask_openid \
4023    flask_silk \
4024    flask_silk \
4025    flask_silk \
4026    flask_silk \
4027    flint \
4028    flint \
4029    flint \
4030    flint \
4031    flintqs \
4032    flintqs \
4033    flintqs \
4034    flintqs \
4035    fplll \
4036    fplll \
4037    fplll \
4038    fplll \
4039    fpylll \
4040    fpylll \
4041    fpylll \
4042    fpylll \
4043    freetype \
4044    freetype \
4045    freetype \
4046    freetype \
4047    fricas \
4048    fricas \
4049    frobby \
4050    frobby \
4051    functools32 \
4052    functools32 \
4053    functools32 \
4054    functools32 \
4055    future \
4056    future \
4057    future \
4058    future \
4059    gambit \
4060    gambit \
4061    gap \
4062    gap \
4063    gap \
4064    gap \
4065    gap3 \
4066    gap3 \
4067    gap_jupyter \
4068    gap_jupyter \
4069    gap_packages \
4070    gap_packages \
4071    gc \
4072    gc \
4073    gc \
4074    gc \
4075    gcc \
4076    gcc \
4077    gcc \
4078    gcc \
4079    gdb \
4080    gdb \
4081    gf2x \
4082    gf2x \
4083    gf2x \
4084    gf2x \
4085    gfan \
4086    gfan \
4087    gfan \
4088    gfan \
4089    gfortran \
4090    gfortran \
4091    giac \
4092    giac \
4093    giac \
4094    giac \
4095    giacpy_sage \
4096    giacpy_sage \
4097    git \
4098    git \
4099    git \
4100    git \
4101    git_trac \
4102    git_trac \
4103    givaro \
4104    givaro \
4105    givaro \
4106    givaro \
4107    glpk \
4108    glpk \
4109    glpk \
4110    glpk \
4111    glucose \
4112    glucose \
4113    gmp \
4114    gmp \
4115    gmpy2 \
4116    gmpy2 \
4117    gmpy2 \
4118    gmpy2 \
4119    gp2c \
4120    gp2c \
4121    graphs \
4122    graphs \
4123    graphs \
4124    graphs \
4125    gsl \
4126    gsl \
4127    gsl \
4128    gsl \
4129    html5lib \
4130    html5lib \
4131    html5lib \
4132    html5lib \
4133    iconv \
4134    iconv \
4135    iconv \
4136    iconv \
4137    igraph \
4138    igraph \
4139    imagesize \
4140    imagesize \
4141    imagesize \
4142    imagesize \
4143    iml \
4144    iml \
4145    iml \
4146    iml \
4147    ipaddress \
4148    ipaddress \
4149    ipaddress \
4150    ipaddress \
4151    ipykernel \
4152    ipykernel \
4153    ipykernel \
4154    ipykernel \
4155    ipython \
4156    ipython \
4157    ipython \
4158    ipython \
4159    ipython_genutils \
4160    ipython_genutils \
4161    ipython_genutils \
4162    ipython_genutils \
4163    ipywidgets \
4164    ipywidgets \
4165    ipywidgets \
4166    ipywidgets \
4167    isl \
4168    isl \
4169    itsdangerous \
4170    itsdangerous \
4171    itsdangerous \
4172    itsdangerous \
4173    jinja2 \
4174    jinja2 \
4175    jinja2 \
4176    jinja2 \
4177    jmol \
4178    jmol \
4179    jmol \
4180    jmol \
4181    jsonschema \
4182    jsonschema \
4183    jsonschema \
4184    jsonschema \
4185    jupymake \
4186    jupymake \
4187    jupyter_client \
4188    jupyter_client \
4189    jupyter_client \
4190    jupyter_client \
4191    jupyter_core \
4192    jupyter_core \
4193    jupyter_core \
4194    jupyter_core \
4195    kenzo \
4196    kenzo \
4197    kiwisolver \
4198    kiwisolver \
4199    kiwisolver \
4200    kiwisolver \
4201    latte_int \
4202    latte_int \
4203    lcalc \
4204    lcalc \
4205    lcalc \
4206    lcalc \
4207    libatomic_ops \
4208    libatomic_ops \
4209    libatomic_ops \
4210    libatomic_ops \
4211    libbraiding \
4212    libbraiding \
4213    libbraiding \
4214    libbraiding \
4215    libffi \
4216    libffi \
4217    libffi \
4218    libffi \
4219    libgd \
4220    libgd \
4221    libgd \
4222    libgd \
4223    libhomfly \
4224    libhomfly \
4225    libhomfly \
4226    libhomfly \
4227    libogg \
4228    libogg \
4229    libpng \
4230    libpng \
4231    libpng \
4232    libpng \
4233    libsemigroups \
4234    libsemigroups \
4235    libtheora \
4236    libtheora \
4237    lidia \
4238    lidia \
4239    lie \
4240    lie \
4241    linbox \
4242    linbox \
4243    linbox \
4244    linbox \
4245    lrcalc \
4246    lrcalc \
4247    lrcalc \
4248    lrcalc \
4249    lrslib \
4250    lrslib \
4251    m4ri \
4252    m4ri \
4253    m4ri \
4254    m4ri \
4255    m4rie \
4256    m4rie \
4257    m4rie \
4258    m4rie \
4259    markupsafe \
4260    markupsafe \
4261    markupsafe \
4262    markupsafe \
4263    mathjax \
4264    mathjax \
4265    mathjax \
4266    mathjax \
4267    matplotlib \
4268    matplotlib \
4269    matplotlib \
4270    matplotlib \
4271    maxima \
4272    maxima \
4273    maxima \
4274    maxima \
4275    mcqd \
4276    mcqd \
4277    meataxe \
4278    meataxe \
4279    mistune \
4280    mistune \
4281    mistune \
4282    mistune \
4283    modular_decomposition \
4284    modular_decomposition \
4285    mpc \
4286    mpc \
4287    mpc \
4288    mpc \
4289    mpfi \
4290    mpfi \
4291    mpfi \
4292    mpfi \
4293    mpfr \
4294    mpfr \
4295    mpfr \
4296    mpfr \
4297    mpfrcx \
4298    mpfrcx \
4299    mpir \
4300    mpir \
4301    mpir \
4302    mpmath \
4303    mpmath \
4304    mpmath \
4305    mpmath \
4306    nauty \
4307    nauty \
4308    nauty \
4309    nauty \
4310    nbconvert \
4311    nbconvert \
4312    nbconvert \
4313    nbconvert \
4314    nbformat \
4315    nbformat \
4316    nbformat \
4317    nbformat \
4318    ncurses \
4319    ncurses \
4320    ncurses \
4321    ncurses \
4322    networkx \
4323    networkx \
4324    networkx \
4325    networkx \
4326    nibabel \
4327    ninja_build \
4328    ninja_build \
4329    normaliz \
4330    normaliz \
4331    nose \
4332    nose \
4333    nose \
4334    nose \
4335    notebook \
4336    notebook \
4337    notebook \
4338    notebook \
4339    notedown \
4340    notedown \
4341    ntl \
4342    ntl \
4343    ntl \
4344    ntl \
4345    numpy \
4346    numpy \
4347    numpy \
4348    numpy \
4349    openblas \
4350    openblas \
4351    openblas \
4352    openblas \
4353    openssl \
4354    openssl \
4355    p_group_cohomology \
4356    p_group_cohomology \
4357    packaging \
4358    packaging \
4359    packaging \
4360    packaging \
4361    palp \
4362    palp \
4363    palp \
4364    palp \
4365    pandoc_attributes \
4366    pandoc_attributes \
4367    pandocfilters \
4368    pandocfilters \
4369    pandocfilters \
4370    pandocfilters \
4371    pari \
4372    pari \
4373    pari \
4374    pari \
4375    pari_elldata \
4376    pari_elldata \
4377    pari_galdata \
4378    pari_galdata \
4379    pari_galdata \
4380    pari_galdata \
4381    pari_galpol \
4382    pari_galpol \
4383    pari_jupyter \
4384    pari_jupyter \
4385    pari_nftables \
4386    pari_nftables \
4387    pari_seadata \
4388    pari_seadata \
4389    pari_seadata_small \
4390    pari_seadata_small \
4391    pari_seadata_small \
4392    pari_seadata_small \
4393    patch \
4394    patch \
4395    patch \
4396    patch \
4397    pathlib2 \
4398    pathlib2 \
4399    pathlib2 \
4400    pathlib2 \
4401    pathpy \
4402    pathpy \
4403    pathpy \
4404    pathpy \
4405    pcre \
4406    pcre \
4407    pcre \
4408    pcre \
4409    perl_term_readline_gnu \
4410    perl_term_readline_gnu \
4411    pexpect \
4412    pexpect \
4413    pexpect \
4414    pexpect \
4415    pickleshare \
4416    pickleshare \
4417    pickleshare \
4418    pickleshare \
4419    pillow \
4420    pillow \
4421    pillow \
4422    pillow \
4423    pip \
4424    pip \
4425    pip \
4426    pip \
4427    pkgconf \
4428    pkgconf \
4429    pkgconf \
4430    pkgconf \
4431    pkgconfig \
4432    pkgconfig \
4433    pkgconfig \
4434    pkgconfig \
4435    planarity \
4436    planarity \
4437    planarity \
4438    planarity \
4439    plantri \
4440    plantri \
4441    polylib \
4442    polylib \
4443    polymake \
4444    polymake \
4445    polytopes_db \
4446    polytopes_db \
4447    polytopes_db \
4448    polytopes_db \
4449    ppl \
4450    ppl \
4451    ppl \
4452    ppl \
4453    pplpy \
4454    pplpy \
4455    pplpy \
4456    pplpy \
4457    primecount \
4458    primecount \
4459    prometheus_client \
4460    prometheus_client \
4461    prometheus_client \
4462    prometheus_client \
4463    prompt_toolkit \
4464    prompt_toolkit \
4465    prompt_toolkit \
4466    prompt_toolkit \
4467    psutil \
4468    psutil \
4469    psutil \
4470    psutil \
4471    ptyprocess \
4472    ptyprocess \
4473    ptyprocess \
4474    ptyprocess \
4475    pybtex \
4476    pycosat \
4477    pycosat \
4478    pycygwin \
4479    pycygwin \
4480    pycygwin \
4481    pycygwin \
4482    pyflakes \
4483    pygments \
4484    pygments \
4485    pygments \
4486    pygments \
4487    pynac \
4488    pynac \
4489    pynac \
4490    pynac \
4491    pynormaliz \
4492    pynormaliz \
4493    pyopenssl \
4494    pyparsing \
4495    pyparsing \
4496    pyparsing \
4497    pyparsing \
4498    pysingular \
4499    pysingular \
4500    python2 \
4501    python2 \
4502    python2 \
4503    python3 \
4504    python3 \
4505    python3 \
4506    python3 \
4507    python_igraph \
4508    python_igraph \
4509    python_openid \
4510    python_openid \
4511    python_openid \
4512    python_openid \
4513    pytz \
4514    pytz \
4515    pytz \
4516    pytz \
4517    pyx \
4518    pyzmq \
4519    pyzmq \
4520    pyzmq \
4521    pyzmq \
4522    qepcad \
4523    qepcad \
4524    qhull \
4525    qhull \
4526    r \
4527    r \
4528    r \
4529    r \
4530    r_jupyter \
4531    ratpoints \
4532    ratpoints \
4533    ratpoints \
4534    ratpoints \
4535    readline \
4536    readline \
4537    readline \
4538    readline \
4539    requests \
4540    requests \
4541    requests \
4542    requests \
4543    rpy2 \
4544    rpy2 \
4545    rpy2 \
4546    rpy2 \
4547    rst2ipynb \
4548    rst2ipynb \
4549    rubiks \
4550    rubiks \
4551    rubiks \
4552    rubiks \
4553    rw \
4554    rw \
4555    rw \
4556    rw \
4557    saclib \
4558    saclib \
4559    sage_numerical_backends_coin \
4560    sage_numerical_backends_coin \
4561    sage_numerical_backends_cplex \
4562    sage_numerical_backends_cplex \
4563    sage_numerical_backends_gurobi \
4564    sage_numerical_backends_gurobi \
4565    sagenb \
4566    sagenb \
4567    sagenb_export \
4568    sagenb_export \
4569    sagenb_export \
4570    sagenb_export \
4571    sagetex \
4572    sagetex \
4573    sagetex \
4574    sagetex \
4575    scandir \
4576    scandir \
4577    scandir \
4578    scandir \
4579    scipoptsuite \
4580    scipoptsuite \
4581    scipy \
4582    scipy \
4583    scipy \
4584    scipy \
4585    scons \
4586    scons \
4587    send2trash \
4588    send2trash \
4589    send2trash \
4590    send2trash \
4591    setuptools \
4592    setuptools \
4593    setuptools \
4594    setuptools \
4595    setuptools_scm \
4596    setuptools_scm \
4597    setuptools_scm \
4598    setuptools_scm \
4599    simplegeneric \
4600    simplegeneric \
4601    simplegeneric \
4602    simplegeneric \
4603    singledispatch \
4604    singledispatch \
4605    singledispatch \
4606    singledispatch \
4607    singular \
4608    singular \
4609    singular \
4610    singular \
4611    singular_jupyter \
4612    singular_jupyter \
4613    sip \
4614    sip \
4615    sirocco \
4616    sirocco \
4617    six \
4618    six \
4619    six \
4620    six \
4621    snowballstemmer \
4622    snowballstemmer \
4623    snowballstemmer \
4624    snowballstemmer \
4625    speaklater \
4626    speaklater \
4627    speaklater \
4628    speaklater \
4629    sphinx \
4630    sphinx \
4631    sphinx \
4632    sphinx \
4633    sphinxcontrib_websupport \
4634    sphinxcontrib_websupport \
4635    sphinxcontrib_websupport \
4636    sphinxcontrib_websupport \
4637    sqlalchemy \
4638    sqlite \
4639    sqlite \
4640    sqlite \
4641    sqlite \
4642    subprocess32 \
4643    subprocess32 \
4644    subprocess32 \
4645    subprocess32 \
4646    suitesparse \
4647    suitesparse \
4648    suitesparse \
4649    suitesparse \
4650    surf \
4651    surf \
4652    symmetrica \
4653    symmetrica \
4654    symmetrica \
4655    symmetrica \
4656    sympow \
4657    sympow \
4658    sympow \
4659    sympow \
4660    sympy \
4661    sympy \
4662    sympy \
4663    sympy \
4664    tachyon \
4665    tachyon \
4666    tachyon \
4667    tachyon \
4668    tdlib \
4669    tdlib \
4670    termcap \
4671    termcap \
4672    terminado \
4673    terminado \
4674    terminado \
4675    terminado \
4676    testpath \
4677    testpath \
4678    testpath \
4679    testpath \
4680    texlive \
4681    thebe \
4682    thebe \
4683    thebe \
4684    thebe \
4685    threejs \
4686    threejs \
4687    threejs \
4688    threejs \
4689    tides \
4690    tides \
4691    topcom \
4692    topcom \
4693    tornado \
4694    tornado \
4695    tornado \
4696    tornado \
4697    traitlets \
4698    traitlets \
4699    traitlets \
4700    traitlets \
4701    twisted \
4702    twisted \
4703    twisted \
4704    twisted \
4705    typing \
4706    typing \
4707    typing \
4708    typing \
4709    valgrind \
4710    valgrind \
4711    vcversioner \
4712    vcversioner \
4713    vcversioner \
4714    vcversioner \
4715    wcwidth \
4716    wcwidth \
4717    wcwidth \
4718    wcwidth \
4719    webencodings \
4720    webencodings \
4721    webencodings \
4722    webencodings \
4723    werkzeug \
4724    werkzeug \
4725    werkzeug \
4726    werkzeug \
4727    widgetsnbextension \
4728    widgetsnbextension \
4729    widgetsnbextension \
4730    widgetsnbextension \
4731    xz \
4732    xz \
4733    xz \
4734    xz \
4735    yasm \
4736    yasm \
4737    yasm \
4738    yasm \
4739    zeromq \
4740    zeromq \
4741    zeromq \
4742    zeromq \
4743    zlib \
4744    zlib \
4745    zlib \
4746    zlib \
4747    zn_poly \
4748    zn_poly \
4749    zn_poly \
4750    zn_poly \
4751    zope_interface \
4752    zope_interface \
4753    zope_interface \
4754    zope_interface \
4755'
4756'
4757'
4758'
4759'
4760'
4761'
4762'
4763'
4764'
4765'
4766'
4767ACLOCAL='${SHELL} /opt/sage/config/missing aclocal-1.16'
4768AMDEPBACKSLASH='\'
4769AMDEP_FALSE='#'
4770AMDEP_TRUE=''
4771AMTAR='$${TAR-tar}'
4772AM_BACKSLASH='\'
4773AM_DEFAULT_V='$(AM_DEFAULT_VERBOSITY)'
4774AM_DEFAULT_VERBOSITY='1'
4775AM_V='$(V)'
4776AUTOCONF='${SHELL} /opt/sage/config/missing autoconf'
4777AUTOHEADER='${SHELL} /opt/sage/config/missing autoheader'
4778AUTOMAKE='${SHELL} /opt/sage/config/missing automake-1.16'
4779AWK='gawk'
4780CBC_CFLAGS='-I/usr/include/coin '
4781CBC_LIBS='-lCbcSolver -lCbc -lpthread -lrt -lCgl -lOsiClp -lClpSolver -lClp -lcholmod -lOsi -lCoinUtils -lbz2 -lz -lglpk -llapack -lblas -lm '
4782CBLAS_CFLAGS=''
4783CBLAS_LIBS='-lcblas '
4784CC='gcc'
4785CCDEPMODE='depmode=none'
4786CFLAGS='-g -O2'
4787CL='/usr/bin/cl'
4788CPP='gcc -E'
4789CPPFLAGS='  '
4790CXX='g++ -std=gnu++11'
4791CXXCPP='g++ -E -std=gnu++11'
4792CXXDEPMODE='depmode=none'
4793CXXFLAGS='-g -O2'
4794CYGPATH_W='echo'
4795DEFS='-DPACKAGE_NAME=\"Sage\" -DPACKAGE_TARNAME=\"sage\" -DPACKAGE_VERSION=\"9.1.beta1\" -DPACKAGE_STRING=\"Sage\ 9.1.beta1\" -DPACKAGE_BUGREPORT=\"sage-devel@googlegroups.com\" -DPACKAGE_URL=\"\" -DPACKAGE=\"sage\" -DVERSION=\"9.1.beta1\" -DSTDC_HEADERS=1 -DHAVE_SYS_TYPES_H=1 -DHAVE_SYS_STAT_H=1 -DHAVE_STDLIB_H=1 -DHAVE_STRING_H=1 -DHAVE_MEMORY_H=1 -DHAVE_STRINGS_H=1 -DHAVE_INTTYPES_H=1 -DHAVE_STDINT_H=1 -DHAVE_UNISTD_H=1 -DHAVE_LIBM=1 -DHAVE_CXX11=1 -DHAVE_LRCALC_SCHUBLIB_H=1 -DHAVE_ZMQ=/\*\*/ -DHAVE_GMP_H=1 -DABSOLUTE_GMP_H=\"///usr/include/gmp.h\" -DHAVE_LIBCURL=1 -DLIBCURL_FEATURE_SSL=1 -DLIBCURL_FEATURE_IPV6=1 -DLIBCURL_FEATURE_UNIXSOCKETS=1 -DLIBCURL_FEATURE_LIBZ=1 -DLIBCURL_FEATURE_ASYNCHDNS=1 -DLIBCURL_FEATURE_IDN=1 -DLIBCURL_FEATURE_GSS_API=1 -DLIBCURL_FEATURE_PSL=1 -DLIBCURL_FEATURE_SPNEGO=1 -DLIBCURL_FEATURE_KERBEROS=1 -DLIBCURL_FEATURE_NTLM=1 -DLIBCURL_FEATURE_NTLM_WB=1 -DLIBCURL_FEATURE_TLS_SRP=1 -DLIBCURL_FEATURE_HTTP2=1 -DLIBCURL_FEATURE_HTTPS_PROXY=1 -DLIBCURL_PROTOCOL_DICT=1 -DLIBCURL_PROTOCOL_FILE=1 -DLIBCURL_PROTOCOL_FTP=1 -DLIBCURL_PROTOCOL_FTPS=1 -DLIBCURL_PROTOCOL_GOPHER=1 -DLIBCURL_PROTOCOL_HTTP=1 -DLIBCURL_PROTOCOL_HTTPS=1 -DLIBCURL_PROTOCOL_IMAP=1 -DLIBCURL_PROTOCOL_IMAPS=1 -DLIBCURL_PROTOCOL_POP3=1 -DLIBCURL_PROTOCOL_POP3S=1 -DLIBCURL_PROTOCOL_RTSP=1 -DLIBCURL_PROTOCOL_SCP=1 -DLIBCURL_PROTOCOL_SFTP=1 -DLIBCURL_PROTOCOL_SMB=1 -DLIBCURL_PROTOCOL_SMBS=1 -DLIBCURL_PROTOCOL_SMTP=1 -DLIBCURL_PROTOCOL_SMTPS=1 -DLIBCURL_PROTOCOL_TELNET=1 -DLIBCURL_PROTOCOL_TFTP=1 -DHAVE_ICONV=1 -DICONV_CONST= -DHAVE_LIBARB=1 -DHAVE_ECM_H=1 -DABSOLUTE_ECM_H=\"///usr/include/ecm.h\"'
4796DEPDIR='.deps'
4797ECHO_C=''
4798ECHO_N='-n'
4799ECHO_T=''
4800ECMBIN='/usr/bin/ecm'
4801EGREP='/usr/bin/grep -E'
4802EXEEXT=''
4803FC='gfortran'
4804FCFLAGS='-g -O2 -ffree-form'
4805FCLIBS=' -L/usr/lib/gcc/x86_64-pc-linux-gnu/9.2.0 -L/usr/lib/gcc/x86_64-pc-linux-gnu/9.2.0/../../../../lib -L/lib/../lib -L/usr/lib/../lib -L/usr/lib/gcc/x86_64-pc-linux-gnu/9.2.0/../../.. -lmpfi -lmpfr -lglpk -lgmp -lsymmetrica -llrcalc -lgfortran -lm -lquadmath'
4806FREETYPE_CFLAGS='-I/usr/include/freetype2 -I/usr/include/libpng16 -I/usr/include/harfbuzz -I/usr/include/glib-2.0 -I/usr/lib/glib-2.0/include '
4807FREETYPE_LIBS='-lfreetype '
4808GCC_VERSION='9.2.0'
4809GENGCHECK='/usr/bin/geng'
4810GENGnautyCHECK=''
4811GIVAROCONFIG='/usr/local/bin/givaro-config'
4812GLPSOL='/usr/bin/glpsol'
4813GP2C=''
4814GP='/usr/bin/gp'
4815GREP='/usr/bin/grep'
4816GSLPCDIR='/usr/lib/pkgconfig'
4817GSL_CFLAGS=''
4818GSL_LIBS='-lgsl -lgslcblas -lm '
4819GXX_VERSION='9.2.0'
4820HAVE_CXX11='1'
4821INSTALL_DATA='${INSTALL} -m 644'
4822INSTALL_PROGRAM='${INSTALL}'
4823INSTALL_SCRIPT='${INSTALL}'
4824INSTALL_STRIP_PROGRAM='$(install_sh) -c -s'
4825ISL_CFLAGS=''
4826ISL_LIBS='-lisl -lgmp '
4827LAPACK_CFLAGS=''
4828LAPACK_LIBS='-llapack '
4829LCALC=''
4830LDFLAGS=''
4831LIBATOMIC_OPS_CFLAGS=''
4832LIBATOMIC_OPS_LIBS='-latomic_ops '
4833LIBCURL='-lcurl'
4834LIBCURL_CPPFLAGS=''
4835LIBFFI_CFLAGS='-I/usr/lib/libffi-3.2.1/include '
4836LIBFFI_LIBS='-L/usr/lib/../lib -lffi '
4837LIBGD_CFLAGS=''
4838LIBGD_LIBS='-lgd '
4839LIBICONV=''
4840LIBOBJS=''
4841LIBPNG_CFLAGS='-I/usr/include/libpng16 '
4842LIBPNG_LIBS='-lpng16 -lz '
4843LIBS='-lecm -larb -lm4rie -lrw -lmpc -lgf2x -lflint -lcurl -lcliquer -lbz2 -lmpfi -lmpfr -lglpk -lgmp -lsymmetrica -llrcalc -lm  -lntl'
4844LIBSEMIGROUPS_CFLAGS=''
4845LIBSEMIGROUPS_LIBS=''
4846LTLIBICONV=''
4847LTLIBOBJS=''
4848M4RI_CFLAGS='-mmmx -msse -msse2 -msse3 -I/usr/include/libpng16 '
4849M4RI_LIBS='-lm4ri -lm -lpng16 -lz '
4850MAINT=''
4851MAINTAINER_MODE_FALSE='#'
4852MAINTAINER_MODE_TRUE=''
4853MAKEINFO='${SHELL} /opt/sage/config/missing makeinfo'
4854MKDIR_P='/usr/bin/mkdir -p'
4855NCURSES_CFLAGS='-D_GNU_SOURCE -D_DEFAULT_SOURCE '
4856NCURSES_LIBS='-lncursesw '
4857OBJC='gcc'
4858OBJCDEPMODE='depmode=none'
4859OBJCFLAGS=''
4860OBJCXX='g++'
4861OBJCXXDEPMODE='depmode=none'
4862OBJCXXFLAGS=''
4863OBJEXT='o'
4864OPENBLASPCDIR='/usr/lib/pkgconfig'
4865OPENBLAS_CFLAGS=''
4866OPENBLAS_LIBS='-lopenblas '
4867PACKAGE='sage'
4868PACKAGE_BUGREPORT='sage-devel@googlegroups.com'
4869PACKAGE_NAME='Sage'
4870PACKAGE_STRING='Sage 9.1.beta1'
4871PACKAGE_TARNAME='sage'
4872PACKAGE_URL=''
4873PACKAGE_VERSION='9.1.beta1'
4874PATH_SEPARATOR=':'
4875PCRE_CFLAGS=''
4876PCRE_LIBS='-lpcreposix -lpcre -lpcrecpp '
4877PERL='/usr/bin/perl'
4878PKG_CONFIG='/usr/bin/pkg-config'
4879PKG_CONFIG_LIBDIR=''
4880PKG_CONFIG_PATH=''
4881R='/usr/bin/R'
4882READLINE_CFLAGS='-I/usr/include/readline -D_GNU_SOURCE -D_DEFAULT_SOURCE '
4883READLINE_LIBS='-lreadline '
4884R_CFLAGS='-I/usr/include/R/ '
4885R_LIBS='-Wl,--export-dynamic -fopenmp -Wl,-O1,--sort-common,--as-needed,-z,relro,-z,now -L/usr/lib/R/lib -lR '
4886SAGE_ARB_LIBRARY='arb'
4887SAGE_BLAS='openblas'
4888SAGE_BUILT_PACKAGES='\
4889SAGE_CRTI_DIR='/usr/lib/gcc/x86_64-pc-linux-gnu/9.2.0/../../../../lib'
4890SAGE_DUMMY_PACKAGES='\
4891SAGE_EXTCODE='\
4892SAGE_FLINT_PREFIX=''
4893SAGE_FREETYPE_PREFIX=''
4894SAGE_GCC_DEP=''
4895SAGE_GLPK_PREFIX=''
4896SAGE_GMP_INCLUDE='///usr/include'
4897SAGE_GMP_PREFIX=''
4898SAGE_MPC_PREFIX=''
4899SAGE_MPFR_PREFIX=''
4900SAGE_MP_LIBRARY='mpir'
4901SAGE_NAUTY_BINS_PREFIX=''
4902SAGE_NORMAL_PACKAGES='\
4903SAGE_NTL_PREFIX=''
4904SAGE_OPTIONAL_INSTALLED_PACKAGES='\
4905SAGE_PACKAGE_DEPENDENCIES='deps_4ti2 = zlib $(MP_LIBRARY) glpk
4906SAGE_PACKAGE_VERSIONS='vers_4ti2 = 1.6.7.p0
4907SAGE_PARI_CFG='$SAGE_LOCAL/lib/pari/pari.cfg'
4908SAGE_PARI_PREFIX='$SAGE_LOCAL'
4909SAGE_PIP_PACKAGES='\
4910SAGE_PKG_CONFIG_PATH='$SAGE_LOCAL/lib/pkgconfig'
4911SAGE_PYTHON_VERSION='3'
4912SAGE_SCRIPTS='\
4913SAGE_SCRIPT_PACKAGES='\
4914SAGE_SDIST_PACKAGES='\
4915SAGE_STANDARD_PACKAGES='\
4916SAGE_TOOLCHAIN='gcc'
4917SED='/usr/bin/sed'
4918SET_MAKE=''
4919SHELL='/bin/sh'
4920STRIP=''
4921TACHYON='/usr/bin/tachyon'
4922VERSION='9.1.beta1'
4923ZMQ_CPPFLAGS=''
4924ZMQ_LDFLAGS=''
4925ZMQ_LIBS='-lzmq'
4926_libcurl_config=''
4927ac_ct_CC='gcc'
4928ac_ct_CXX='g++'
4929ac_ct_FC='gfortran'
4930ac_ct_OBJC='gcc'
4931ac_ct_OBJCXX='g++'
4932am__EXEEXT_FALSE=''
4933am__EXEEXT_TRUE='#'
4934am__fastdepCC_FALSE=''
4935am__fastdepCC_TRUE='#'
4936am__fastdepCXX_FALSE=''
4937am__fastdepCXX_TRUE='#'
4938am__fastdepOBJCXX_FALSE=''
4939am__fastdepOBJCXX_TRUE='#'
4940am__fastdepOBJC_FALSE=''
4941am__fastdepOBJC_TRUE='#'
4942am__include='include'
4943am__isrc=''
4944am__leading_dot='.'
4945am__nodep='_no'
4946am__quote=''
4947am__tar='$${TAR-tar} chof - "$$tardir"'
4948am__untar='$${TAR-tar} xf -'
4949bindir='${exec_prefix}/bin'
4950build='x86_64-pc-linux-gnu'
4951build_alias=''
4952build_cpu='x86_64'
4953build_os='linux-gnu'
4954build_vendor='pc'
4955bzip2_prog='/usr/bin/bzip2'
4956datadir='${datarootdir}'
4957datarootdir='${prefix}/share'
4958deps_alabaster = $(PYTHON) | pip
4959deps_appnope = $(PYTHON) | pip
4960deps_arb = $(MP_LIBRARY) mpfr flint
4961deps_atlas = gfortran | $(PYTHON)
4962deps_autotools = ncurses git xz
4963deps_awali = $(PYTHON) cmake cython nbconvert ncurses
4964deps_babel = $(PYTHON) | pip pytz
4965deps_backports_abc = $(PYTHON) | setuptools pip
4966deps_backports_functools_lru_cache = $(PYTHON) | setuptools_scm pip
4967deps_backports_shutil_get_terminal_size = $(PYTHON) | setuptools pip
4968deps_backports_ssl_match_hostname = $(PYTHON) | setuptools pip
4969deps_barvinok = ntl isl polylib
4970deps_beautifulsoup4 =  | pip
4971deps_benzene =  | $(STANDARD_PACKAGES)
4972deps_biopython =  | pip
4973deps_bleach = $(PYTHON) | setuptools pip
4974deps_bliss =
4975deps_boost = iconv zlib
4976deps_boost_cropped =
4977deps_brial = boost_cropped m4ri libpng $(PYTHON) | pip pkgconf
4978deps_buckygen =
4979deps_bzip2 = | pkgconf
4980deps_cbc = readline zlib bzip2 $(BLAS)
4981deps_ccache = zlib
4982deps_cddlib = $(MP_LIBRARY)
4983deps_certifi = $(PYTHON) | setuptools pip
4984deps_cliquer =
4985deps_cmake = curl zlib bzip2 xz
4986deps_cocoalib = $(MP_LIBRARY)
4987deps_combinatorial_designs =
4988deps_compilerwrapper =
4989deps_configparser = $(PYTHON) | pip
4990deps_configure =
4991deps_conway_polynomials = $(PYTHON) | six
4992deps_coxeter3 =
4993deps_cryptominisat = $(PYTHON) m4ri zlib libpng | cmake sqlite boost_cropped
4994deps_csdp = $(BLAS)
4995deps_curl =
4996deps_cvxopt = $(PYTHON) numpy $(BLAS) gsl glpk suitesparse | pkgconfig pip nose matplotlib
4997deps_cycler = $(PYTHON) six | setuptools pip
4998deps_cypari = $(PYTHON) cython pari cysignals | pip
4999deps_cysignals = $(PYTHON) cython pari | pip
5000deps_cython = $(PYTHON) | setuptools pip
5001deps_d3js =
5002deps_database_cremona_ellcurve =
5003deps_database_jones_numfield =
5004deps_database_kohel =
5005deps_database_mutation_class =
5006deps_database_odlyzko_zeta = | $(SAGERUNTIME)
5007deps_database_stein_watkins =
5008deps_database_stein_watkins_mini =
5009deps_database_symbolic_data =
5010deps_dateutil = $(PYTHON) six | setuptools pip
5011deps_decorator = $(PYTHON) | setuptools pip
5012deps_deformation = $(MP_LIBRARY) mpfr flint
5013deps_defusedxml = $(PYTHON) | pip
5014deps_docutils = $(PYTHON) | pip
5015deps_dot2tex = $(PYTHON) | pip pyparsing
5016deps_e_antic = $(MP_LIBRARY) flint arb
5017deps_ecl = $(MP_LIBRARY) readline gc
5018deps_eclib = pari ntl flint
5019deps_ecm = $(MP_LIBRARY)
5020deps_elliptic_curves = | sqlite $(PYTHON)
5021deps_entrypoints = $(PYTHON) | pip configparser
5022deps_enum34 = $(PYTHON) | pip
5023deps_fflas_ffpack = $(MP_LIBRARY) givaro gsl $(BLAS) | pkgconf
5024deps_flask = $(PYTHON) | pip werkzeug jinja2 itsdangerous
5025deps_flask_autoindex = $(PYTHON) | pip flask_silk future
5026deps_flask_babel = $(PYTHON) | pip flask speaklater babel
5027deps_flask_oldsessions = $(PYTHON) | pip
5028deps_flask_openid = $(PYTHON) | pip flask python_openid
5029deps_flask_silk = $(PYTHON) | pip flask
5030deps_flint = $(MP_LIBRARY) mpfr ntl
5031deps_flintqs = $(MP_LIBRARY)
5032deps_fplll = $(MP_LIBRARY) mpfr
5033deps_fpylll = $(PYTHON) cython cysignals numpy fplll
5034deps_freetype = libpng bzip2
5035deps_fricas = ecl
5036deps_frobby = $(MP_LIBRARY)
5037deps_functools32 = $(PYTHON) | setuptools pip
5038deps_future = $(PYTHON) | setuptools pip
5039deps_gambit = cython | setuptools
5040deps_gap = ncurses readline zlib $(MP_LIBRARY)
5041deps_gap3 =
5042deps_gap_jupyter = $(PYTHON) | pip ipython gap
5043deps_gap_packages = gap libsemigroups planarity | $(SAGERUNTIME)
5044deps_gc = libatomic_ops
5045deps_gcc = | $(MP_LIBRARY) mpfr mpc zlib xz
5046deps_gdb = mpfr zlib ncurses $(PYTHON) xz
5047deps_gf2x =
5048deps_gfan = $(MP_LIBRARY) cddlib
5049deps_gfortran = | $(MP_LIBRARY) mpfr mpc zlib xz
5050deps_giac = readline libpng $(MP_LIBRARY) mpfr mpfi ntl gsl pari
5051deps_giacpy_sage = $(PYTHON) cython giac cysignals | $(SAGERUNTIME) pip sympy maxima
5052deps_git = zlib $(PYTHON)
5053deps_git_trac = $(PYTHON) | setuptools pip
5054deps_givaro = $(MP_LIBRARY)
5055deps_glpk = $(MP_LIBRARY) zlib
5056deps_glucose = zlib
5057deps_gmp =
5058deps_gmpy2 = $(PYTHON) $(MP_LIBRARY) mpfr mpc | pip
5059deps_gp2c = pari
5060deps_graphs =
5061deps_gsl = $(BLAS)
5062deps_html5lib = $(PYTHON) | setuptools pip
5063deps_iconv =
5064deps_igraph = $(MP_LIBRARY) glpk
5065deps_imagesize = $(PYTHON) | pip
5066deps_iml = $(MP_LIBRARY) $(BLAS) | pkgconf
5067deps_ipaddress = $(PYTHON) | pip
5068deps_ipykernel = $(PYTHON) | ipython jupyter_client pip scandir
5069deps_ipython = $(PYTHON) jinja2 tornado pyzmq pickleshare simplegeneric traitlets | pip backports_shutil_get_terminal_size wcwidth prompt_toolkit pygments pexpect appnope
5070deps_ipython_genutils = $(PYTHON) | pip
5071deps_ipywidgets = $(PYTHON) widgetsnbextension | pip
5072deps_isl = $(MP_LIBRARY)
5073deps_itsdangerous = $(PYTHON) | pip
5074deps_jinja2 = $(PYTHON) markupsafe docutils | setuptools pip
5075deps_jmol =
5076deps_jsonschema = $(PYTHON) vcversioner functools32 | setuptools pip
5077deps_jupymake = $(PYTHON) polymake | pip
5078deps_jupyter_client = $(PYTHON) jupyter_core | pip pyzmq dateutil
5079deps_jupyter_core = $(PYTHON) | pip traitlets
5080deps_kenzo = ecl
5081deps_kiwisolver = $(PYTHON) | pip
5082deps_latte_int = $(MP_LIBRARY) ntl 4ti2 cddlib lrslib lidia
5083deps_lcalc = pari mpfr
5084deps_libatomic_ops =
5085deps_libbraiding =
5086deps_libffi =
5087deps_libgd = libpng freetype
5088deps_libhomfly = gc
5089deps_libogg =
5090deps_libpng = zlib
5091deps_libsemigroups =
5092deps_libtheora = libogg libpng
5093deps_lidia = $(MP_LIBRARY)
5094deps_lie = readline ncurses
5095deps_linbox = $(MP_LIBRARY) ntl givaro mpfr fplll iml flint fflas_ffpack
5096deps_lrcalc =
5097deps_lrslib = $(MP_LIBRARY)
5098deps_m4ri = libpng
5099deps_m4rie = m4ri
5100deps_markupsafe = $(PYTHON) | setuptools pip
5101deps_mathjax =
5102deps_matplotlib = $(PYTHON) numpy freetype libpng dateutil pyparsing tornado six cycler | setuptools pip pytz functools32 backports_functools_lru_cache subprocess32 kiwisolver
5103deps_maxima = ecl
5104deps_mcqd =  | $(STANDARD_PACKAGES)
5105deps_meataxe =
5106deps_mistune = $(PYTHON) cython | setuptools pip
5107deps_modular_decomposition =
5108deps_mpc = $(MP_LIBRARY) mpfr
5109deps_mpfi = $(MP_LIBRARY) mpfr
5110deps_mpfr = $(MP_LIBRARY)
5111deps_mpfrcx = $(MP_LIBRARY) mpfr mpc
5112deps_mpir = | yasm
5113deps_mpmath = $(PYTHON) | pip
5114deps_nauty =
5115deps_nbconvert = $(PYTHON) | pip mistune jinja2 pygments traitlets jupyter_core nbformat entrypoints bleach pandocfilters testpath defusedxml
5116deps_nbformat = $(PYTHON) | pip jsonschema
5117deps_ncurses =
5118deps_networkx = $(PYTHON) decorator | pip nose scipy
5119deps_nibabel =  | pip
5120deps_ninja_build = | $(PYTHON)
5121deps_normaliz = $(MP_LIBRARY) singular boost_cropped flint e_antic
5122deps_nose = $(PYTHON) | pip
5123deps_notebook = $(PYTHON) | pip ipython jupyter_client ipykernel nbconvert nbformat jinja2 tornado terminado send2trash ipaddress prometheus_client
5124deps_notedown = $(PYTHON) setuptools | pip nbformat nbconvert six pandoc_attributes
5125deps_ntl = $(MP_LIBRARY) gf2x
5126deps_numpy = $(PYTHON) $(BLAS) gfortran | setuptools pip pkgconfig cython
5127deps_openblas = gfortran | $(PYTHON)
5128deps_openssl =
5129deps_p_group_cohomology = $(PYTHON) cython cysignals singular meataxe $(SAGE_SRC)/sage/matrix/matrix_gfpn_dense.pxd $(SAGE_SRC)/sage/structure/element.pxd $(SAGE_SRC)/sage/matrix/matrix_gfpn_dense.pxd $(SAGE_SRC)/sage/matrix/matrix0.pxd $(SAGE_SRC)/sage/libs/meataxe.pxd $(SAGE_SRC)/sage/rings/morphism.pxd | pip matplotlib gap xz $(SAGERUNTIME)
5130deps_packaging = $(PYTHON) | pip pyparsing six
5131deps_palp =
5132deps_pandoc_attributes = $(PYTHON) setuptools | pip pandocfilters
5133deps_pandocfilters = $(PYTHON) | pip
5134deps_pari = readline $(MP_LIBRARY) | pari_galdata pari_seadata_small
5135deps_pari_elldata =
5136deps_pari_galdata =
5137deps_pari_galpol =
5138deps_pari_jupyter = $(PYTHON) pari | pip cython notebook jupyter_core
5139deps_pari_nftables =
5140deps_pari_seadata =
5141deps_pari_seadata_small =
5142deps_patch =
5143deps_pathlib2 = $(PYTHON) | setuptools pip six scandir
5144deps_pathpy = $(PYTHON) | setuptools setuptools_scm pip
5145deps_pcre = bzip2
5146deps_perl_term_readline_gnu = readline
5147deps_pexpect = $(PYTHON) ptyprocess | pip
5148deps_pickleshare = $(PYTHON) pathpy pathlib2 | setuptools pip
5149deps_pillow = $(PYTHON) setuptools
5150deps_pip = $(PYTHON) python3 setuptools
5151deps_pkgconf = | patch
5152deps_pkgconfig = $(PYTHON) | setuptools pip
5153deps_planarity =
5154deps_plantri =
5155deps_polylib = $(MP_LIBRARY) mpfr ntl
5156deps_polymake = $(MP_LIBRARY) bliss cddlib lrslib normaliz perl_term_readline_gnu | ninja_build
5157deps_polytopes_db =
5158deps_ppl = $(MP_LIBRARY) glpk
5159deps_pplpy = $(PYTHON) $(MP_LIBRARY) gmpy2 cysignals mpfr mpc ppl | pip sphinx
5160deps_primecount = cmake
5161deps_prometheus_client = $(PYTHON) | pip
5162deps_prompt_toolkit = $(PYTHON) six wcwidth | pip
5163deps_psutil = $(PYTHON) | pip
5164deps_ptyprocess = $(PYTHON) | pip
5165deps_pybtex =  | pip
5166deps_pycosat = $(PYTHON) | pip
5167deps_pycygwin = $(PYTHON) cython | setuptools pip
5168deps_pyflakes =  | pip
5169deps_pygments = $(PYTHON) | setuptools pip
5170deps_pynac = $(PYTHON) $(MP_LIBRARY) flint singular giac | pkgconf
5171deps_pynormaliz = $(PYTHON) normaliz | pip
5172deps_pyopenssl =  | $(STANDARD_PACKAGES)
5173deps_pyparsing = $(PYTHON) | setuptools pip
5174deps_pysingular = $(PYTHON) singular | pip
5175deps_python2 = zlib readline sqlite libpng bzip2 | xz
5176deps_python3 = zlib readline sqlite libpng bzip2 xz libffi
5177deps_python_igraph = igraph $(PYTHON) | pip
5178deps_python_openid = $(PYTHON) | pip
5179deps_pytz = $(PYTHON) | pip
5180deps_pyx =  | pip
5181deps_pyzmq = $(PYTHON) cython zeromq | setuptools pip
5182deps_qepcad = readline saclib
5183deps_qhull = | cmake
5184deps_r = $(BLAS) gfortran iconv readline bzip2 xz pcre curl | pkgconf
5185deps_r_jupyter =  | $(STANDARD_PACKAGES)
5186deps_ratpoints = $(MP_LIBRARY)
5187deps_readline = ncurses
5188deps_requests = $(PYTHON) | pip
5189deps_rpy2 = $(PYTHON) r six singledispatch | pip
5190deps_rst2ipynb = $(PYTHON) | setuptools pip notedown
5191deps_rubiks =
5192deps_rw =
5193deps_saclib =
5194deps_sage_numerical_backends_coin = cbc cysignals $(SAGE_SRC)/sage/numerical/backends/generic_backend.pxd $(SAGE_SRC)/sage/cpython/string.pxd $(SAGE_SRC)/sage/cpython/string_impl.h | $(SAGERUNTIME) setuptools pip cython
5195deps_sage_numerical_backends_cplex = cysignals $(SAGE_SRC)/sage/numerical/backends/generic_backend.pxd $(SAGE_SRC)/sage/cpython/string.pxd $(SAGE_SRC)/sage/cpython/string_impl.h | $(SAGERUNTIME) setuptools pip cython
5196deps_sage_numerical_backends_gurobi = cysignals $(SAGE_SRC)/sage/numerical/backends/generic_backend.pxd $(SAGE_SRC)/sage/cpython/string.pxd $(SAGE_SRC)/sage/cpython/string_impl.h | $(SAGERUNTIME) setuptools pip cython
5197deps_sagenb = $(STARTED) | pip babel flask flask_autoindex flask_babel flask_oldsessions flask_openid mathjax twisted sphinx
5198deps_sagenb_export = $(PYTHON) nbconvert ipython six | pip
5199deps_sagetex = $(PYTHON) maxima scipy matplotlib pillow tachyon | $(SAGERUNTIME) sympy elliptic_curves jmol
5200deps_scandir = $(PYTHON) | setuptools pip six
5201deps_scipoptsuite = $(MP_LIBRARY) bliss readline | cmake
5202deps_scipy = $(PYTHON) $(BLAS) gfortran numpy | pip
5203deps_scons = $(PYTHON)
5204deps_send2trash = $(PYTHON) | pip
5205deps_setuptools = $(PYTHON) python3
5206deps_setuptools_scm = $(PYTHON) | setuptools pip
5207deps_simplegeneric = $(PYTHON) | setuptools pip
5208deps_singledispatch = $(PYTHON) six | setuptools pip
5209deps_singular = $(MP_LIBRARY) $(PYTHON) ntl flint readline mpfr cddlib
5210deps_singular_jupyter = $(PYTHON) jupyter_client | pip pysingular ipython ipywidgets
5211deps_sip = $(PYTHON)
5212deps_sirocco =  | $(STANDARD_PACKAGES)
5213deps_six = $(PYTHON) | setuptools pip
5214deps_snowballstemmer = $(PYTHON) | pip
5215deps_speaklater = $(PYTHON) | pip
5216deps_sphinx = $(PYTHON) | pip docutils jinja2 pygments six snowballstemmer imagesize babel alabaster requests typing sphinxcontrib_websupport packaging
5217deps_sphinxcontrib_websupport = $(PYTHON) | pip
5218deps_sqlalchemy =  | pip
5219deps_sqlite = readline
5220deps_subprocess32 = $(PYTHON) | pip python3
5221deps_suitesparse = $(BLAS) gfortran
5222deps_surf = $(MP_LIBRARY)
5223deps_symmetrica =
5224deps_sympow =
5225deps_sympy = $(PYTHON) mpmath | pip
5226deps_tachyon = libpng
5227deps_tdlib =  | $(STANDARD_PACKAGES)
5228deps_termcap =
5229deps_terminado = $(PYTHON) | pip ptyprocess tornado
5230deps_testpath = $(PYTHON) | pip
5231deps_texlive =  | $(STANDARD_PACKAGES)
5232deps_thebe =
5233deps_threejs =
5234deps_tides = $(MP_LIBRARY) mpfr
5235deps_topcom = cddlib
5236deps_tornado = $(PYTHON) backports_abc backports_ssl_match_hostname certifi singledispatch | setuptools pip
5237deps_traitlets = $(PYTHON) | pip ipython_genutils decorator six enum34
5238deps_twisted = $(PYTHON) | setuptools pip zope_interface
5239deps_typing = $(PYTHON) | pip
5240deps_valgrind =
5241deps_vcversioner = $(PYTHON) | setuptools pip
5242deps_wcwidth = $(PYTHON) | pip setuptools
5243deps_webencodings = $(PYTHON) | setuptools pip
5244deps_werkzeug = $(PYTHON) | pip
5245deps_widgetsnbextension = $(PYTHON) | setuptools pip notebook jupyter_core
5246deps_xz =
5247deps_yasm =
5248deps_zeromq =
5249deps_zlib =
5250deps_zn_poly = $(MP_LIBRARY)
5251deps_zope_interface = $(PYTHON) | pip
5252docdir='${datarootdir}/doc/${PACKAGE_TARNAME}'
5253dvidir='${docdir}'
5254exec_prefix='${prefix}'
5255foodirectg='/usr/bin/directg'
5256foogenbg='/usr/bin/genbg'
5257foogeng='/usr/bin/geng'
5258foogentourng='/usr/bin/gentourng'
5259found_ar='yes'
5260found_latex='yes'
5261found_m4='yes'
5262found_ranlib='yes'
5263found_strip='yes'
5264host='x86_64-pc-linux-gnu'
5265host_alias=''
5266host_cpu='x86_64'
5267host_os='linux-gnu'
5268host_vendor='pc'
5269htmldir='${docdir}'
5270includedir='${prefix}/include'
5271infodir='${datarootdir}/info'
5272install_sh='${SHELL} /opt/sage/config/install-sh'
5273libdir='${exec_prefix}/lib'
5274libexecdir='${exec_prefix}/libexec'
5275localedir='${datarootdir}/locale'
5276localstatedir='${prefix}/var'
5277mandir='${datarootdir}/man'
5278mkdir_p='$(MKDIR_P)'
5279naudirectg=''
5280naugenbg=''
5281naugeng=''
5282naugentourng=''
5283oldincludedir='/usr/include'
5284pdfdir='${docdir}'
5285prefix='/opt/sage/local'
5286program_transform_name='s,x,x,'
5287psdir='${docdir}'
5288sbindir='${exec_prefix}/sbin'
5289sharedstatedir='${prefix}/com'
5290sysconfdir='${prefix}/etc'
5291target_alias=''
5292vers_alabaster = 0.7.12
5293vers_appnope = 0.1.0.p0
5294vers_arb = 2.16.0.p0
5295vers_atlas = 3.10.2.p3
5296vers_autotools = 20141105.p0
5297vers_awali = 1.0.2-190218
5298vers_babel = 2.6.0
5299vers_backports_abc = 0.5
5300vers_backports_functools_lru_cache = 1.5
5301vers_backports_shutil_get_terminal_size = 1.0.0.p1
5302vers_backports_ssl_match_hostname = 3.5.0.1.p0
5303vers_barvinok = 0.41.1
5304vers_beautifulsoup4 = beautifulsoup4
5305vers_benzene = 20130630
5306vers_biopython = biopython
5307vers_bleach = 3.1.0
5308vers_bliss = 0.73+debian-1+sage-2016-08-02.p0
5309vers_boost = 1_66_0
5310vers_boost_cropped = 1.66.0.p0
5311vers_brial = 1.2.5
5312vers_buckygen = 1.1
5313vers_bzip2 = 1.0.6-20150304.p0
5314vers_cbc = 2.9.4.p0
5315vers_ccache = 3.3.4
5316vers_cddlib = 0.94j
5317vers_certifi = 2019.3.9
5318vers_cliquer = 1.21.p4
5319vers_cmake = 3.11.0
5320vers_cocoalib = 0.99564
5321vers_combinatorial_designs = 20140630.p0
5322vers_compilerwrapper = 1.2
5323vers_configparser = 3.7.4
5324vers_configure = 4fd5d56ecea2c81d58e9e43bd5f07b05e863bc7c
5325vers_conway_polynomials = 0.5
5326vers_coxeter3 = 8ac9c71723c8ca57a836d6381aed125261e44e9e
5327vers_cryptominisat = 5.6.8
5328vers_csdp = 6.2.p0
5329vers_curl = 7.62.0.p0
5330vers_cvxopt = 1.2.3
5331vers_cycler = 0.10.0.p0
5332vers_cypari = 2.1.1
5333vers_cysignals = 1.10.2
5334vers_cython = 0.29.12.p0
5335vers_d3js = 3.4.8
5336vers_database_cremona_ellcurve = 20190911
5337vers_database_jones_numfield = 4
5338vers_database_kohel = 20160724
5339vers_database_mutation_class = 1.0
5340vers_database_odlyzko_zeta = 20061209
5341vers_database_stein_watkins = 20110713
5342vers_database_stein_watkins_mini = 20070827
5343vers_database_symbolic_data = 20070206
5344vers_dateutil = 2.5.3
5345vers_decorator = 4.4.0
5346vers_deformation = d05941b.p0
5347vers_defusedxml = 0.6.0
5348vers_docutils = 0.14
5349vers_dot2tex = 2.11.3.p0
5350vers_e_antic = 0.1.3
5351vers_ecl = 16.1.2.p5
5352vers_eclib = 20190909
5353vers_ecm = 7.0.4.p1
5354vers_elliptic_curves = 0.8.1
5355vers_entrypoints = 0.3
5356vers_enum34 = 1.1.6
5357vers_fflas_ffpack = 2.4.3
5358vers_flask = 0.10.1.p0
5359vers_flask_autoindex = 0.6.p0
5360vers_flask_babel = 0.9.p0
5361vers_flask_oldsessions = 0.10.p0
5362vers_flask_openid = 1.2.5.p0
5363vers_flask_silk = 0.2.p0
5364vers_flint = 2.5.2.p5
5365vers_flintqs = 1.0.p0
5366vers_fplll = 5.3.2
5367vers_fpylll = 0.5.1dev
5368vers_freetype = 2.9.1
5369vers_fricas = 1.3.5
5370vers_frobby = 0.9.0.p2
5371vers_functools32 = 3.2.3-2.p0
5372vers_future = 0.17.1
5373vers_gambit = 15.1.1.p0
5374vers_gap = 4.10.2.p1
5375vers_gap3 = 04jul17
5376vers_gap_jupyter = 0.9
5377vers_gap_packages = 4.10.2.p1
5378vers_gc = 7.6.4.p0
5379vers_gcc = 9.2.0
5380vers_gdb = 8.2
5381vers_gf2x = 1.2.p0
5382vers_gfan = 0.6.2.p1
5383vers_gfortran = 9.2.0
5384vers_giac = 1.5.0.63.p0
5385vers_giacpy_sage = 0.6.8
5386vers_git = 2.11.0
5387vers_git_trac = 20160625.p0
5388vers_givaro = 4.1.1
5389vers_glpk = 4.65.p0
5390vers_glucose = 4.1
5391vers_gmp = 6.1.2
5392vers_gmpy2 = 2.1.0b1
5393vers_gp2c = 0.0.10.p0
5394vers_graphs = 20161026.p0
5395vers_gsl = 2.5
5396vers_html5lib = 1.0.1
5397vers_iconv = 1.15
5398vers_igraph = 0.7.1999.p0
5399vers_imagesize = 1.1.0
5400vers_iml = 1.0.4p1.p2
5401vers_ipaddress = 1.0.22
5402vers_ipykernel = 4.8.2
5403vers_ipython = 5.8.0
5404vers_ipython_genutils = 0.2.0
5405vers_ipywidgets = 7.4.2
5406vers_isl = 0.20
5407vers_itsdangerous = 1.1.0
5408vers_jinja2 = 2.10
5409vers_jmol = 14.29.52
5410vers_jsonschema = 2.6.0
5411vers_jupymake = 0.9
5412vers_jupyter_client = 5.2.4
5413vers_jupyter_core = 4.4.0
5414vers_kenzo = 1.1.7-r3
5415vers_kiwisolver = 1.0.1
5416vers_latte_int = 1.7.5.p0
5417vers_lcalc = 1.23.p19
5418vers_libatomic_ops = 7.6.2
5419vers_libbraiding = 1.0.p0
5420vers_libffi = 3.2.1
5421vers_libgd = 2.1.1.1.p1
5422vers_libhomfly = 1.02r4.p0
5423vers_libogg = 1.3.1.p0
5424vers_libpng = 1.6.29.p1
5425vers_libsemigroups = 0.6.7
5426vers_libtheora = 1.1.1
5427vers_lidia = 2.3.0+latte-patches-2019-05-02
5428vers_lie = 2.2.2
5429vers_linbox = 1.6.3
5430vers_lrcalc = 1.2.p1
5431vers_lrslib = 062+autotools-2017-03-03.p1
5432vers_m4ri = 20140914.p0
5433vers_m4rie = 20150908.p0
5434vers_markupsafe = 1.1.0
5435vers_mathjax = 2.7.4.p0
5436vers_matplotlib = 2.2.4.p0
5437vers_maxima = 5.42.2
5438vers_mcqd = 1.0
5439vers_meataxe = 1.0.p0
5440vers_mistune = 0.8.4
5441vers_modular_decomposition = 20100607
5442vers_mpc = 1.1.0
5443vers_mpfi = 1.5.2
5444vers_mpfr = 4.0.1.p0
5445vers_mpfrcx = 0.5
5446vers_mpir = 3.0.0-644faf502c56f97d9accd301965fc57d6ec70868.p0
5447vers_mpmath = 1.1.0
5448vers_nauty = 26r1.p0
5449vers_nbconvert = 5.4.0
5450vers_nbformat = 4.4.0
5451vers_ncurses = 6.0.p0
5452vers_networkx = 2.2
5453vers_nibabel = nibabel
5454vers_ninja_build = 1.8.2
5455vers_normaliz = 3.7.2
5456vers_nose = 1.3.7
5457vers_notebook = 5.7.6.p0
5458vers_notedown = 1.5.1
5459vers_ntl = 11.3.2
5460vers_numpy = 1.16.1
5461vers_openblas = 0.3.6.p0
5462vers_openssl = 1.1.1b
5463vers_p_group_cohomology = 3.3
5464vers_packaging = 18.0
5465vers_palp = 2.1.p2
5466vers_pandoc_attributes = 8bc82f6d
5467vers_pandocfilters = 1.4.2
5468vers_pari = 2.11.2
5469vers_pari_elldata = 20161017
5470vers_pari_galdata = 20080411.p0
5471vers_pari_galpol = 20180625
5472vers_pari_jupyter = 1.3.2
5473vers_pari_nftables = 20080929
5474vers_pari_seadata = 20090618
5475vers_pari_seadata_small = 20090618.p0
5476vers_patch = 2.7.5
5477vers_pathlib2 = 2.3.3
5478vers_pathpy = 7.1.p0
5479vers_pcre = 8.40.p2
5480vers_perl_term_readline_gnu = 1.35
5481vers_pexpect = 4.6.0.p0
5482vers_pickleshare = 0.7.5
5483vers_pillow = 5.3.0.p0
5484vers_pip = 18.1
5485vers_pkgconf = 0.9.7.p2
5486vers_pkgconfig = 1.5.1
5487vers_planarity = 3.0.0.5.p0
5488vers_plantri = 4.5
5489vers_polylib = 5.22.5
5490vers_polymake = 3.4
5491vers_polytopes_db = 20170220.p0
5492vers_ppl = 1.2.p1
5493vers_pplpy = 0.8.4
5494vers_primecount = 5.1
5495vers_prometheus_client = 0.5.0
5496vers_prompt_toolkit = 1.0.15
5497vers_psutil = 5.2.0.p2
5498vers_ptyprocess = 0.5.1.p0
5499vers_pybtex = pybtex
5500vers_pycosat = 0.6.3
5501vers_pycygwin = 0.1
5502vers_pyflakes = pyflakes
5503vers_pygments = 2.3.1.p0
5504vers_pynac = 0.7.26
5505vers_pynormaliz = 2.7
5506vers_pyopenssl = pyopenssl
5507vers_pyparsing = 2.3.0
5508vers_pysingular = 0.9.5
5509vers_python2 = 2.7.15.p1
5510vers_python3 = 3.7.3.p1
5511vers_python_igraph = 0.7.1999
5512vers_python_openid = 2.2.5.p0
5513vers_pytz = 2018.7
5514vers_pyx = pyx
5515vers_pyzmq = 18.1.0
5516vers_qepcad = B.1.71
5517vers_qhull = 2015-src-7.2.0.p1
5518vers_r = 3.6.2
5519vers_r_jupyter = r_jupyter
5520vers_ratpoints = 2.1.3.p5
5521vers_readline = 6.3.008.p0
5522vers_requests = 2.13.0
5523vers_rpy2 = 2.8.2.p1
5524vers_rst2ipynb = 0.2.2.p0
5525vers_rubiks = 20070912.p21
5526vers_rw = 0.7.p0
5527vers_saclib = 2.2.7
5528vers_sage_numerical_backends_coin = 9.0b12
5529vers_sage_numerical_backends_cplex = 9.0b12
5530vers_sage_numerical_backends_gurobi = 9.0.0
5531vers_sagenb = 1.1.3
5532vers_sagenb_export = 3.3
5533vers_sagetex = 3.4
5534vers_scandir = 1.9.0
5535vers_scipoptsuite = 5.0.1
5536vers_scipy = 1.2.0
5537vers_scons = 1.2.0
5538vers_send2trash = 1.5.0
5539vers_setuptools = 40.6.3
5540vers_setuptools_scm = 3.1.0
5541vers_simplegeneric = 0.8.1.p0
5542vers_singledispatch = 3.4.0.3.p0
5543vers_singular = 4.1.1p2.p0
5544vers_singular_jupyter = 0.9.7
5545vers_sip = 4.18
5546vers_sirocco = 2.0.p0
5547vers_six = 1.12.0
5548vers_snowballstemmer = 1.2.1.p0
5549vers_speaklater = 1.3.p0
5550vers_sphinx = 1.8.5.p0
5551vers_sphinxcontrib_websupport = 1.1.0
5552vers_sqlalchemy = sqlalchemy
5553vers_sqlite = 3290000
5554vers_subprocess32 = 3.5.3
5555vers_suitesparse = 5.6.0
5556vers_surf = 1.0.6-gcc6
5557vers_symmetrica = 2.0.p11
5558vers_sympow = 1.018.1.p13
5559vers_sympy = 1.5
5560vers_tachyon = 0.98.9.p7
5561vers_tdlib = 0.3.1.p0
5562vers_termcap = 1.3.1.p3
5563vers_terminado = 0.8.1
5564vers_testpath = 0.4.2
5565vers_texlive = texlive
5566vers_thebe = 9624e0a0.p0
5567vers_threejs = r110
5568vers_tides = 2.0.p0
5569vers_topcom = 0.17.7
5570vers_tornado = 4.5.2
5571vers_traitlets = 4.3.2
5572vers_twisted = 16.3.0.p0
5573vers_typing = 3.6.6
5574vers_valgrind = 3.14.0
5575vers_vcversioner = 2.16.0.0.p0
5576vers_wcwidth = 0.1.7.p0
5577vers_webencodings = 0.5.1
5578vers_werkzeug = 0.14.1
5579vers_widgetsnbextension = 3.4.2
5580vers_xz = 5.2.2.p0
5581vers_yasm = 1.3.0.p0
5582vers_zeromq = 4.2.5
5583vers_zlib = 1.2.11.p0
5584vers_zn_poly = 0.9.1.p0
5585vers_zope_interface = 4.6.0
5586
5587## ------------------- ##
5588## File substitutions. ##
5589## ------------------- ##
5590
5591SAGE_MAKE_DEPS='/opt/sage/build/make/deps'
5592
5593## ----------- ##
5594## confdefs.h. ##
5595## ----------- ##
5596
5597/* confdefs.h */
5598#define PACKAGE_NAME "Sage"
5599#define PACKAGE_TARNAME "sage"
5600#define PACKAGE_VERSION "9.1.beta1"
5601#define PACKAGE_STRING "Sage 9.1.beta1"
5602#define PACKAGE_BUGREPORT "sage-devel@googlegroups.com"
5603#define PACKAGE_URL ""
5604#define PACKAGE "sage"
5605#define VERSION "9.1.beta1"
5606#define STDC_HEADERS 1
5607#define HAVE_SYS_TYPES_H 1
5608#define HAVE_SYS_STAT_H 1
5609#define HAVE_STDLIB_H 1
5610#define HAVE_STRING_H 1
5611#define HAVE_MEMORY_H 1
5612#define HAVE_STRINGS_H 1
5613#define HAVE_INTTYPES_H 1
5614#define HAVE_STDINT_H 1
5615#define HAVE_UNISTD_H 1
5616#define HAVE_LIBM 1
5617#define HAVE_CXX11 1
5618#define HAVE_LRCALC_SCHUBLIB_H 1
5619#define HAVE_ZMQ /**/
5620#define HAVE_GMP_H 1
5621#define ABSOLUTE_GMP_H "///usr/include/gmp.h"
5622#define HAVE_LIBCURL 1
5623#define LIBCURL_FEATURE_SSL 1
5624#define LIBCURL_FEATURE_IPV6 1
5625#define LIBCURL_FEATURE_UNIXSOCKETS 1
5626#define LIBCURL_FEATURE_LIBZ 1
5627#define LIBCURL_FEATURE_ASYNCHDNS 1
5628#define LIBCURL_FEATURE_IDN 1
5629#define LIBCURL_FEATURE_GSS_API 1
5630#define LIBCURL_FEATURE_PSL 1
5631#define LIBCURL_FEATURE_SPNEGO 1
5632#define LIBCURL_FEATURE_KERBEROS 1
5633#define LIBCURL_FEATURE_NTLM 1
5634#define LIBCURL_FEATURE_NTLM_WB 1
5635#define LIBCURL_FEATURE_TLS_SRP 1
5636#define LIBCURL_FEATURE_HTTP2 1
5637#define LIBCURL_FEATURE_HTTPS_PROXY 1
5638#define LIBCURL_PROTOCOL_DICT 1
5639#define LIBCURL_PROTOCOL_FILE 1
5640#define LIBCURL_PROTOCOL_FTP 1
5641#define LIBCURL_PROTOCOL_FTPS 1
5642#define LIBCURL_PROTOCOL_GOPHER 1
5643#define LIBCURL_PROTOCOL_HTTP 1
5644#define LIBCURL_PROTOCOL_HTTPS 1
5645#define LIBCURL_PROTOCOL_IMAP 1
5646#define LIBCURL_PROTOCOL_IMAPS 1
5647#define LIBCURL_PROTOCOL_POP3 1
5648#define LIBCURL_PROTOCOL_POP3S 1
5649#define LIBCURL_PROTOCOL_RTSP 1
5650#define LIBCURL_PROTOCOL_SCP 1
5651#define LIBCURL_PROTOCOL_SFTP 1
5652#define LIBCURL_PROTOCOL_SMB 1
5653#define LIBCURL_PROTOCOL_SMBS 1
5654#define LIBCURL_PROTOCOL_SMTP 1
5655#define LIBCURL_PROTOCOL_SMTPS 1
5656#define LIBCURL_PROTOCOL_TELNET 1
5657#define LIBCURL_PROTOCOL_TFTP 1
5658#define HAVE_ICONV 1
5659#define ICONV_CONST
5660#define HAVE_LIBARB 1
5661#define HAVE_ECM_H 1
5662#define ABSOLUTE_ECM_H "///usr/include/ecm.h"
5663
5664configure: exit 0