Ticket #22999: cmake-3.8.1.log

File cmake-3.8.1.log, 131.3 KB (added by slabbe, 4 years ago)

On OSX 10.10.2 Yosemite with XCode 6.3

Line 
1Found local metadata for cmake-3.8.1
2Using cached file /Users/slabbe/Applications/sage-git/upstream/cmake-3.8.1.tar.gz
3cmake-3.8.1
4====================================================
5Setting up build directory for cmake-3.8.1
6Finished extraction
7No patch files found in ../patches
8****************************************************
9Host system:
10Darwin MacBookebastien 14.1.0 Darwin Kernel Version 14.1.0: Mon Dec 22 23:10:38 PST 2014; root:xnu-2782.10.72~2/RELEASE_X86_64 x86_64
11****************************************************
12C compiler: gcc
13C compiler version:
14Using built-in specs.
15COLLECT_GCC=/Users/slabbe/Applications/sage-git/local/bin/gcc
16COLLECT_LTO_WRAPPER=/Users/slabbe/Applications/sage-git/local/libexec/gcc/x86_64-apple-darwin14.1.0/4.9.3/lto-wrapper
17Target: x86_64-apple-darwin14.1.0
18Configured with: ../src/configure --prefix=/Users/slabbe/Applications/sage-git/local --with-local-prefix=/Users/slabbe/Applications/sage-git/local --with-gmp=/Users/slabbe/Applications/sage-git/local --with-mpfr=/Users/slabbe/Applications/sage-git/local --with-mpc=/Users/slabbe/Applications/sage-git/local --with-system-zlib --disable-multilib --disable-nls --enable-languages=c,c++,fortran --disable-libitm --with-build-config=bootstrap-debug --without-isl --without-cloog 
19Thread model: posix
20gcc version 4.9.3 (GCC)
21****************************************************
22---------------------------------------------
23CMake 3.8.1, Copyright 2000-2017 Kitware, Inc. and Contributors
24C compiler on this system is: gcc
25C++ compiler on this system is: g++
26Makefile processor on this system is: make
27g++ is GNU compiler
28g++ has setenv
29g++ has unsetenv
30g++ does not have environ in stdlib.h
31g++ has stl wstring
32g++ has <ext/stdio_filebuf.h>
33---------------------------------------------
34g++  -I/Users/slabbe/Applications/sage-git/local/var/tmp/sage/build/cmake-3.8.1/src/Bootstrap.cmk -I/Users/slabbe/Applications/sage-git/local/var/tmp/sage/build/cmake-3.8.1/src/Source   -I/Users/slabbe/Applications/sage-git/local/var/tmp/sage/build/cmake-3.8.1/src/Utilities  -c /Users/slabbe/Applications/sage-git/local/var/tmp/sage/build/cmake-3.8.1/src/Source/cmAddCustomCommandCommand.cxx -o cmAddCustomCommandCommand.o
35g++  -I/Users/slabbe/Applications/sage-git/local/var/tmp/sage/build/cmake-3.8.1/src/Bootstrap.cmk -I/Users/slabbe/Applications/sage-git/local/var/tmp/sage/build/cmake-3.8.1/src/Source   -I/Users/slabbe/Applications/sage-git/local/var/tmp/sage/build/cmake-3.8.1/src/Utilities  -c /Users/slabbe/Applications/sage-git/local/var/tmp/sage/build/cmake-3.8.1/src/Source/cmAddCustomTargetCommand.cxx -o cmAddCustomTargetCommand.o
36g++  -I/Users/slabbe/Applications/sage-git/local/var/tmp/sage/build/cmake-3.8.1/src/Bootstrap.cmk -I/Users/slabbe/Applications/sage-git/local/var/tmp/sage/build/cmake-3.8.1/src/Source   -I/Users/slabbe/Applications/sage-git/local/var/tmp/sage/build/cmake-3.8.1/src/Utilities  -c /Users/slabbe/Applications/sage-git/local/var/tmp/sage/build/cmake-3.8.1/src/Source/cmAddDefinitionsCommand.cxx -o cmAddDefinitionsCommand.o
37g++  -I/Users/slabbe/Applications/sage-git/local/var/tmp/sage/build/cmake-3.8.1/src/Bootstrap.cmk -I/Users/slabbe/Applications/sage-git/local/var/tmp/sage/build/cmake-3.8.1/src/Source   -I/Users/slabbe/Applications/sage-git/local/var/tmp/sage/build/cmake-3.8.1/src/Utilities  -c /Users/slabbe/Applications/sage-git/local/var/tmp/sage/build/cmake-3.8.1/src/Source/cmAddDependenciesCommand.cxx -o cmAddDependenciesCommand.o
38g++  -I/Users/slabbe/Applications/sage-git/local/var/tmp/sage/build/cmake-3.8.1/src/Bootstrap.cmk -I/Users/slabbe/Applications/sage-git/local/var/tmp/sage/build/cmake-3.8.1/src/Source   -I/Users/slabbe/Applications/sage-git/local/var/tmp/sage/build/cmake-3.8.1/src/Utilities  -c /Users/slabbe/Applications/sage-git/local/var/tmp/sage/build/cmake-3.8.1/src/Source/cmAddExecutableCommand.cxx -o cmAddExecutableCommand.o
39g++  -I/Users/slabbe/Applications/sage-git/local/var/tmp/sage/build/cmake-3.8.1/src/Bootstrap.cmk -I/Users/slabbe/Applications/sage-git/local/var/tmp/sage/build/cmake-3.8.1/src/Source   -I/Users/slabbe/Applications/sage-git/local/var/tmp/sage/build/cmake-3.8.1/src/Utilities  -c /Users/slabbe/Applications/sage-git/local/var/tmp/sage/build/cmake-3.8.1/src/Source/cmAddLibraryCommand.cxx -o cmAddLibraryCommand.o
40g++  -I/Users/slabbe/Applications/sage-git/local/var/tmp/sage/build/cmake-3.8.1/src/Bootstrap.cmk -I/Users/slabbe/Applications/sage-git/local/var/tmp/sage/build/cmake-3.8.1/src/Source   -I/Users/slabbe/Applications/sage-git/local/var/tmp/sage/build/cmake-3.8.1/src/Utilities  -c /Users/slabbe/Applications/sage-git/local/var/tmp/sage/build/cmake-3.8.1/src/Source/cmAddSubDirectoryCommand.cxx -o cmAddSubDirectoryCommand.o
41g++  -I/Users/slabbe/Applications/sage-git/local/var/tmp/sage/build/cmake-3.8.1/src/Bootstrap.cmk -I/Users/slabbe/Applications/sage-git/local/var/tmp/sage/build/cmake-3.8.1/src/Source   -I/Users/slabbe/Applications/sage-git/local/var/tmp/sage/build/cmake-3.8.1/src/Utilities  -c /Users/slabbe/Applications/sage-git/local/var/tmp/sage/build/cmake-3.8.1/src/Source/cmAddTestCommand.cxx -o cmAddTestCommand.o
42g++  -I/Users/slabbe/Applications/sage-git/local/var/tmp/sage/build/cmake-3.8.1/src/Bootstrap.cmk -I/Users/slabbe/Applications/sage-git/local/var/tmp/sage/build/cmake-3.8.1/src/Source   -I/Users/slabbe/Applications/sage-git/local/var/tmp/sage/build/cmake-3.8.1/src/Utilities  -c /Users/slabbe/Applications/sage-git/local/var/tmp/sage/build/cmake-3.8.1/src/Source/cmBreakCommand.cxx -o cmBreakCommand.o
43g++  -I/Users/slabbe/Applications/sage-git/local/var/tmp/sage/build/cmake-3.8.1/src/Bootstrap.cmk -I/Users/slabbe/Applications/sage-git/local/var/tmp/sage/build/cmake-3.8.1/src/Source   -I/Users/slabbe/Applications/sage-git/local/var/tmp/sage/build/cmake-3.8.1/src/Utilities  -c /Users/slabbe/Applications/sage-git/local/var/tmp/sage/build/cmake-3.8.1/src/Source/cmBuildCommand.cxx -o cmBuildCommand.o
44g++  -I/Users/slabbe/Applications/sage-git/local/var/tmp/sage/build/cmake-3.8.1/src/Bootstrap.cmk -I/Users/slabbe/Applications/sage-git/local/var/tmp/sage/build/cmake-3.8.1/src/Source   -I/Users/slabbe/Applications/sage-git/local/var/tmp/sage/build/cmake-3.8.1/src/Utilities  -c /Users/slabbe/Applications/sage-git/local/var/tmp/sage/build/cmake-3.8.1/src/Source/cmCMakeMinimumRequired.cxx -o cmCMakeMinimumRequired.o
45g++  -I/Users/slabbe/Applications/sage-git/local/var/tmp/sage/build/cmake-3.8.1/src/Bootstrap.cmk -I/Users/slabbe/Applications/sage-git/local/var/tmp/sage/build/cmake-3.8.1/src/Source   -I/Users/slabbe/Applications/sage-git/local/var/tmp/sage/build/cmake-3.8.1/src/Utilities  -c /Users/slabbe/Applications/sage-git/local/var/tmp/sage/build/cmake-3.8.1/src/Source/cmCMakePolicyCommand.cxx -o cmCMakePolicyCommand.o
46g++  -I/Users/slabbe/Applications/sage-git/local/var/tmp/sage/build/cmake-3.8.1/src/Bootstrap.cmk -I/Users/slabbe/Applications/sage-git/local/var/tmp/sage/build/cmake-3.8.1/src/Source   -I/Users/slabbe/Applications/sage-git/local/var/tmp/sage/build/cmake-3.8.1/src/Utilities  -c /Users/slabbe/Applications/sage-git/local/var/tmp/sage/build/cmake-3.8.1/src/Source/cmCPackPropertiesGenerator.cxx -o cmCPackPropertiesGenerator.o
47g++  -I/Users/slabbe/Applications/sage-git/local/var/tmp/sage/build/cmake-3.8.1/src/Bootstrap.cmk -I/Users/slabbe/Applications/sage-git/local/var/tmp/sage/build/cmake-3.8.1/src/Source   -I/Users/slabbe/Applications/sage-git/local/var/tmp/sage/build/cmake-3.8.1/src/Utilities  -c /Users/slabbe/Applications/sage-git/local/var/tmp/sage/build/cmake-3.8.1/src/Source/cmCacheManager.cxx -o cmCacheManager.o
48g++  -I/Users/slabbe/Applications/sage-git/local/var/tmp/sage/build/cmake-3.8.1/src/Bootstrap.cmk -I/Users/slabbe/Applications/sage-git/local/var/tmp/sage/build/cmake-3.8.1/src/Source   -I/Users/slabbe/Applications/sage-git/local/var/tmp/sage/build/cmake-3.8.1/src/Utilities  -c /Users/slabbe/Applications/sage-git/local/var/tmp/sage/build/cmake-3.8.1/src/Source/cmCommand.cxx -o cmCommand.o
49g++  -I/Users/slabbe/Applications/sage-git/local/var/tmp/sage/build/cmake-3.8.1/src/Bootstrap.cmk -I/Users/slabbe/Applications/sage-git/local/var/tmp/sage/build/cmake-3.8.1/src/Source   -I/Users/slabbe/Applications/sage-git/local/var/tmp/sage/build/cmake-3.8.1/src/Utilities  -c /Users/slabbe/Applications/sage-git/local/var/tmp/sage/build/cmake-3.8.1/src/Source/cmCommandArgumentLexer.cxx -o cmCommandArgumentLexer.o
50g++  -I/Users/slabbe/Applications/sage-git/local/var/tmp/sage/build/cmake-3.8.1/src/Bootstrap.cmk -I/Users/slabbe/Applications/sage-git/local/var/tmp/sage/build/cmake-3.8.1/src/Source   -I/Users/slabbe/Applications/sage-git/local/var/tmp/sage/build/cmake-3.8.1/src/Utilities  -c /Users/slabbe/Applications/sage-git/local/var/tmp/sage/build/cmake-3.8.1/src/Source/cmCommandArgumentParser.cxx -o cmCommandArgumentParser.o
51g++  -I/Users/slabbe/Applications/sage-git/local/var/tmp/sage/build/cmake-3.8.1/src/Bootstrap.cmk -I/Users/slabbe/Applications/sage-git/local/var/tmp/sage/build/cmake-3.8.1/src/Source   -I/Users/slabbe/Applications/sage-git/local/var/tmp/sage/build/cmake-3.8.1/src/Utilities  -c /Users/slabbe/Applications/sage-git/local/var/tmp/sage/build/cmake-3.8.1/src/Source/cmCommandArgumentParserHelper.cxx -o cmCommandArgumentParserHelper.o
52g++  -I/Users/slabbe/Applications/sage-git/local/var/tmp/sage/build/cmake-3.8.1/src/Bootstrap.cmk -I/Users/slabbe/Applications/sage-git/local/var/tmp/sage/build/cmake-3.8.1/src/Source   -I/Users/slabbe/Applications/sage-git/local/var/tmp/sage/build/cmake-3.8.1/src/Utilities  -c /Users/slabbe/Applications/sage-git/local/var/tmp/sage/build/cmake-3.8.1/src/Source/cmCommandArgumentsHelper.cxx -o cmCommandArgumentsHelper.o
53g++  -I/Users/slabbe/Applications/sage-git/local/var/tmp/sage/build/cmake-3.8.1/src/Bootstrap.cmk -I/Users/slabbe/Applications/sage-git/local/var/tmp/sage/build/cmake-3.8.1/src/Source   -I/Users/slabbe/Applications/sage-git/local/var/tmp/sage/build/cmake-3.8.1/src/Utilities  -c /Users/slabbe/Applications/sage-git/local/var/tmp/sage/build/cmake-3.8.1/src/Source/cmCommands.cxx -o cmCommands.o
54g++  -I/Users/slabbe/Applications/sage-git/local/var/tmp/sage/build/cmake-3.8.1/src/Bootstrap.cmk -I/Users/slabbe/Applications/sage-git/local/var/tmp/sage/build/cmake-3.8.1/src/Source   -I/Users/slabbe/Applications/sage-git/local/var/tmp/sage/build/cmake-3.8.1/src/Utilities  -c /Users/slabbe/Applications/sage-git/local/var/tmp/sage/build/cmake-3.8.1/src/Source/cmCommonTargetGenerator.cxx -o cmCommonTargetGenerator.o
55g++  -I/Users/slabbe/Applications/sage-git/local/var/tmp/sage/build/cmake-3.8.1/src/Bootstrap.cmk -I/Users/slabbe/Applications/sage-git/local/var/tmp/sage/build/cmake-3.8.1/src/Source   -I/Users/slabbe/Applications/sage-git/local/var/tmp/sage/build/cmake-3.8.1/src/Utilities  -c /Users/slabbe/Applications/sage-git/local/var/tmp/sage/build/cmake-3.8.1/src/Source/cmComputeComponentGraph.cxx -o cmComputeComponentGraph.o
56g++  -I/Users/slabbe/Applications/sage-git/local/var/tmp/sage/build/cmake-3.8.1/src/Bootstrap.cmk -I/Users/slabbe/Applications/sage-git/local/var/tmp/sage/build/cmake-3.8.1/src/Source   -I/Users/slabbe/Applications/sage-git/local/var/tmp/sage/build/cmake-3.8.1/src/Utilities  -c /Users/slabbe/Applications/sage-git/local/var/tmp/sage/build/cmake-3.8.1/src/Source/cmComputeLinkDepends.cxx -o cmComputeLinkDepends.o
57g++  -I/Users/slabbe/Applications/sage-git/local/var/tmp/sage/build/cmake-3.8.1/src/Bootstrap.cmk -I/Users/slabbe/Applications/sage-git/local/var/tmp/sage/build/cmake-3.8.1/src/Source   -I/Users/slabbe/Applications/sage-git/local/var/tmp/sage/build/cmake-3.8.1/src/Utilities  -c /Users/slabbe/Applications/sage-git/local/var/tmp/sage/build/cmake-3.8.1/src/Source/cmComputeLinkInformation.cxx -o cmComputeLinkInformation.o
58g++  -I/Users/slabbe/Applications/sage-git/local/var/tmp/sage/build/cmake-3.8.1/src/Bootstrap.cmk -I/Users/slabbe/Applications/sage-git/local/var/tmp/sage/build/cmake-3.8.1/src/Source   -I/Users/slabbe/Applications/sage-git/local/var/tmp/sage/build/cmake-3.8.1/src/Utilities  -c /Users/slabbe/Applications/sage-git/local/var/tmp/sage/build/cmake-3.8.1/src/Source/cmComputeTargetDepends.cxx -o cmComputeTargetDepends.o
59g++  -I/Users/slabbe/Applications/sage-git/local/var/tmp/sage/build/cmake-3.8.1/src/Bootstrap.cmk -I/Users/slabbe/Applications/sage-git/local/var/tmp/sage/build/cmake-3.8.1/src/Source   -I/Users/slabbe/Applications/sage-git/local/var/tmp/sage/build/cmake-3.8.1/src/Utilities  -c /Users/slabbe/Applications/sage-git/local/var/tmp/sage/build/cmake-3.8.1/src/Source/cmConditionEvaluator.cxx -o cmConditionEvaluator.o
60g++  -I/Users/slabbe/Applications/sage-git/local/var/tmp/sage/build/cmake-3.8.1/src/Bootstrap.cmk -I/Users/slabbe/Applications/sage-git/local/var/tmp/sage/build/cmake-3.8.1/src/Source   -I/Users/slabbe/Applications/sage-git/local/var/tmp/sage/build/cmake-3.8.1/src/Utilities  -c /Users/slabbe/Applications/sage-git/local/var/tmp/sage/build/cmake-3.8.1/src/Source/cmConfigureFileCommand.cxx -o cmConfigureFileCommand.o
61g++  -I/Users/slabbe/Applications/sage-git/local/var/tmp/sage/build/cmake-3.8.1/src/Bootstrap.cmk -I/Users/slabbe/Applications/sage-git/local/var/tmp/sage/build/cmake-3.8.1/src/Source   -I/Users/slabbe/Applications/sage-git/local/var/tmp/sage/build/cmake-3.8.1/src/Utilities  -c /Users/slabbe/Applications/sage-git/local/var/tmp/sage/build/cmake-3.8.1/src/Source/cmContinueCommand.cxx -o cmContinueCommand.o
62g++  -I/Users/slabbe/Applications/sage-git/local/var/tmp/sage/build/cmake-3.8.1/src/Bootstrap.cmk -I/Users/slabbe/Applications/sage-git/local/var/tmp/sage/build/cmake-3.8.1/src/Source   -I/Users/slabbe/Applications/sage-git/local/var/tmp/sage/build/cmake-3.8.1/src/Utilities  -c /Users/slabbe/Applications/sage-git/local/var/tmp/sage/build/cmake-3.8.1/src/Source/cmCoreTryCompile.cxx -o cmCoreTryCompile.o
63g++  -I/Users/slabbe/Applications/sage-git/local/var/tmp/sage/build/cmake-3.8.1/src/Bootstrap.cmk -I/Users/slabbe/Applications/sage-git/local/var/tmp/sage/build/cmake-3.8.1/src/Source   -I/Users/slabbe/Applications/sage-git/local/var/tmp/sage/build/cmake-3.8.1/src/Utilities  -c /Users/slabbe/Applications/sage-git/local/var/tmp/sage/build/cmake-3.8.1/src/Source/cmCreateTestSourceList.cxx -o cmCreateTestSourceList.o
64g++  -I/Users/slabbe/Applications/sage-git/local/var/tmp/sage/build/cmake-3.8.1/src/Bootstrap.cmk -I/Users/slabbe/Applications/sage-git/local/var/tmp/sage/build/cmake-3.8.1/src/Source   -I/Users/slabbe/Applications/sage-git/local/var/tmp/sage/build/cmake-3.8.1/src/Utilities  -c /Users/slabbe/Applications/sage-git/local/var/tmp/sage/build/cmake-3.8.1/src/Source/cmCustomCommand.cxx -o cmCustomCommand.o
65g++  -I/Users/slabbe/Applications/sage-git/local/var/tmp/sage/build/cmake-3.8.1/src/Bootstrap.cmk -I/Users/slabbe/Applications/sage-git/local/var/tmp/sage/build/cmake-3.8.1/src/Source   -I/Users/slabbe/Applications/sage-git/local/var/tmp/sage/build/cmake-3.8.1/src/Utilities  -c /Users/slabbe/Applications/sage-git/local/var/tmp/sage/build/cmake-3.8.1/src/Source/cmCustomCommandGenerator.cxx -o cmCustomCommandGenerator.o
66g++  -I/Users/slabbe/Applications/sage-git/local/var/tmp/sage/build/cmake-3.8.1/src/Bootstrap.cmk -I/Users/slabbe/Applications/sage-git/local/var/tmp/sage/build/cmake-3.8.1/src/Source   -I/Users/slabbe/Applications/sage-git/local/var/tmp/sage/build/cmake-3.8.1/src/Utilities  -c /Users/slabbe/Applications/sage-git/local/var/tmp/sage/build/cmake-3.8.1/src/Source/cmDefinePropertyCommand.cxx -o cmDefinePropertyCommand.o
67g++  -I/Users/slabbe/Applications/sage-git/local/var/tmp/sage/build/cmake-3.8.1/src/Bootstrap.cmk -I/Users/slabbe/Applications/sage-git/local/var/tmp/sage/build/cmake-3.8.1/src/Source   -I/Users/slabbe/Applications/sage-git/local/var/tmp/sage/build/cmake-3.8.1/src/Utilities  -c /Users/slabbe/Applications/sage-git/local/var/tmp/sage/build/cmake-3.8.1/src/Source/cmDefinitions.cxx -o cmDefinitions.o
68g++  -I/Users/slabbe/Applications/sage-git/local/var/tmp/sage/build/cmake-3.8.1/src/Bootstrap.cmk -I/Users/slabbe/Applications/sage-git/local/var/tmp/sage/build/cmake-3.8.1/src/Source   -I/Users/slabbe/Applications/sage-git/local/var/tmp/sage/build/cmake-3.8.1/src/Utilities  -c /Users/slabbe/Applications/sage-git/local/var/tmp/sage/build/cmake-3.8.1/src/Source/cmDepends.cxx -o cmDepends.o
69g++  -I/Users/slabbe/Applications/sage-git/local/var/tmp/sage/build/cmake-3.8.1/src/Bootstrap.cmk -I/Users/slabbe/Applications/sage-git/local/var/tmp/sage/build/cmake-3.8.1/src/Source   -I/Users/slabbe/Applications/sage-git/local/var/tmp/sage/build/cmake-3.8.1/src/Utilities  -c /Users/slabbe/Applications/sage-git/local/var/tmp/sage/build/cmake-3.8.1/src/Source/cmDependsC.cxx -o cmDependsC.o
70g++  -I/Users/slabbe/Applications/sage-git/local/var/tmp/sage/build/cmake-3.8.1/src/Bootstrap.cmk -I/Users/slabbe/Applications/sage-git/local/var/tmp/sage/build/cmake-3.8.1/src/Source   -I/Users/slabbe/Applications/sage-git/local/var/tmp/sage/build/cmake-3.8.1/src/Utilities  -c /Users/slabbe/Applications/sage-git/local/var/tmp/sage/build/cmake-3.8.1/src/Source/cmDocumentationFormatter.cxx -o cmDocumentationFormatter.o
71g++  -I/Users/slabbe/Applications/sage-git/local/var/tmp/sage/build/cmake-3.8.1/src/Bootstrap.cmk -I/Users/slabbe/Applications/sage-git/local/var/tmp/sage/build/cmake-3.8.1/src/Source   -I/Users/slabbe/Applications/sage-git/local/var/tmp/sage/build/cmake-3.8.1/src/Utilities  -c /Users/slabbe/Applications/sage-git/local/var/tmp/sage/build/cmake-3.8.1/src/Source/cmEnableLanguageCommand.cxx -o cmEnableLanguageCommand.o
72g++  -I/Users/slabbe/Applications/sage-git/local/var/tmp/sage/build/cmake-3.8.1/src/Bootstrap.cmk -I/Users/slabbe/Applications/sage-git/local/var/tmp/sage/build/cmake-3.8.1/src/Source   -I/Users/slabbe/Applications/sage-git/local/var/tmp/sage/build/cmake-3.8.1/src/Utilities  -c /Users/slabbe/Applications/sage-git/local/var/tmp/sage/build/cmake-3.8.1/src/Source/cmEnableTestingCommand.cxx -o cmEnableTestingCommand.o
73g++  -I/Users/slabbe/Applications/sage-git/local/var/tmp/sage/build/cmake-3.8.1/src/Bootstrap.cmk -I/Users/slabbe/Applications/sage-git/local/var/tmp/sage/build/cmake-3.8.1/src/Source   -I/Users/slabbe/Applications/sage-git/local/var/tmp/sage/build/cmake-3.8.1/src/Utilities  -c /Users/slabbe/Applications/sage-git/local/var/tmp/sage/build/cmake-3.8.1/src/Source/cmExecProgramCommand.cxx -o cmExecProgramCommand.o
74g++  -I/Users/slabbe/Applications/sage-git/local/var/tmp/sage/build/cmake-3.8.1/src/Bootstrap.cmk -I/Users/slabbe/Applications/sage-git/local/var/tmp/sage/build/cmake-3.8.1/src/Source   -I/Users/slabbe/Applications/sage-git/local/var/tmp/sage/build/cmake-3.8.1/src/Utilities  -c /Users/slabbe/Applications/sage-git/local/var/tmp/sage/build/cmake-3.8.1/src/Source/cmExecuteProcessCommand.cxx -o cmExecuteProcessCommand.o
75g++  -I/Users/slabbe/Applications/sage-git/local/var/tmp/sage/build/cmake-3.8.1/src/Bootstrap.cmk -I/Users/slabbe/Applications/sage-git/local/var/tmp/sage/build/cmake-3.8.1/src/Source   -I/Users/slabbe/Applications/sage-git/local/var/tmp/sage/build/cmake-3.8.1/src/Utilities  -c /Users/slabbe/Applications/sage-git/local/var/tmp/sage/build/cmake-3.8.1/src/Source/cmExpandedCommandArgument.cxx -o cmExpandedCommandArgument.o
76g++  -I/Users/slabbe/Applications/sage-git/local/var/tmp/sage/build/cmake-3.8.1/src/Bootstrap.cmk -I/Users/slabbe/Applications/sage-git/local/var/tmp/sage/build/cmake-3.8.1/src/Source   -I/Users/slabbe/Applications/sage-git/local/var/tmp/sage/build/cmake-3.8.1/src/Utilities  -c /Users/slabbe/Applications/sage-git/local/var/tmp/sage/build/cmake-3.8.1/src/Source/cmExportBuildFileGenerator.cxx -o cmExportBuildFileGenerator.o
77g++  -I/Users/slabbe/Applications/sage-git/local/var/tmp/sage/build/cmake-3.8.1/src/Bootstrap.cmk -I/Users/slabbe/Applications/sage-git/local/var/tmp/sage/build/cmake-3.8.1/src/Source   -I/Users/slabbe/Applications/sage-git/local/var/tmp/sage/build/cmake-3.8.1/src/Utilities  -c /Users/slabbe/Applications/sage-git/local/var/tmp/sage/build/cmake-3.8.1/src/Source/cmExportFileGenerator.cxx -o cmExportFileGenerator.o
78g++  -I/Users/slabbe/Applications/sage-git/local/var/tmp/sage/build/cmake-3.8.1/src/Bootstrap.cmk -I/Users/slabbe/Applications/sage-git/local/var/tmp/sage/build/cmake-3.8.1/src/Source   -I/Users/slabbe/Applications/sage-git/local/var/tmp/sage/build/cmake-3.8.1/src/Utilities  -c /Users/slabbe/Applications/sage-git/local/var/tmp/sage/build/cmake-3.8.1/src/Source/cmExportInstallFileGenerator.cxx -o cmExportInstallFileGenerator.o
79g++  -I/Users/slabbe/Applications/sage-git/local/var/tmp/sage/build/cmake-3.8.1/src/Bootstrap.cmk -I/Users/slabbe/Applications/sage-git/local/var/tmp/sage/build/cmake-3.8.1/src/Source   -I/Users/slabbe/Applications/sage-git/local/var/tmp/sage/build/cmake-3.8.1/src/Utilities  -c /Users/slabbe/Applications/sage-git/local/var/tmp/sage/build/cmake-3.8.1/src/Source/cmExportSet.cxx -o cmExportSet.o
80g++  -I/Users/slabbe/Applications/sage-git/local/var/tmp/sage/build/cmake-3.8.1/src/Bootstrap.cmk -I/Users/slabbe/Applications/sage-git/local/var/tmp/sage/build/cmake-3.8.1/src/Source   -I/Users/slabbe/Applications/sage-git/local/var/tmp/sage/build/cmake-3.8.1/src/Utilities  -c /Users/slabbe/Applications/sage-git/local/var/tmp/sage/build/cmake-3.8.1/src/Source/cmExportSetMap.cxx -o cmExportSetMap.o
81g++  -I/Users/slabbe/Applications/sage-git/local/var/tmp/sage/build/cmake-3.8.1/src/Bootstrap.cmk -I/Users/slabbe/Applications/sage-git/local/var/tmp/sage/build/cmake-3.8.1/src/Source   -I/Users/slabbe/Applications/sage-git/local/var/tmp/sage/build/cmake-3.8.1/src/Utilities  -c /Users/slabbe/Applications/sage-git/local/var/tmp/sage/build/cmake-3.8.1/src/Source/cmExportTryCompileFileGenerator.cxx -o cmExportTryCompileFileGenerator.o
82g++  -I/Users/slabbe/Applications/sage-git/local/var/tmp/sage/build/cmake-3.8.1/src/Bootstrap.cmk -I/Users/slabbe/Applications/sage-git/local/var/tmp/sage/build/cmake-3.8.1/src/Source   -I/Users/slabbe/Applications/sage-git/local/var/tmp/sage/build/cmake-3.8.1/src/Utilities  -c /Users/slabbe/Applications/sage-git/local/var/tmp/sage/build/cmake-3.8.1/src/Source/cmExprLexer.cxx -o cmExprLexer.o
83g++  -I/Users/slabbe/Applications/sage-git/local/var/tmp/sage/build/cmake-3.8.1/src/Bootstrap.cmk -I/Users/slabbe/Applications/sage-git/local/var/tmp/sage/build/cmake-3.8.1/src/Source   -I/Users/slabbe/Applications/sage-git/local/var/tmp/sage/build/cmake-3.8.1/src/Utilities  -c /Users/slabbe/Applications/sage-git/local/var/tmp/sage/build/cmake-3.8.1/src/Source/cmExprParser.cxx -o cmExprParser.o
84g++  -I/Users/slabbe/Applications/sage-git/local/var/tmp/sage/build/cmake-3.8.1/src/Bootstrap.cmk -I/Users/slabbe/Applications/sage-git/local/var/tmp/sage/build/cmake-3.8.1/src/Source   -I/Users/slabbe/Applications/sage-git/local/var/tmp/sage/build/cmake-3.8.1/src/Utilities  -c /Users/slabbe/Applications/sage-git/local/var/tmp/sage/build/cmake-3.8.1/src/Source/cmExprParserHelper.cxx -o cmExprParserHelper.o
85g++  -I/Users/slabbe/Applications/sage-git/local/var/tmp/sage/build/cmake-3.8.1/src/Bootstrap.cmk -I/Users/slabbe/Applications/sage-git/local/var/tmp/sage/build/cmake-3.8.1/src/Source   -I/Users/slabbe/Applications/sage-git/local/var/tmp/sage/build/cmake-3.8.1/src/Utilities  -c /Users/slabbe/Applications/sage-git/local/var/tmp/sage/build/cmake-3.8.1/src/Source/cmExternalMakefileProjectGenerator.cxx -o cmExternalMakefileProjectGenerator.o
86g++  -I/Users/slabbe/Applications/sage-git/local/var/tmp/sage/build/cmake-3.8.1/src/Bootstrap.cmk -I/Users/slabbe/Applications/sage-git/local/var/tmp/sage/build/cmake-3.8.1/src/Source   -I/Users/slabbe/Applications/sage-git/local/var/tmp/sage/build/cmake-3.8.1/src/Utilities  -c /Users/slabbe/Applications/sage-git/local/var/tmp/sage/build/cmake-3.8.1/src/Source/cmFileCommand.cxx -o cmFileCommand.o
87g++  -I/Users/slabbe/Applications/sage-git/local/var/tmp/sage/build/cmake-3.8.1/src/Bootstrap.cmk -I/Users/slabbe/Applications/sage-git/local/var/tmp/sage/build/cmake-3.8.1/src/Source   -I/Users/slabbe/Applications/sage-git/local/var/tmp/sage/build/cmake-3.8.1/src/Utilities  -c /Users/slabbe/Applications/sage-git/local/var/tmp/sage/build/cmake-3.8.1/src/Source/cmFileTimeComparison.cxx -o cmFileTimeComparison.o
88g++  -I/Users/slabbe/Applications/sage-git/local/var/tmp/sage/build/cmake-3.8.1/src/Bootstrap.cmk -I/Users/slabbe/Applications/sage-git/local/var/tmp/sage/build/cmake-3.8.1/src/Source   -I/Users/slabbe/Applications/sage-git/local/var/tmp/sage/build/cmake-3.8.1/src/Utilities  -c /Users/slabbe/Applications/sage-git/local/var/tmp/sage/build/cmake-3.8.1/src/Source/cmFindBase.cxx -o cmFindBase.o
89g++  -I/Users/slabbe/Applications/sage-git/local/var/tmp/sage/build/cmake-3.8.1/src/Bootstrap.cmk -I/Users/slabbe/Applications/sage-git/local/var/tmp/sage/build/cmake-3.8.1/src/Source   -I/Users/slabbe/Applications/sage-git/local/var/tmp/sage/build/cmake-3.8.1/src/Utilities  -c /Users/slabbe/Applications/sage-git/local/var/tmp/sage/build/cmake-3.8.1/src/Source/cmFindCommon.cxx -o cmFindCommon.o
90g++  -I/Users/slabbe/Applications/sage-git/local/var/tmp/sage/build/cmake-3.8.1/src/Bootstrap.cmk -I/Users/slabbe/Applications/sage-git/local/var/tmp/sage/build/cmake-3.8.1/src/Source   -I/Users/slabbe/Applications/sage-git/local/var/tmp/sage/build/cmake-3.8.1/src/Utilities  -c /Users/slabbe/Applications/sage-git/local/var/tmp/sage/build/cmake-3.8.1/src/Source/cmFindFileCommand.cxx -o cmFindFileCommand.o
91g++  -I/Users/slabbe/Applications/sage-git/local/var/tmp/sage/build/cmake-3.8.1/src/Bootstrap.cmk -I/Users/slabbe/Applications/sage-git/local/var/tmp/sage/build/cmake-3.8.1/src/Source   -I/Users/slabbe/Applications/sage-git/local/var/tmp/sage/build/cmake-3.8.1/src/Utilities  -c /Users/slabbe/Applications/sage-git/local/var/tmp/sage/build/cmake-3.8.1/src/Source/cmFindLibraryCommand.cxx -o cmFindLibraryCommand.o
92g++  -I/Users/slabbe/Applications/sage-git/local/var/tmp/sage/build/cmake-3.8.1/src/Bootstrap.cmk -I/Users/slabbe/Applications/sage-git/local/var/tmp/sage/build/cmake-3.8.1/src/Source   -I/Users/slabbe/Applications/sage-git/local/var/tmp/sage/build/cmake-3.8.1/src/Utilities  -c /Users/slabbe/Applications/sage-git/local/var/tmp/sage/build/cmake-3.8.1/src/Source/cmFindPackageCommand.cxx -o cmFindPackageCommand.o
93g++  -I/Users/slabbe/Applications/sage-git/local/var/tmp/sage/build/cmake-3.8.1/src/Bootstrap.cmk -I/Users/slabbe/Applications/sage-git/local/var/tmp/sage/build/cmake-3.8.1/src/Source   -I/Users/slabbe/Applications/sage-git/local/var/tmp/sage/build/cmake-3.8.1/src/Utilities  -c /Users/slabbe/Applications/sage-git/local/var/tmp/sage/build/cmake-3.8.1/src/Source/cmFindPathCommand.cxx -o cmFindPathCommand.o
94g++  -I/Users/slabbe/Applications/sage-git/local/var/tmp/sage/build/cmake-3.8.1/src/Bootstrap.cmk -I/Users/slabbe/Applications/sage-git/local/var/tmp/sage/build/cmake-3.8.1/src/Source   -I/Users/slabbe/Applications/sage-git/local/var/tmp/sage/build/cmake-3.8.1/src/Utilities  -c /Users/slabbe/Applications/sage-git/local/var/tmp/sage/build/cmake-3.8.1/src/Source/cmFindProgramCommand.cxx -o cmFindProgramCommand.o
95g++  -I/Users/slabbe/Applications/sage-git/local/var/tmp/sage/build/cmake-3.8.1/src/Bootstrap.cmk -I/Users/slabbe/Applications/sage-git/local/var/tmp/sage/build/cmake-3.8.1/src/Source   -I/Users/slabbe/Applications/sage-git/local/var/tmp/sage/build/cmake-3.8.1/src/Utilities  -c /Users/slabbe/Applications/sage-git/local/var/tmp/sage/build/cmake-3.8.1/src/Source/cmForEachCommand.cxx -o cmForEachCommand.o
96g++  -I/Users/slabbe/Applications/sage-git/local/var/tmp/sage/build/cmake-3.8.1/src/Bootstrap.cmk -I/Users/slabbe/Applications/sage-git/local/var/tmp/sage/build/cmake-3.8.1/src/Source   -I/Users/slabbe/Applications/sage-git/local/var/tmp/sage/build/cmake-3.8.1/src/Utilities  -c /Users/slabbe/Applications/sage-git/local/var/tmp/sage/build/cmake-3.8.1/src/Source/cmFunctionCommand.cxx -o cmFunctionCommand.o
97g++  -I/Users/slabbe/Applications/sage-git/local/var/tmp/sage/build/cmake-3.8.1/src/Bootstrap.cmk -I/Users/slabbe/Applications/sage-git/local/var/tmp/sage/build/cmake-3.8.1/src/Source   -I/Users/slabbe/Applications/sage-git/local/var/tmp/sage/build/cmake-3.8.1/src/Utilities  -c /Users/slabbe/Applications/sage-git/local/var/tmp/sage/build/cmake-3.8.1/src/Source/cmGeneratedFileStream.cxx -o cmGeneratedFileStream.o
98g++  -I/Users/slabbe/Applications/sage-git/local/var/tmp/sage/build/cmake-3.8.1/src/Bootstrap.cmk -I/Users/slabbe/Applications/sage-git/local/var/tmp/sage/build/cmake-3.8.1/src/Source   -I/Users/slabbe/Applications/sage-git/local/var/tmp/sage/build/cmake-3.8.1/src/Utilities  -c /Users/slabbe/Applications/sage-git/local/var/tmp/sage/build/cmake-3.8.1/src/Source/cmGeneratorExpression.cxx -o cmGeneratorExpression.o
99g++  -I/Users/slabbe/Applications/sage-git/local/var/tmp/sage/build/cmake-3.8.1/src/Bootstrap.cmk -I/Users/slabbe/Applications/sage-git/local/var/tmp/sage/build/cmake-3.8.1/src/Source   -I/Users/slabbe/Applications/sage-git/local/var/tmp/sage/build/cmake-3.8.1/src/Utilities  -c /Users/slabbe/Applications/sage-git/local/var/tmp/sage/build/cmake-3.8.1/src/Source/cmGeneratorExpressionContext.cxx -o cmGeneratorExpressionContext.o
100g++  -I/Users/slabbe/Applications/sage-git/local/var/tmp/sage/build/cmake-3.8.1/src/Bootstrap.cmk -I/Users/slabbe/Applications/sage-git/local/var/tmp/sage/build/cmake-3.8.1/src/Source   -I/Users/slabbe/Applications/sage-git/local/var/tmp/sage/build/cmake-3.8.1/src/Utilities  -c /Users/slabbe/Applications/sage-git/local/var/tmp/sage/build/cmake-3.8.1/src/Source/cmGeneratorExpressionDAGChecker.cxx -o cmGeneratorExpressionDAGChecker.o
101g++  -I/Users/slabbe/Applications/sage-git/local/var/tmp/sage/build/cmake-3.8.1/src/Bootstrap.cmk -I/Users/slabbe/Applications/sage-git/local/var/tmp/sage/build/cmake-3.8.1/src/Source   -I/Users/slabbe/Applications/sage-git/local/var/tmp/sage/build/cmake-3.8.1/src/Utilities  -c /Users/slabbe/Applications/sage-git/local/var/tmp/sage/build/cmake-3.8.1/src/Source/cmGeneratorExpressionEvaluationFile.cxx -o cmGeneratorExpressionEvaluationFile.o
102g++  -I/Users/slabbe/Applications/sage-git/local/var/tmp/sage/build/cmake-3.8.1/src/Bootstrap.cmk -I/Users/slabbe/Applications/sage-git/local/var/tmp/sage/build/cmake-3.8.1/src/Source   -I/Users/slabbe/Applications/sage-git/local/var/tmp/sage/build/cmake-3.8.1/src/Utilities  -c /Users/slabbe/Applications/sage-git/local/var/tmp/sage/build/cmake-3.8.1/src/Source/cmGeneratorExpressionEvaluator.cxx -o cmGeneratorExpressionEvaluator.o
103g++  -I/Users/slabbe/Applications/sage-git/local/var/tmp/sage/build/cmake-3.8.1/src/Bootstrap.cmk -I/Users/slabbe/Applications/sage-git/local/var/tmp/sage/build/cmake-3.8.1/src/Source   -I/Users/slabbe/Applications/sage-git/local/var/tmp/sage/build/cmake-3.8.1/src/Utilities  -c /Users/slabbe/Applications/sage-git/local/var/tmp/sage/build/cmake-3.8.1/src/Source/cmGeneratorExpressionLexer.cxx -o cmGeneratorExpressionLexer.o
104g++  -I/Users/slabbe/Applications/sage-git/local/var/tmp/sage/build/cmake-3.8.1/src/Bootstrap.cmk -I/Users/slabbe/Applications/sage-git/local/var/tmp/sage/build/cmake-3.8.1/src/Source   -I/Users/slabbe/Applications/sage-git/local/var/tmp/sage/build/cmake-3.8.1/src/Utilities  -c /Users/slabbe/Applications/sage-git/local/var/tmp/sage/build/cmake-3.8.1/src/Source/cmGeneratorExpressionNode.cxx -o cmGeneratorExpressionNode.o
105g++  -I/Users/slabbe/Applications/sage-git/local/var/tmp/sage/build/cmake-3.8.1/src/Bootstrap.cmk -I/Users/slabbe/Applications/sage-git/local/var/tmp/sage/build/cmake-3.8.1/src/Source   -I/Users/slabbe/Applications/sage-git/local/var/tmp/sage/build/cmake-3.8.1/src/Utilities  -c /Users/slabbe/Applications/sage-git/local/var/tmp/sage/build/cmake-3.8.1/src/Source/cmGeneratorExpressionParser.cxx -o cmGeneratorExpressionParser.o
106g++  -I/Users/slabbe/Applications/sage-git/local/var/tmp/sage/build/cmake-3.8.1/src/Bootstrap.cmk -I/Users/slabbe/Applications/sage-git/local/var/tmp/sage/build/cmake-3.8.1/src/Source   -I/Users/slabbe/Applications/sage-git/local/var/tmp/sage/build/cmake-3.8.1/src/Utilities  -c /Users/slabbe/Applications/sage-git/local/var/tmp/sage/build/cmake-3.8.1/src/Source/cmGeneratorTarget.cxx -o cmGeneratorTarget.o
107g++  -I/Users/slabbe/Applications/sage-git/local/var/tmp/sage/build/cmake-3.8.1/src/Bootstrap.cmk -I/Users/slabbe/Applications/sage-git/local/var/tmp/sage/build/cmake-3.8.1/src/Source   -I/Users/slabbe/Applications/sage-git/local/var/tmp/sage/build/cmake-3.8.1/src/Utilities  -c /Users/slabbe/Applications/sage-git/local/var/tmp/sage/build/cmake-3.8.1/src/Source/cmGetCMakePropertyCommand.cxx -o cmGetCMakePropertyCommand.o
108g++  -I/Users/slabbe/Applications/sage-git/local/var/tmp/sage/build/cmake-3.8.1/src/Bootstrap.cmk -I/Users/slabbe/Applications/sage-git/local/var/tmp/sage/build/cmake-3.8.1/src/Source   -I/Users/slabbe/Applications/sage-git/local/var/tmp/sage/build/cmake-3.8.1/src/Utilities  -c /Users/slabbe/Applications/sage-git/local/var/tmp/sage/build/cmake-3.8.1/src/Source/cmGetDirectoryPropertyCommand.cxx -o cmGetDirectoryPropertyCommand.o
109g++  -I/Users/slabbe/Applications/sage-git/local/var/tmp/sage/build/cmake-3.8.1/src/Bootstrap.cmk -I/Users/slabbe/Applications/sage-git/local/var/tmp/sage/build/cmake-3.8.1/src/Source   -I/Users/slabbe/Applications/sage-git/local/var/tmp/sage/build/cmake-3.8.1/src/Utilities  -c /Users/slabbe/Applications/sage-git/local/var/tmp/sage/build/cmake-3.8.1/src/Source/cmGetFilenameComponentCommand.cxx -o cmGetFilenameComponentCommand.o
110g++  -I/Users/slabbe/Applications/sage-git/local/var/tmp/sage/build/cmake-3.8.1/src/Bootstrap.cmk -I/Users/slabbe/Applications/sage-git/local/var/tmp/sage/build/cmake-3.8.1/src/Source   -I/Users/slabbe/Applications/sage-git/local/var/tmp/sage/build/cmake-3.8.1/src/Utilities  -c /Users/slabbe/Applications/sage-git/local/var/tmp/sage/build/cmake-3.8.1/src/Source/cmGetPropertyCommand.cxx -o cmGetPropertyCommand.o
111g++  -I/Users/slabbe/Applications/sage-git/local/var/tmp/sage/build/cmake-3.8.1/src/Bootstrap.cmk -I/Users/slabbe/Applications/sage-git/local/var/tmp/sage/build/cmake-3.8.1/src/Source   -I/Users/slabbe/Applications/sage-git/local/var/tmp/sage/build/cmake-3.8.1/src/Utilities  -c /Users/slabbe/Applications/sage-git/local/var/tmp/sage/build/cmake-3.8.1/src/Source/cmGetSourceFilePropertyCommand.cxx -o cmGetSourceFilePropertyCommand.o
112g++  -I/Users/slabbe/Applications/sage-git/local/var/tmp/sage/build/cmake-3.8.1/src/Bootstrap.cmk -I/Users/slabbe/Applications/sage-git/local/var/tmp/sage/build/cmake-3.8.1/src/Source   -I/Users/slabbe/Applications/sage-git/local/var/tmp/sage/build/cmake-3.8.1/src/Utilities  -c /Users/slabbe/Applications/sage-git/local/var/tmp/sage/build/cmake-3.8.1/src/Source/cmGetTargetPropertyCommand.cxx -o cmGetTargetPropertyCommand.o
113g++  -I/Users/slabbe/Applications/sage-git/local/var/tmp/sage/build/cmake-3.8.1/src/Bootstrap.cmk -I/Users/slabbe/Applications/sage-git/local/var/tmp/sage/build/cmake-3.8.1/src/Source   -I/Users/slabbe/Applications/sage-git/local/var/tmp/sage/build/cmake-3.8.1/src/Utilities  -c /Users/slabbe/Applications/sage-git/local/var/tmp/sage/build/cmake-3.8.1/src/Source/cmGetTestPropertyCommand.cxx -o cmGetTestPropertyCommand.o
114g++  -I/Users/slabbe/Applications/sage-git/local/var/tmp/sage/build/cmake-3.8.1/src/Bootstrap.cmk -I/Users/slabbe/Applications/sage-git/local/var/tmp/sage/build/cmake-3.8.1/src/Source   -I/Users/slabbe/Applications/sage-git/local/var/tmp/sage/build/cmake-3.8.1/src/Utilities  -c /Users/slabbe/Applications/sage-git/local/var/tmp/sage/build/cmake-3.8.1/src/Source/cmGlobalCommonGenerator.cxx -o cmGlobalCommonGenerator.o
115g++  -I/Users/slabbe/Applications/sage-git/local/var/tmp/sage/build/cmake-3.8.1/src/Bootstrap.cmk -I/Users/slabbe/Applications/sage-git/local/var/tmp/sage/build/cmake-3.8.1/src/Source   -I/Users/slabbe/Applications/sage-git/local/var/tmp/sage/build/cmake-3.8.1/src/Utilities  -c /Users/slabbe/Applications/sage-git/local/var/tmp/sage/build/cmake-3.8.1/src/Source/cmGlobalGenerator.cxx -o cmGlobalGenerator.o
116g++  -I/Users/slabbe/Applications/sage-git/local/var/tmp/sage/build/cmake-3.8.1/src/Bootstrap.cmk -I/Users/slabbe/Applications/sage-git/local/var/tmp/sage/build/cmake-3.8.1/src/Source   -I/Users/slabbe/Applications/sage-git/local/var/tmp/sage/build/cmake-3.8.1/src/Utilities  -c /Users/slabbe/Applications/sage-git/local/var/tmp/sage/build/cmake-3.8.1/src/Source/cmGlobalUnixMakefileGenerator3.cxx -o cmGlobalUnixMakefileGenerator3.o
117g++  -I/Users/slabbe/Applications/sage-git/local/var/tmp/sage/build/cmake-3.8.1/src/Bootstrap.cmk -I/Users/slabbe/Applications/sage-git/local/var/tmp/sage/build/cmake-3.8.1/src/Source   -I/Users/slabbe/Applications/sage-git/local/var/tmp/sage/build/cmake-3.8.1/src/Utilities  -c /Users/slabbe/Applications/sage-git/local/var/tmp/sage/build/cmake-3.8.1/src/Source/cmHexFileConverter.cxx -o cmHexFileConverter.o
118g++  -I/Users/slabbe/Applications/sage-git/local/var/tmp/sage/build/cmake-3.8.1/src/Bootstrap.cmk -I/Users/slabbe/Applications/sage-git/local/var/tmp/sage/build/cmake-3.8.1/src/Source   -I/Users/slabbe/Applications/sage-git/local/var/tmp/sage/build/cmake-3.8.1/src/Utilities  -c /Users/slabbe/Applications/sage-git/local/var/tmp/sage/build/cmake-3.8.1/src/Source/cmIfCommand.cxx -o cmIfCommand.o
119g++  -I/Users/slabbe/Applications/sage-git/local/var/tmp/sage/build/cmake-3.8.1/src/Bootstrap.cmk -I/Users/slabbe/Applications/sage-git/local/var/tmp/sage/build/cmake-3.8.1/src/Source   -I/Users/slabbe/Applications/sage-git/local/var/tmp/sage/build/cmake-3.8.1/src/Utilities  -c /Users/slabbe/Applications/sage-git/local/var/tmp/sage/build/cmake-3.8.1/src/Source/cmIncludeCommand.cxx -o cmIncludeCommand.o
120g++  -I/Users/slabbe/Applications/sage-git/local/var/tmp/sage/build/cmake-3.8.1/src/Bootstrap.cmk -I/Users/slabbe/Applications/sage-git/local/var/tmp/sage/build/cmake-3.8.1/src/Source   -I/Users/slabbe/Applications/sage-git/local/var/tmp/sage/build/cmake-3.8.1/src/Utilities  -c /Users/slabbe/Applications/sage-git/local/var/tmp/sage/build/cmake-3.8.1/src/Source/cmIncludeDirectoryCommand.cxx -o cmIncludeDirectoryCommand.o
121g++  -I/Users/slabbe/Applications/sage-git/local/var/tmp/sage/build/cmake-3.8.1/src/Bootstrap.cmk -I/Users/slabbe/Applications/sage-git/local/var/tmp/sage/build/cmake-3.8.1/src/Source   -I/Users/slabbe/Applications/sage-git/local/var/tmp/sage/build/cmake-3.8.1/src/Utilities  -c /Users/slabbe/Applications/sage-git/local/var/tmp/sage/build/cmake-3.8.1/src/Source/cmIncludeRegularExpressionCommand.cxx -o cmIncludeRegularExpressionCommand.o
122g++  -I/Users/slabbe/Applications/sage-git/local/var/tmp/sage/build/cmake-3.8.1/src/Bootstrap.cmk -I/Users/slabbe/Applications/sage-git/local/var/tmp/sage/build/cmake-3.8.1/src/Source   -I/Users/slabbe/Applications/sage-git/local/var/tmp/sage/build/cmake-3.8.1/src/Utilities  -c /Users/slabbe/Applications/sage-git/local/var/tmp/sage/build/cmake-3.8.1/src/Source/cmInstallCommand.cxx -o cmInstallCommand.o
123g++  -I/Users/slabbe/Applications/sage-git/local/var/tmp/sage/build/cmake-3.8.1/src/Bootstrap.cmk -I/Users/slabbe/Applications/sage-git/local/var/tmp/sage/build/cmake-3.8.1/src/Source   -I/Users/slabbe/Applications/sage-git/local/var/tmp/sage/build/cmake-3.8.1/src/Utilities  -c /Users/slabbe/Applications/sage-git/local/var/tmp/sage/build/cmake-3.8.1/src/Source/cmInstallCommandArguments.cxx -o cmInstallCommandArguments.o
124g++  -I/Users/slabbe/Applications/sage-git/local/var/tmp/sage/build/cmake-3.8.1/src/Bootstrap.cmk -I/Users/slabbe/Applications/sage-git/local/var/tmp/sage/build/cmake-3.8.1/src/Source   -I/Users/slabbe/Applications/sage-git/local/var/tmp/sage/build/cmake-3.8.1/src/Utilities  -c /Users/slabbe/Applications/sage-git/local/var/tmp/sage/build/cmake-3.8.1/src/Source/cmInstallDirectoryGenerator.cxx -o cmInstallDirectoryGenerator.o
125g++  -I/Users/slabbe/Applications/sage-git/local/var/tmp/sage/build/cmake-3.8.1/src/Bootstrap.cmk -I/Users/slabbe/Applications/sage-git/local/var/tmp/sage/build/cmake-3.8.1/src/Source   -I/Users/slabbe/Applications/sage-git/local/var/tmp/sage/build/cmake-3.8.1/src/Utilities  -c /Users/slabbe/Applications/sage-git/local/var/tmp/sage/build/cmake-3.8.1/src/Source/cmInstallExportGenerator.cxx -o cmInstallExportGenerator.o
126g++  -I/Users/slabbe/Applications/sage-git/local/var/tmp/sage/build/cmake-3.8.1/src/Bootstrap.cmk -I/Users/slabbe/Applications/sage-git/local/var/tmp/sage/build/cmake-3.8.1/src/Source   -I/Users/slabbe/Applications/sage-git/local/var/tmp/sage/build/cmake-3.8.1/src/Utilities  -c /Users/slabbe/Applications/sage-git/local/var/tmp/sage/build/cmake-3.8.1/src/Source/cmInstallFilesCommand.cxx -o cmInstallFilesCommand.o
127g++  -I/Users/slabbe/Applications/sage-git/local/var/tmp/sage/build/cmake-3.8.1/src/Bootstrap.cmk -I/Users/slabbe/Applications/sage-git/local/var/tmp/sage/build/cmake-3.8.1/src/Source   -I/Users/slabbe/Applications/sage-git/local/var/tmp/sage/build/cmake-3.8.1/src/Utilities  -c /Users/slabbe/Applications/sage-git/local/var/tmp/sage/build/cmake-3.8.1/src/Source/cmInstallFilesGenerator.cxx -o cmInstallFilesGenerator.o
128g++  -I/Users/slabbe/Applications/sage-git/local/var/tmp/sage/build/cmake-3.8.1/src/Bootstrap.cmk -I/Users/slabbe/Applications/sage-git/local/var/tmp/sage/build/cmake-3.8.1/src/Source   -I/Users/slabbe/Applications/sage-git/local/var/tmp/sage/build/cmake-3.8.1/src/Utilities  -c /Users/slabbe/Applications/sage-git/local/var/tmp/sage/build/cmake-3.8.1/src/Source/cmInstallGenerator.cxx -o cmInstallGenerator.o
129g++  -I/Users/slabbe/Applications/sage-git/local/var/tmp/sage/build/cmake-3.8.1/src/Bootstrap.cmk -I/Users/slabbe/Applications/sage-git/local/var/tmp/sage/build/cmake-3.8.1/src/Source   -I/Users/slabbe/Applications/sage-git/local/var/tmp/sage/build/cmake-3.8.1/src/Utilities  -c /Users/slabbe/Applications/sage-git/local/var/tmp/sage/build/cmake-3.8.1/src/Source/cmInstallScriptGenerator.cxx -o cmInstallScriptGenerator.o
130g++  -I/Users/slabbe/Applications/sage-git/local/var/tmp/sage/build/cmake-3.8.1/src/Bootstrap.cmk -I/Users/slabbe/Applications/sage-git/local/var/tmp/sage/build/cmake-3.8.1/src/Source   -I/Users/slabbe/Applications/sage-git/local/var/tmp/sage/build/cmake-3.8.1/src/Utilities  -c /Users/slabbe/Applications/sage-git/local/var/tmp/sage/build/cmake-3.8.1/src/Source/cmInstallTargetGenerator.cxx -o cmInstallTargetGenerator.o
131g++  -I/Users/slabbe/Applications/sage-git/local/var/tmp/sage/build/cmake-3.8.1/src/Bootstrap.cmk -I/Users/slabbe/Applications/sage-git/local/var/tmp/sage/build/cmake-3.8.1/src/Source   -I/Users/slabbe/Applications/sage-git/local/var/tmp/sage/build/cmake-3.8.1/src/Utilities  -c /Users/slabbe/Applications/sage-git/local/var/tmp/sage/build/cmake-3.8.1/src/Source/cmInstallTargetsCommand.cxx -o cmInstallTargetsCommand.o
132g++  -I/Users/slabbe/Applications/sage-git/local/var/tmp/sage/build/cmake-3.8.1/src/Bootstrap.cmk -I/Users/slabbe/Applications/sage-git/local/var/tmp/sage/build/cmake-3.8.1/src/Source   -I/Users/slabbe/Applications/sage-git/local/var/tmp/sage/build/cmake-3.8.1/src/Utilities  -c /Users/slabbe/Applications/sage-git/local/var/tmp/sage/build/cmake-3.8.1/src/Source/cmInstalledFile.cxx -o cmInstalledFile.o
133g++  -I/Users/slabbe/Applications/sage-git/local/var/tmp/sage/build/cmake-3.8.1/src/Bootstrap.cmk -I/Users/slabbe/Applications/sage-git/local/var/tmp/sage/build/cmake-3.8.1/src/Source   -I/Users/slabbe/Applications/sage-git/local/var/tmp/sage/build/cmake-3.8.1/src/Utilities  -c /Users/slabbe/Applications/sage-git/local/var/tmp/sage/build/cmake-3.8.1/src/Source/cmLinkDirectoriesCommand.cxx -o cmLinkDirectoriesCommand.o
134g++  -I/Users/slabbe/Applications/sage-git/local/var/tmp/sage/build/cmake-3.8.1/src/Bootstrap.cmk -I/Users/slabbe/Applications/sage-git/local/var/tmp/sage/build/cmake-3.8.1/src/Source   -I/Users/slabbe/Applications/sage-git/local/var/tmp/sage/build/cmake-3.8.1/src/Utilities  -c /Users/slabbe/Applications/sage-git/local/var/tmp/sage/build/cmake-3.8.1/src/Source/cmLinkLineComputer.cxx -o cmLinkLineComputer.o
135g++  -I/Users/slabbe/Applications/sage-git/local/var/tmp/sage/build/cmake-3.8.1/src/Bootstrap.cmk -I/Users/slabbe/Applications/sage-git/local/var/tmp/sage/build/cmake-3.8.1/src/Source   -I/Users/slabbe/Applications/sage-git/local/var/tmp/sage/build/cmake-3.8.1/src/Utilities  -c /Users/slabbe/Applications/sage-git/local/var/tmp/sage/build/cmake-3.8.1/src/Source/cmListCommand.cxx -o cmListCommand.o
136g++  -I/Users/slabbe/Applications/sage-git/local/var/tmp/sage/build/cmake-3.8.1/src/Bootstrap.cmk -I/Users/slabbe/Applications/sage-git/local/var/tmp/sage/build/cmake-3.8.1/src/Source   -I/Users/slabbe/Applications/sage-git/local/var/tmp/sage/build/cmake-3.8.1/src/Utilities  -c /Users/slabbe/Applications/sage-git/local/var/tmp/sage/build/cmake-3.8.1/src/Source/cmListFileCache.cxx -o cmListFileCache.o
137g++  -I/Users/slabbe/Applications/sage-git/local/var/tmp/sage/build/cmake-3.8.1/src/Bootstrap.cmk -I/Users/slabbe/Applications/sage-git/local/var/tmp/sage/build/cmake-3.8.1/src/Source   -I/Users/slabbe/Applications/sage-git/local/var/tmp/sage/build/cmake-3.8.1/src/Utilities  -c /Users/slabbe/Applications/sage-git/local/var/tmp/sage/build/cmake-3.8.1/src/Source/cmLocalCommonGenerator.cxx -o cmLocalCommonGenerator.o
138g++  -I/Users/slabbe/Applications/sage-git/local/var/tmp/sage/build/cmake-3.8.1/src/Bootstrap.cmk -I/Users/slabbe/Applications/sage-git/local/var/tmp/sage/build/cmake-3.8.1/src/Source   -I/Users/slabbe/Applications/sage-git/local/var/tmp/sage/build/cmake-3.8.1/src/Utilities  -c /Users/slabbe/Applications/sage-git/local/var/tmp/sage/build/cmake-3.8.1/src/Source/cmLocalGenerator.cxx -o cmLocalGenerator.o
139g++  -I/Users/slabbe/Applications/sage-git/local/var/tmp/sage/build/cmake-3.8.1/src/Bootstrap.cmk -I/Users/slabbe/Applications/sage-git/local/var/tmp/sage/build/cmake-3.8.1/src/Source   -I/Users/slabbe/Applications/sage-git/local/var/tmp/sage/build/cmake-3.8.1/src/Utilities  -c /Users/slabbe/Applications/sage-git/local/var/tmp/sage/build/cmake-3.8.1/src/Source/cmLocalUnixMakefileGenerator3.cxx -o cmLocalUnixMakefileGenerator3.o
140g++  -I/Users/slabbe/Applications/sage-git/local/var/tmp/sage/build/cmake-3.8.1/src/Bootstrap.cmk -I/Users/slabbe/Applications/sage-git/local/var/tmp/sage/build/cmake-3.8.1/src/Source   -I/Users/slabbe/Applications/sage-git/local/var/tmp/sage/build/cmake-3.8.1/src/Utilities  -c /Users/slabbe/Applications/sage-git/local/var/tmp/sage/build/cmake-3.8.1/src/Source/cmMSVC60LinkLineComputer.cxx -o cmMSVC60LinkLineComputer.o
141g++  -I/Users/slabbe/Applications/sage-git/local/var/tmp/sage/build/cmake-3.8.1/src/Bootstrap.cmk -I/Users/slabbe/Applications/sage-git/local/var/tmp/sage/build/cmake-3.8.1/src/Source   -I/Users/slabbe/Applications/sage-git/local/var/tmp/sage/build/cmake-3.8.1/src/Utilities  -c /Users/slabbe/Applications/sage-git/local/var/tmp/sage/build/cmake-3.8.1/src/Source/cmMacroCommand.cxx -o cmMacroCommand.o
142g++  -I/Users/slabbe/Applications/sage-git/local/var/tmp/sage/build/cmake-3.8.1/src/Bootstrap.cmk -I/Users/slabbe/Applications/sage-git/local/var/tmp/sage/build/cmake-3.8.1/src/Source   -I/Users/slabbe/Applications/sage-git/local/var/tmp/sage/build/cmake-3.8.1/src/Utilities  -c /Users/slabbe/Applications/sage-git/local/var/tmp/sage/build/cmake-3.8.1/src/Source/cmMakeDirectoryCommand.cxx -o cmMakeDirectoryCommand.o
143g++  -I/Users/slabbe/Applications/sage-git/local/var/tmp/sage/build/cmake-3.8.1/src/Bootstrap.cmk -I/Users/slabbe/Applications/sage-git/local/var/tmp/sage/build/cmake-3.8.1/src/Source   -I/Users/slabbe/Applications/sage-git/local/var/tmp/sage/build/cmake-3.8.1/src/Utilities  -c /Users/slabbe/Applications/sage-git/local/var/tmp/sage/build/cmake-3.8.1/src/Source/cmMakefile.cxx -o cmMakefile.o
144g++  -I/Users/slabbe/Applications/sage-git/local/var/tmp/sage/build/cmake-3.8.1/src/Bootstrap.cmk -I/Users/slabbe/Applications/sage-git/local/var/tmp/sage/build/cmake-3.8.1/src/Source   -I/Users/slabbe/Applications/sage-git/local/var/tmp/sage/build/cmake-3.8.1/src/Utilities  -c /Users/slabbe/Applications/sage-git/local/var/tmp/sage/build/cmake-3.8.1/src/Source/cmMakefileExecutableTargetGenerator.cxx -o cmMakefileExecutableTargetGenerator.o
145g++  -I/Users/slabbe/Applications/sage-git/local/var/tmp/sage/build/cmake-3.8.1/src/Bootstrap.cmk -I/Users/slabbe/Applications/sage-git/local/var/tmp/sage/build/cmake-3.8.1/src/Source   -I/Users/slabbe/Applications/sage-git/local/var/tmp/sage/build/cmake-3.8.1/src/Utilities  -c /Users/slabbe/Applications/sage-git/local/var/tmp/sage/build/cmake-3.8.1/src/Source/cmMakefileLibraryTargetGenerator.cxx -o cmMakefileLibraryTargetGenerator.o
146g++  -I/Users/slabbe/Applications/sage-git/local/var/tmp/sage/build/cmake-3.8.1/src/Bootstrap.cmk -I/Users/slabbe/Applications/sage-git/local/var/tmp/sage/build/cmake-3.8.1/src/Source   -I/Users/slabbe/Applications/sage-git/local/var/tmp/sage/build/cmake-3.8.1/src/Utilities  -c /Users/slabbe/Applications/sage-git/local/var/tmp/sage/build/cmake-3.8.1/src/Source/cmMakefileTargetGenerator.cxx -o cmMakefileTargetGenerator.o
147g++  -I/Users/slabbe/Applications/sage-git/local/var/tmp/sage/build/cmake-3.8.1/src/Bootstrap.cmk -I/Users/slabbe/Applications/sage-git/local/var/tmp/sage/build/cmake-3.8.1/src/Source   -I/Users/slabbe/Applications/sage-git/local/var/tmp/sage/build/cmake-3.8.1/src/Utilities  -c /Users/slabbe/Applications/sage-git/local/var/tmp/sage/build/cmake-3.8.1/src/Source/cmMakefileUtilityTargetGenerator.cxx -o cmMakefileUtilityTargetGenerator.o
148g++  -I/Users/slabbe/Applications/sage-git/local/var/tmp/sage/build/cmake-3.8.1/src/Bootstrap.cmk -I/Users/slabbe/Applications/sage-git/local/var/tmp/sage/build/cmake-3.8.1/src/Source   -I/Users/slabbe/Applications/sage-git/local/var/tmp/sage/build/cmake-3.8.1/src/Utilities  -c /Users/slabbe/Applications/sage-git/local/var/tmp/sage/build/cmake-3.8.1/src/Source/cmMarkAsAdvancedCommand.cxx -o cmMarkAsAdvancedCommand.o
149g++  -I/Users/slabbe/Applications/sage-git/local/var/tmp/sage/build/cmake-3.8.1/src/Bootstrap.cmk -I/Users/slabbe/Applications/sage-git/local/var/tmp/sage/build/cmake-3.8.1/src/Source   -I/Users/slabbe/Applications/sage-git/local/var/tmp/sage/build/cmake-3.8.1/src/Utilities  -c /Users/slabbe/Applications/sage-git/local/var/tmp/sage/build/cmake-3.8.1/src/Source/cmMathCommand.cxx -o cmMathCommand.o
150g++  -I/Users/slabbe/Applications/sage-git/local/var/tmp/sage/build/cmake-3.8.1/src/Bootstrap.cmk -I/Users/slabbe/Applications/sage-git/local/var/tmp/sage/build/cmake-3.8.1/src/Source   -I/Users/slabbe/Applications/sage-git/local/var/tmp/sage/build/cmake-3.8.1/src/Utilities  -c /Users/slabbe/Applications/sage-git/local/var/tmp/sage/build/cmake-3.8.1/src/Source/cmMessageCommand.cxx -o cmMessageCommand.o
151g++  -I/Users/slabbe/Applications/sage-git/local/var/tmp/sage/build/cmake-3.8.1/src/Bootstrap.cmk -I/Users/slabbe/Applications/sage-git/local/var/tmp/sage/build/cmake-3.8.1/src/Source   -I/Users/slabbe/Applications/sage-git/local/var/tmp/sage/build/cmake-3.8.1/src/Utilities  -c /Users/slabbe/Applications/sage-git/local/var/tmp/sage/build/cmake-3.8.1/src/Source/cmMessenger.cxx -o cmMessenger.o
152g++  -I/Users/slabbe/Applications/sage-git/local/var/tmp/sage/build/cmake-3.8.1/src/Bootstrap.cmk -I/Users/slabbe/Applications/sage-git/local/var/tmp/sage/build/cmake-3.8.1/src/Source   -I/Users/slabbe/Applications/sage-git/local/var/tmp/sage/build/cmake-3.8.1/src/Utilities  -c /Users/slabbe/Applications/sage-git/local/var/tmp/sage/build/cmake-3.8.1/src/Source/cmNewLineStyle.cxx -o cmNewLineStyle.o
153g++  -I/Users/slabbe/Applications/sage-git/local/var/tmp/sage/build/cmake-3.8.1/src/Bootstrap.cmk -I/Users/slabbe/Applications/sage-git/local/var/tmp/sage/build/cmake-3.8.1/src/Source   -I/Users/slabbe/Applications/sage-git/local/var/tmp/sage/build/cmake-3.8.1/src/Utilities  -c /Users/slabbe/Applications/sage-git/local/var/tmp/sage/build/cmake-3.8.1/src/Source/cmOSXBundleGenerator.cxx -o cmOSXBundleGenerator.o
154g++  -I/Users/slabbe/Applications/sage-git/local/var/tmp/sage/build/cmake-3.8.1/src/Bootstrap.cmk -I/Users/slabbe/Applications/sage-git/local/var/tmp/sage/build/cmake-3.8.1/src/Source   -I/Users/slabbe/Applications/sage-git/local/var/tmp/sage/build/cmake-3.8.1/src/Utilities  -c /Users/slabbe/Applications/sage-git/local/var/tmp/sage/build/cmake-3.8.1/src/Source/cmOptionCommand.cxx -o cmOptionCommand.o
155g++  -I/Users/slabbe/Applications/sage-git/local/var/tmp/sage/build/cmake-3.8.1/src/Bootstrap.cmk -I/Users/slabbe/Applications/sage-git/local/var/tmp/sage/build/cmake-3.8.1/src/Source   -I/Users/slabbe/Applications/sage-git/local/var/tmp/sage/build/cmake-3.8.1/src/Utilities  -c /Users/slabbe/Applications/sage-git/local/var/tmp/sage/build/cmake-3.8.1/src/Source/cmOrderDirectories.cxx -o cmOrderDirectories.o
156g++  -I/Users/slabbe/Applications/sage-git/local/var/tmp/sage/build/cmake-3.8.1/src/Bootstrap.cmk -I/Users/slabbe/Applications/sage-git/local/var/tmp/sage/build/cmake-3.8.1/src/Source   -I/Users/slabbe/Applications/sage-git/local/var/tmp/sage/build/cmake-3.8.1/src/Utilities  -c /Users/slabbe/Applications/sage-git/local/var/tmp/sage/build/cmake-3.8.1/src/Source/cmOutputConverter.cxx -o cmOutputConverter.o
157g++  -I/Users/slabbe/Applications/sage-git/local/var/tmp/sage/build/cmake-3.8.1/src/Bootstrap.cmk -I/Users/slabbe/Applications/sage-git/local/var/tmp/sage/build/cmake-3.8.1/src/Source   -I/Users/slabbe/Applications/sage-git/local/var/tmp/sage/build/cmake-3.8.1/src/Utilities  -c /Users/slabbe/Applications/sage-git/local/var/tmp/sage/build/cmake-3.8.1/src/Source/cmParseArgumentsCommand.cxx -o cmParseArgumentsCommand.o
158g++  -I/Users/slabbe/Applications/sage-git/local/var/tmp/sage/build/cmake-3.8.1/src/Bootstrap.cmk -I/Users/slabbe/Applications/sage-git/local/var/tmp/sage/build/cmake-3.8.1/src/Source   -I/Users/slabbe/Applications/sage-git/local/var/tmp/sage/build/cmake-3.8.1/src/Utilities  -c /Users/slabbe/Applications/sage-git/local/var/tmp/sage/build/cmake-3.8.1/src/Source/cmPathLabel.cxx -o cmPathLabel.o
159g++  -I/Users/slabbe/Applications/sage-git/local/var/tmp/sage/build/cmake-3.8.1/src/Bootstrap.cmk -I/Users/slabbe/Applications/sage-git/local/var/tmp/sage/build/cmake-3.8.1/src/Source   -I/Users/slabbe/Applications/sage-git/local/var/tmp/sage/build/cmake-3.8.1/src/Utilities  -c /Users/slabbe/Applications/sage-git/local/var/tmp/sage/build/cmake-3.8.1/src/Source/cmPolicies.cxx -o cmPolicies.o
160g++  -I/Users/slabbe/Applications/sage-git/local/var/tmp/sage/build/cmake-3.8.1/src/Bootstrap.cmk -I/Users/slabbe/Applications/sage-git/local/var/tmp/sage/build/cmake-3.8.1/src/Source   -I/Users/slabbe/Applications/sage-git/local/var/tmp/sage/build/cmake-3.8.1/src/Utilities  -c /Users/slabbe/Applications/sage-git/local/var/tmp/sage/build/cmake-3.8.1/src/Source/cmProcessOutput.cxx -o cmProcessOutput.o
161g++  -I/Users/slabbe/Applications/sage-git/local/var/tmp/sage/build/cmake-3.8.1/src/Bootstrap.cmk -I/Users/slabbe/Applications/sage-git/local/var/tmp/sage/build/cmake-3.8.1/src/Source   -I/Users/slabbe/Applications/sage-git/local/var/tmp/sage/build/cmake-3.8.1/src/Utilities  -c /Users/slabbe/Applications/sage-git/local/var/tmp/sage/build/cmake-3.8.1/src/Source/cmProjectCommand.cxx -o cmProjectCommand.o
162g++  -I/Users/slabbe/Applications/sage-git/local/var/tmp/sage/build/cmake-3.8.1/src/Bootstrap.cmk -I/Users/slabbe/Applications/sage-git/local/var/tmp/sage/build/cmake-3.8.1/src/Source   -I/Users/slabbe/Applications/sage-git/local/var/tmp/sage/build/cmake-3.8.1/src/Utilities  -c /Users/slabbe/Applications/sage-git/local/var/tmp/sage/build/cmake-3.8.1/src/Source/cmProperty.cxx -o cmProperty.o
163g++  -I/Users/slabbe/Applications/sage-git/local/var/tmp/sage/build/cmake-3.8.1/src/Bootstrap.cmk -I/Users/slabbe/Applications/sage-git/local/var/tmp/sage/build/cmake-3.8.1/src/Source   -I/Users/slabbe/Applications/sage-git/local/var/tmp/sage/build/cmake-3.8.1/src/Utilities  -c /Users/slabbe/Applications/sage-git/local/var/tmp/sage/build/cmake-3.8.1/src/Source/cmPropertyDefinition.cxx -o cmPropertyDefinition.o
164g++  -I/Users/slabbe/Applications/sage-git/local/var/tmp/sage/build/cmake-3.8.1/src/Bootstrap.cmk -I/Users/slabbe/Applications/sage-git/local/var/tmp/sage/build/cmake-3.8.1/src/Source   -I/Users/slabbe/Applications/sage-git/local/var/tmp/sage/build/cmake-3.8.1/src/Utilities  -c /Users/slabbe/Applications/sage-git/local/var/tmp/sage/build/cmake-3.8.1/src/Source/cmPropertyDefinitionMap.cxx -o cmPropertyDefinitionMap.o
165g++  -I/Users/slabbe/Applications/sage-git/local/var/tmp/sage/build/cmake-3.8.1/src/Bootstrap.cmk -I/Users/slabbe/Applications/sage-git/local/var/tmp/sage/build/cmake-3.8.1/src/Source   -I/Users/slabbe/Applications/sage-git/local/var/tmp/sage/build/cmake-3.8.1/src/Utilities  -c /Users/slabbe/Applications/sage-git/local/var/tmp/sage/build/cmake-3.8.1/src/Source/cmPropertyMap.cxx -o cmPropertyMap.o
166g++  -I/Users/slabbe/Applications/sage-git/local/var/tmp/sage/build/cmake-3.8.1/src/Bootstrap.cmk -I/Users/slabbe/Applications/sage-git/local/var/tmp/sage/build/cmake-3.8.1/src/Source   -I/Users/slabbe/Applications/sage-git/local/var/tmp/sage/build/cmake-3.8.1/src/Utilities  -c /Users/slabbe/Applications/sage-git/local/var/tmp/sage/build/cmake-3.8.1/src/Source/cmReturnCommand.cxx -o cmReturnCommand.o
167g++  -I/Users/slabbe/Applications/sage-git/local/var/tmp/sage/build/cmake-3.8.1/src/Bootstrap.cmk -I/Users/slabbe/Applications/sage-git/local/var/tmp/sage/build/cmake-3.8.1/src/Source   -I/Users/slabbe/Applications/sage-git/local/var/tmp/sage/build/cmake-3.8.1/src/Utilities  -c /Users/slabbe/Applications/sage-git/local/var/tmp/sage/build/cmake-3.8.1/src/Source/cmRulePlaceholderExpander.cxx -o cmRulePlaceholderExpander.o
168g++  -I/Users/slabbe/Applications/sage-git/local/var/tmp/sage/build/cmake-3.8.1/src/Bootstrap.cmk -I/Users/slabbe/Applications/sage-git/local/var/tmp/sage/build/cmake-3.8.1/src/Source   -I/Users/slabbe/Applications/sage-git/local/var/tmp/sage/build/cmake-3.8.1/src/Utilities  -c /Users/slabbe/Applications/sage-git/local/var/tmp/sage/build/cmake-3.8.1/src/Source/cmScriptGenerator.cxx -o cmScriptGenerator.o
169g++  -I/Users/slabbe/Applications/sage-git/local/var/tmp/sage/build/cmake-3.8.1/src/Bootstrap.cmk -I/Users/slabbe/Applications/sage-git/local/var/tmp/sage/build/cmake-3.8.1/src/Source   -I/Users/slabbe/Applications/sage-git/local/var/tmp/sage/build/cmake-3.8.1/src/Utilities  -c /Users/slabbe/Applications/sage-git/local/var/tmp/sage/build/cmake-3.8.1/src/Source/cmSearchPath.cxx -o cmSearchPath.o
170g++  -I/Users/slabbe/Applications/sage-git/local/var/tmp/sage/build/cmake-3.8.1/src/Bootstrap.cmk -I/Users/slabbe/Applications/sage-git/local/var/tmp/sage/build/cmake-3.8.1/src/Source   -I/Users/slabbe/Applications/sage-git/local/var/tmp/sage/build/cmake-3.8.1/src/Utilities  -c /Users/slabbe/Applications/sage-git/local/var/tmp/sage/build/cmake-3.8.1/src/Source/cmSeparateArgumentsCommand.cxx -o cmSeparateArgumentsCommand.o
171g++  -I/Users/slabbe/Applications/sage-git/local/var/tmp/sage/build/cmake-3.8.1/src/Bootstrap.cmk -I/Users/slabbe/Applications/sage-git/local/var/tmp/sage/build/cmake-3.8.1/src/Source   -I/Users/slabbe/Applications/sage-git/local/var/tmp/sage/build/cmake-3.8.1/src/Utilities  -c /Users/slabbe/Applications/sage-git/local/var/tmp/sage/build/cmake-3.8.1/src/Source/cmSetCommand.cxx -o cmSetCommand.o
172g++  -I/Users/slabbe/Applications/sage-git/local/var/tmp/sage/build/cmake-3.8.1/src/Bootstrap.cmk -I/Users/slabbe/Applications/sage-git/local/var/tmp/sage/build/cmake-3.8.1/src/Source   -I/Users/slabbe/Applications/sage-git/local/var/tmp/sage/build/cmake-3.8.1/src/Utilities  -c /Users/slabbe/Applications/sage-git/local/var/tmp/sage/build/cmake-3.8.1/src/Source/cmSetDirectoryPropertiesCommand.cxx -o cmSetDirectoryPropertiesCommand.o
173g++  -I/Users/slabbe/Applications/sage-git/local/var/tmp/sage/build/cmake-3.8.1/src/Bootstrap.cmk -I/Users/slabbe/Applications/sage-git/local/var/tmp/sage/build/cmake-3.8.1/src/Source   -I/Users/slabbe/Applications/sage-git/local/var/tmp/sage/build/cmake-3.8.1/src/Utilities  -c /Users/slabbe/Applications/sage-git/local/var/tmp/sage/build/cmake-3.8.1/src/Source/cmSetPropertyCommand.cxx -o cmSetPropertyCommand.o
174g++  -I/Users/slabbe/Applications/sage-git/local/var/tmp/sage/build/cmake-3.8.1/src/Bootstrap.cmk -I/Users/slabbe/Applications/sage-git/local/var/tmp/sage/build/cmake-3.8.1/src/Source   -I/Users/slabbe/Applications/sage-git/local/var/tmp/sage/build/cmake-3.8.1/src/Utilities  -c /Users/slabbe/Applications/sage-git/local/var/tmp/sage/build/cmake-3.8.1/src/Source/cmSetSourceFilesPropertiesCommand.cxx -o cmSetSourceFilesPropertiesCommand.o
175g++  -I/Users/slabbe/Applications/sage-git/local/var/tmp/sage/build/cmake-3.8.1/src/Bootstrap.cmk -I/Users/slabbe/Applications/sage-git/local/var/tmp/sage/build/cmake-3.8.1/src/Source   -I/Users/slabbe/Applications/sage-git/local/var/tmp/sage/build/cmake-3.8.1/src/Utilities  -c /Users/slabbe/Applications/sage-git/local/var/tmp/sage/build/cmake-3.8.1/src/Source/cmSetTargetPropertiesCommand.cxx -o cmSetTargetPropertiesCommand.o
176g++  -I/Users/slabbe/Applications/sage-git/local/var/tmp/sage/build/cmake-3.8.1/src/Bootstrap.cmk -I/Users/slabbe/Applications/sage-git/local/var/tmp/sage/build/cmake-3.8.1/src/Source   -I/Users/slabbe/Applications/sage-git/local/var/tmp/sage/build/cmake-3.8.1/src/Utilities  -c /Users/slabbe/Applications/sage-git/local/var/tmp/sage/build/cmake-3.8.1/src/Source/cmSetTestsPropertiesCommand.cxx -o cmSetTestsPropertiesCommand.o
177g++  -I/Users/slabbe/Applications/sage-git/local/var/tmp/sage/build/cmake-3.8.1/src/Bootstrap.cmk -I/Users/slabbe/Applications/sage-git/local/var/tmp/sage/build/cmake-3.8.1/src/Source   -I/Users/slabbe/Applications/sage-git/local/var/tmp/sage/build/cmake-3.8.1/src/Utilities  -c /Users/slabbe/Applications/sage-git/local/var/tmp/sage/build/cmake-3.8.1/src/Source/cmSiteNameCommand.cxx -o cmSiteNameCommand.o
178g++  -I/Users/slabbe/Applications/sage-git/local/var/tmp/sage/build/cmake-3.8.1/src/Bootstrap.cmk -I/Users/slabbe/Applications/sage-git/local/var/tmp/sage/build/cmake-3.8.1/src/Source   -I/Users/slabbe/Applications/sage-git/local/var/tmp/sage/build/cmake-3.8.1/src/Utilities  -c /Users/slabbe/Applications/sage-git/local/var/tmp/sage/build/cmake-3.8.1/src/Source/cmSourceFile.cxx -o cmSourceFile.o
179g++  -I/Users/slabbe/Applications/sage-git/local/var/tmp/sage/build/cmake-3.8.1/src/Bootstrap.cmk -I/Users/slabbe/Applications/sage-git/local/var/tmp/sage/build/cmake-3.8.1/src/Source   -I/Users/slabbe/Applications/sage-git/local/var/tmp/sage/build/cmake-3.8.1/src/Utilities  -c /Users/slabbe/Applications/sage-git/local/var/tmp/sage/build/cmake-3.8.1/src/Source/cmSourceFileLocation.cxx -o cmSourceFileLocation.o
180g++  -I/Users/slabbe/Applications/sage-git/local/var/tmp/sage/build/cmake-3.8.1/src/Bootstrap.cmk -I/Users/slabbe/Applications/sage-git/local/var/tmp/sage/build/cmake-3.8.1/src/Source   -I/Users/slabbe/Applications/sage-git/local/var/tmp/sage/build/cmake-3.8.1/src/Utilities  -c /Users/slabbe/Applications/sage-git/local/var/tmp/sage/build/cmake-3.8.1/src/Source/cmState.cxx -o cmState.o
181g++  -I/Users/slabbe/Applications/sage-git/local/var/tmp/sage/build/cmake-3.8.1/src/Bootstrap.cmk -I/Users/slabbe/Applications/sage-git/local/var/tmp/sage/build/cmake-3.8.1/src/Source   -I/Users/slabbe/Applications/sage-git/local/var/tmp/sage/build/cmake-3.8.1/src/Utilities  -c /Users/slabbe/Applications/sage-git/local/var/tmp/sage/build/cmake-3.8.1/src/Source/cmStateDirectory.cxx -o cmStateDirectory.o
182g++  -I/Users/slabbe/Applications/sage-git/local/var/tmp/sage/build/cmake-3.8.1/src/Bootstrap.cmk -I/Users/slabbe/Applications/sage-git/local/var/tmp/sage/build/cmake-3.8.1/src/Source   -I/Users/slabbe/Applications/sage-git/local/var/tmp/sage/build/cmake-3.8.1/src/Utilities  -c /Users/slabbe/Applications/sage-git/local/var/tmp/sage/build/cmake-3.8.1/src/Source/cmStateSnapshot.cxx -o cmStateSnapshot.o
183g++  -I/Users/slabbe/Applications/sage-git/local/var/tmp/sage/build/cmake-3.8.1/src/Bootstrap.cmk -I/Users/slabbe/Applications/sage-git/local/var/tmp/sage/build/cmake-3.8.1/src/Source   -I/Users/slabbe/Applications/sage-git/local/var/tmp/sage/build/cmake-3.8.1/src/Utilities  -c /Users/slabbe/Applications/sage-git/local/var/tmp/sage/build/cmake-3.8.1/src/Source/cmStringCommand.cxx -o cmStringCommand.o
184g++  -I/Users/slabbe/Applications/sage-git/local/var/tmp/sage/build/cmake-3.8.1/src/Bootstrap.cmk -I/Users/slabbe/Applications/sage-git/local/var/tmp/sage/build/cmake-3.8.1/src/Source   -I/Users/slabbe/Applications/sage-git/local/var/tmp/sage/build/cmake-3.8.1/src/Utilities  -c /Users/slabbe/Applications/sage-git/local/var/tmp/sage/build/cmake-3.8.1/src/Source/cmSubdirCommand.cxx -o cmSubdirCommand.o
185g++  -I/Users/slabbe/Applications/sage-git/local/var/tmp/sage/build/cmake-3.8.1/src/Bootstrap.cmk -I/Users/slabbe/Applications/sage-git/local/var/tmp/sage/build/cmake-3.8.1/src/Source   -I/Users/slabbe/Applications/sage-git/local/var/tmp/sage/build/cmake-3.8.1/src/Utilities  -c /Users/slabbe/Applications/sage-git/local/var/tmp/sage/build/cmake-3.8.1/src/Source/cmSystemTools.cxx -o cmSystemTools.o
186g++  -I/Users/slabbe/Applications/sage-git/local/var/tmp/sage/build/cmake-3.8.1/src/Bootstrap.cmk -I/Users/slabbe/Applications/sage-git/local/var/tmp/sage/build/cmake-3.8.1/src/Source   -I/Users/slabbe/Applications/sage-git/local/var/tmp/sage/build/cmake-3.8.1/src/Utilities  -c /Users/slabbe/Applications/sage-git/local/var/tmp/sage/build/cmake-3.8.1/src/Source/cmTarget.cxx -o cmTarget.o
187g++  -I/Users/slabbe/Applications/sage-git/local/var/tmp/sage/build/cmake-3.8.1/src/Bootstrap.cmk -I/Users/slabbe/Applications/sage-git/local/var/tmp/sage/build/cmake-3.8.1/src/Source   -I/Users/slabbe/Applications/sage-git/local/var/tmp/sage/build/cmake-3.8.1/src/Utilities  -c /Users/slabbe/Applications/sage-git/local/var/tmp/sage/build/cmake-3.8.1/src/Source/cmTargetLinkLibrariesCommand.cxx -o cmTargetLinkLibrariesCommand.o
188g++  -I/Users/slabbe/Applications/sage-git/local/var/tmp/sage/build/cmake-3.8.1/src/Bootstrap.cmk -I/Users/slabbe/Applications/sage-git/local/var/tmp/sage/build/cmake-3.8.1/src/Source   -I/Users/slabbe/Applications/sage-git/local/var/tmp/sage/build/cmake-3.8.1/src/Utilities  -c /Users/slabbe/Applications/sage-git/local/var/tmp/sage/build/cmake-3.8.1/src/Source/cmTargetPropertyComputer.cxx -o cmTargetPropertyComputer.o
189g++  -I/Users/slabbe/Applications/sage-git/local/var/tmp/sage/build/cmake-3.8.1/src/Bootstrap.cmk -I/Users/slabbe/Applications/sage-git/local/var/tmp/sage/build/cmake-3.8.1/src/Source   -I/Users/slabbe/Applications/sage-git/local/var/tmp/sage/build/cmake-3.8.1/src/Utilities  -c /Users/slabbe/Applications/sage-git/local/var/tmp/sage/build/cmake-3.8.1/src/Source/cmTest.cxx -o cmTest.o
190g++  -I/Users/slabbe/Applications/sage-git/local/var/tmp/sage/build/cmake-3.8.1/src/Bootstrap.cmk -I/Users/slabbe/Applications/sage-git/local/var/tmp/sage/build/cmake-3.8.1/src/Source   -I/Users/slabbe/Applications/sage-git/local/var/tmp/sage/build/cmake-3.8.1/src/Utilities  -c /Users/slabbe/Applications/sage-git/local/var/tmp/sage/build/cmake-3.8.1/src/Source/cmTestGenerator.cxx -o cmTestGenerator.o
191g++  -I/Users/slabbe/Applications/sage-git/local/var/tmp/sage/build/cmake-3.8.1/src/Bootstrap.cmk -I/Users/slabbe/Applications/sage-git/local/var/tmp/sage/build/cmake-3.8.1/src/Source   -I/Users/slabbe/Applications/sage-git/local/var/tmp/sage/build/cmake-3.8.1/src/Utilities  -c /Users/slabbe/Applications/sage-git/local/var/tmp/sage/build/cmake-3.8.1/src/Source/cmTimestamp.cxx -o cmTimestamp.o
192g++  -I/Users/slabbe/Applications/sage-git/local/var/tmp/sage/build/cmake-3.8.1/src/Bootstrap.cmk -I/Users/slabbe/Applications/sage-git/local/var/tmp/sage/build/cmake-3.8.1/src/Source   -I/Users/slabbe/Applications/sage-git/local/var/tmp/sage/build/cmake-3.8.1/src/Utilities  -c /Users/slabbe/Applications/sage-git/local/var/tmp/sage/build/cmake-3.8.1/src/Source/cmTryCompileCommand.cxx -o cmTryCompileCommand.o
193g++  -I/Users/slabbe/Applications/sage-git/local/var/tmp/sage/build/cmake-3.8.1/src/Bootstrap.cmk -I/Users/slabbe/Applications/sage-git/local/var/tmp/sage/build/cmake-3.8.1/src/Source   -I/Users/slabbe/Applications/sage-git/local/var/tmp/sage/build/cmake-3.8.1/src/Utilities  -c /Users/slabbe/Applications/sage-git/local/var/tmp/sage/build/cmake-3.8.1/src/Source/cmTryRunCommand.cxx -o cmTryRunCommand.o
194g++  -I/Users/slabbe/Applications/sage-git/local/var/tmp/sage/build/cmake-3.8.1/src/Bootstrap.cmk -I/Users/slabbe/Applications/sage-git/local/var/tmp/sage/build/cmake-3.8.1/src/Source   -I/Users/slabbe/Applications/sage-git/local/var/tmp/sage/build/cmake-3.8.1/src/Utilities  -c /Users/slabbe/Applications/sage-git/local/var/tmp/sage/build/cmake-3.8.1/src/Source/cmUnexpectedCommand.cxx -o cmUnexpectedCommand.o
195g++  -I/Users/slabbe/Applications/sage-git/local/var/tmp/sage/build/cmake-3.8.1/src/Bootstrap.cmk -I/Users/slabbe/Applications/sage-git/local/var/tmp/sage/build/cmake-3.8.1/src/Source   -I/Users/slabbe/Applications/sage-git/local/var/tmp/sage/build/cmake-3.8.1/src/Utilities  -c /Users/slabbe/Applications/sage-git/local/var/tmp/sage/build/cmake-3.8.1/src/Source/cmUnsetCommand.cxx -o cmUnsetCommand.o
196g++  -I/Users/slabbe/Applications/sage-git/local/var/tmp/sage/build/cmake-3.8.1/src/Bootstrap.cmk -I/Users/slabbe/Applications/sage-git/local/var/tmp/sage/build/cmake-3.8.1/src/Source   -I/Users/slabbe/Applications/sage-git/local/var/tmp/sage/build/cmake-3.8.1/src/Utilities  -c /Users/slabbe/Applications/sage-git/local/var/tmp/sage/build/cmake-3.8.1/src/Source/cmVersion.cxx -o cmVersion.o
197g++  -I/Users/slabbe/Applications/sage-git/local/var/tmp/sage/build/cmake-3.8.1/src/Bootstrap.cmk -I/Users/slabbe/Applications/sage-git/local/var/tmp/sage/build/cmake-3.8.1/src/Source   -I/Users/slabbe/Applications/sage-git/local/var/tmp/sage/build/cmake-3.8.1/src/Utilities  -c /Users/slabbe/Applications/sage-git/local/var/tmp/sage/build/cmake-3.8.1/src/Source/cmWhileCommand.cxx -o cmWhileCommand.o
198g++  -I/Users/slabbe/Applications/sage-git/local/var/tmp/sage/build/cmake-3.8.1/src/Bootstrap.cmk -I/Users/slabbe/Applications/sage-git/local/var/tmp/sage/build/cmake-3.8.1/src/Source   -I/Users/slabbe/Applications/sage-git/local/var/tmp/sage/build/cmake-3.8.1/src/Utilities  -c /Users/slabbe/Applications/sage-git/local/var/tmp/sage/build/cmake-3.8.1/src/Source/cmake.cxx -o cmake.o
199g++  -I/Users/slabbe/Applications/sage-git/local/var/tmp/sage/build/cmake-3.8.1/src/Bootstrap.cmk -I/Users/slabbe/Applications/sage-git/local/var/tmp/sage/build/cmake-3.8.1/src/Source   -I/Users/slabbe/Applications/sage-git/local/var/tmp/sage/build/cmake-3.8.1/src/Utilities  -c /Users/slabbe/Applications/sage-git/local/var/tmp/sage/build/cmake-3.8.1/src/Source/cmakemain.cxx -o cmakemain.o
200g++  -I/Users/slabbe/Applications/sage-git/local/var/tmp/sage/build/cmake-3.8.1/src/Bootstrap.cmk -I/Users/slabbe/Applications/sage-git/local/var/tmp/sage/build/cmake-3.8.1/src/Source   -I/Users/slabbe/Applications/sage-git/local/var/tmp/sage/build/cmake-3.8.1/src/Utilities  -c /Users/slabbe/Applications/sage-git/local/var/tmp/sage/build/cmake-3.8.1/src/Source/cmcmd.cxx -o cmcmd.o
201gcc -I/Users/slabbe/Applications/sage-git/local/var/tmp/sage/build/cmake-3.8.1/src/Bootstrap.cmk -I/Users/slabbe/Applications/sage-git/local/var/tmp/sage/build/cmake-3.8.1/src/Source   -I/Users/slabbe/Applications/sage-git/local/var/tmp/sage/build/cmake-3.8.1/src/Utilities -c /Users/slabbe/Applications/sage-git/local/var/tmp/sage/build/cmake-3.8.1/src/Source/cmListFileLexer.c -o cmListFileLexer.o
202g++  -I/Users/slabbe/Applications/sage-git/local/var/tmp/sage/build/cmake-3.8.1/src/Bootstrap.cmk -I/Users/slabbe/Applications/sage-git/local/var/tmp/sage/build/cmake-3.8.1/src/Source   -I/Users/slabbe/Applications/sage-git/local/var/tmp/sage/build/cmake-3.8.1/src/Utilities -DKWSYS_NAMESPACE=cmsys  -c /Users/slabbe/Applications/sage-git/local/var/tmp/sage/build/cmake-3.8.1/src/Source/kwsys/Directory.cxx -o Directory.o
203g++  -I/Users/slabbe/Applications/sage-git/local/var/tmp/sage/build/cmake-3.8.1/src/Bootstrap.cmk -I/Users/slabbe/Applications/sage-git/local/var/tmp/sage/build/cmake-3.8.1/src/Source   -I/Users/slabbe/Applications/sage-git/local/var/tmp/sage/build/cmake-3.8.1/src/Utilities -DKWSYS_NAMESPACE=cmsys  -c /Users/slabbe/Applications/sage-git/local/var/tmp/sage/build/cmake-3.8.1/src/Source/kwsys/EncodingCXX.cxx -o EncodingCXX.o
204g++  -I/Users/slabbe/Applications/sage-git/local/var/tmp/sage/build/cmake-3.8.1/src/Bootstrap.cmk -I/Users/slabbe/Applications/sage-git/local/var/tmp/sage/build/cmake-3.8.1/src/Source   -I/Users/slabbe/Applications/sage-git/local/var/tmp/sage/build/cmake-3.8.1/src/Utilities -DKWSYS_NAMESPACE=cmsys  -c /Users/slabbe/Applications/sage-git/local/var/tmp/sage/build/cmake-3.8.1/src/Source/kwsys/FStream.cxx -o FStream.o
205g++  -I/Users/slabbe/Applications/sage-git/local/var/tmp/sage/build/cmake-3.8.1/src/Bootstrap.cmk -I/Users/slabbe/Applications/sage-git/local/var/tmp/sage/build/cmake-3.8.1/src/Source   -I/Users/slabbe/Applications/sage-git/local/var/tmp/sage/build/cmake-3.8.1/src/Utilities -DKWSYS_NAMESPACE=cmsys  -c /Users/slabbe/Applications/sage-git/local/var/tmp/sage/build/cmake-3.8.1/src/Source/kwsys/Glob.cxx -o Glob.o
206g++  -I/Users/slabbe/Applications/sage-git/local/var/tmp/sage/build/cmake-3.8.1/src/Bootstrap.cmk -I/Users/slabbe/Applications/sage-git/local/var/tmp/sage/build/cmake-3.8.1/src/Source   -I/Users/slabbe/Applications/sage-git/local/var/tmp/sage/build/cmake-3.8.1/src/Utilities -DKWSYS_NAMESPACE=cmsys  -c /Users/slabbe/Applications/sage-git/local/var/tmp/sage/build/cmake-3.8.1/src/Source/kwsys/RegularExpression.cxx -o RegularExpression.o
207g++  -I/Users/slabbe/Applications/sage-git/local/var/tmp/sage/build/cmake-3.8.1/src/Bootstrap.cmk -I/Users/slabbe/Applications/sage-git/local/var/tmp/sage/build/cmake-3.8.1/src/Source   -I/Users/slabbe/Applications/sage-git/local/var/tmp/sage/build/cmake-3.8.1/src/Utilities -DKWSYS_NAMESPACE=cmsys -DKWSYS_CXX_HAS_SETENV=1 -DKWSYS_CXX_HAS_UNSETENV=1 -DKWSYS_CXX_HAS_ENVIRON_IN_STDLIB_H=0 -DKWSYS_CXX_HAS_UTIMENSAT=0 -DKWSYS_CXX_HAS_UTIMES=0 -c /Users/slabbe/Applications/sage-git/local/var/tmp/sage/build/cmake-3.8.1/src/Source/kwsys/SystemTools.cxx -o SystemTools.o
208gcc -I/Users/slabbe/Applications/sage-git/local/var/tmp/sage/build/cmake-3.8.1/src/Bootstrap.cmk -I/Users/slabbe/Applications/sage-git/local/var/tmp/sage/build/cmake-3.8.1/src/Source   -I/Users/slabbe/Applications/sage-git/local/var/tmp/sage/build/cmake-3.8.1/src/Utilities -DKWSYS_NAMESPACE=cmsys  -c /Users/slabbe/Applications/sage-git/local/var/tmp/sage/build/cmake-3.8.1/src/Source/kwsys/EncodingC.c -o EncodingC.o
209gcc -I/Users/slabbe/Applications/sage-git/local/var/tmp/sage/build/cmake-3.8.1/src/Bootstrap.cmk -I/Users/slabbe/Applications/sage-git/local/var/tmp/sage/build/cmake-3.8.1/src/Source   -I/Users/slabbe/Applications/sage-git/local/var/tmp/sage/build/cmake-3.8.1/src/Utilities -DKWSYS_NAMESPACE=cmsys  -c /Users/slabbe/Applications/sage-git/local/var/tmp/sage/build/cmake-3.8.1/src/Source/kwsys/ProcessUNIX.c -o ProcessUNIX.o
210gcc -I/Users/slabbe/Applications/sage-git/local/var/tmp/sage/build/cmake-3.8.1/src/Bootstrap.cmk -I/Users/slabbe/Applications/sage-git/local/var/tmp/sage/build/cmake-3.8.1/src/Source   -I/Users/slabbe/Applications/sage-git/local/var/tmp/sage/build/cmake-3.8.1/src/Utilities -DKWSYS_NAMESPACE=cmsys -DKWSYS_STRING_C -c /Users/slabbe/Applications/sage-git/local/var/tmp/sage/build/cmake-3.8.1/src/Source/kwsys/String.c -o String.o
211gcc -I/Users/slabbe/Applications/sage-git/local/var/tmp/sage/build/cmake-3.8.1/src/Bootstrap.cmk -I/Users/slabbe/Applications/sage-git/local/var/tmp/sage/build/cmake-3.8.1/src/Source   -I/Users/slabbe/Applications/sage-git/local/var/tmp/sage/build/cmake-3.8.1/src/Utilities -DKWSYS_NAMESPACE=cmsys  -c /Users/slabbe/Applications/sage-git/local/var/tmp/sage/build/cmake-3.8.1/src/Source/kwsys/System.c -o System.o
212gcc -I/Users/slabbe/Applications/sage-git/local/var/tmp/sage/build/cmake-3.8.1/src/Bootstrap.cmk -I/Users/slabbe/Applications/sage-git/local/var/tmp/sage/build/cmake-3.8.1/src/Source   -I/Users/slabbe/Applications/sage-git/local/var/tmp/sage/build/cmake-3.8.1/src/Utilities -DKWSYS_NAMESPACE=cmsys  -c /Users/slabbe/Applications/sage-git/local/var/tmp/sage/build/cmake-3.8.1/src/Source/kwsys/Terminal.c -o Terminal.o
213g++ -L/Users/slabbe/Applications/sage-git/local/lib -Wl,-rpath,/Users/slabbe/Applications/sage-git/local/lib  -framework CoreFoundation  -I/Users/slabbe/Applications/sage-git/local/var/tmp/sage/build/cmake-3.8.1/src/Bootstrap.cmk -I/Users/slabbe/Applications/sage-git/local/var/tmp/sage/build/cmake-3.8.1/src/Source   -I/Users/slabbe/Applications/sage-git/local/var/tmp/sage/build/cmake-3.8.1/src/Utilities  cmAddCustomCommandCommand.o cmAddCustomTargetCommand.o cmAddDefinitionsCommand.o cmAddDependenciesCommand.o cmAddExecutableCommand.o cmAddLibraryCommand.o cmAddSubDirectoryCommand.o cmAddTestCommand.o cmBreakCommand.o cmBuildCommand.o cmCMakeMinimumRequired.o cmCMakePolicyCommand.o cmCPackPropertiesGenerator.o cmCacheManager.o cmCommand.o cmCommandArgumentLexer.o cmCommandArgumentParser.o cmCommandArgumentParserHelper.o cmCommandArgumentsHelper.o cmCommands.o cmCommonTargetGenerator.o cmComputeComponentGraph.o cmComputeLinkDepends.o cmComputeLinkInformation.o cmComputeTargetDepends.o cmConditionEvaluator.o cmConfigureFileCommand.o cmContinueCommand.o cmCoreTryCompile.o cmCreateTestSourceList.o cmCustomCommand.o cmCustomCommandGenerator.o cmDefinePropertyCommand.o cmDefinitions.o cmDepends.o cmDependsC.o cmDocumentationFormatter.o cmEnableLanguageCommand.o cmEnableTestingCommand.o cmExecProgramCommand.o cmExecuteProcessCommand.o cmExpandedCommandArgument.o cmExportBuildFileGenerator.o cmExportFileGenerator.o cmExportInstallFileGenerator.o cmExportSet.o cmExportSetMap.o cmExportTryCompileFileGenerator.o cmExprLexer.o cmExprParser.o cmExprParserHelper.o cmExternalMakefileProjectGenerator.o cmFileCommand.o cmFileTimeComparison.o cmFindBase.o cmFindCommon.o cmFindFileCommand.o cmFindLibraryCommand.o cmFindPackageCommand.o cmFindPathCommand.o cmFindProgramCommand.o cmForEachCommand.o cmFunctionCommand.o cmGeneratedFileStream.o cmGeneratorExpression.o cmGeneratorExpressionContext.o cmGeneratorExpressionDAGChecker.o cmGeneratorExpressionEvaluationFile.o cmGeneratorExpressionEvaluator.o cmGeneratorExpressionLexer.o cmGeneratorExpressionNode.o cmGeneratorExpressionParser.o cmGeneratorTarget.o cmGetCMakePropertyCommand.o cmGetDirectoryPropertyCommand.o cmGetFilenameComponentCommand.o cmGetPropertyCommand.o cmGetSourceFilePropertyCommand.o cmGetTargetPropertyCommand.o cmGetTestPropertyCommand.o cmGlobalCommonGenerator.o cmGlobalGenerator.o cmGlobalUnixMakefileGenerator3.o cmHexFileConverter.o cmIfCommand.o cmIncludeCommand.o cmIncludeDirectoryCommand.o cmIncludeRegularExpressionCommand.o cmInstallCommand.o cmInstallCommandArguments.o cmInstallDirectoryGenerator.o cmInstallExportGenerator.o cmInstallFilesCommand.o cmInstallFilesGenerator.o cmInstallGenerator.o cmInstallScriptGenerator.o cmInstallTargetGenerator.o cmInstallTargetsCommand.o cmInstalledFile.o cmLinkDirectoriesCommand.o cmLinkLineComputer.o cmListCommand.o cmListFileCache.o cmLocalCommonGenerator.o cmLocalGenerator.o cmLocalUnixMakefileGenerator3.o cmMSVC60LinkLineComputer.o cmMacroCommand.o cmMakeDirectoryCommand.o cmMakefile.o cmMakefileExecutableTargetGenerator.o cmMakefileLibraryTargetGenerator.o cmMakefileTargetGenerator.o cmMakefileUtilityTargetGenerator.o cmMarkAsAdvancedCommand.o cmMathCommand.o cmMessageCommand.o cmMessenger.o cmNewLineStyle.o cmOSXBundleGenerator.o cmOptionCommand.o cmOrderDirectories.o cmOutputConverter.o cmParseArgumentsCommand.o cmPathLabel.o cmPolicies.o cmProcessOutput.o cmProjectCommand.o cmProperty.o cmPropertyDefinition.o cmPropertyDefinitionMap.o cmPropertyMap.o cmReturnCommand.o cmRulePlaceholderExpander.o cmScriptGenerator.o cmSearchPath.o cmSeparateArgumentsCommand.o cmSetCommand.o cmSetDirectoryPropertiesCommand.o cmSetPropertyCommand.o cmSetSourceFilesPropertiesCommand.o cmSetTargetPropertiesCommand.o cmSetTestsPropertiesCommand.o cmSiteNameCommand.o cmSourceFile.o cmSourceFileLocation.o cmState.o cmStateDirectory.o cmStateSnapshot.o cmStringCommand.o cmSubdirCommand.o cmSystemTools.o cmTarget.o cmTargetLinkLibrariesCommand.o cmTargetPropertyComputer.o cmTest.o cmTestGenerator.o cmTimestamp.o cmTryCompileCommand.o cmTryRunCommand.o cmUnexpectedCommand.o cmUnsetCommand.o cmVersion.o cmWhileCommand.o cmake.o cmakemain.o cmcmd.o cmListFileLexer.o Directory.o EncodingCXX.o FStream.o Glob.o RegularExpression.o SystemTools.o EncodingC.o ProcessUNIX.o String.o System.o Terminal.o -o cmake
214loading initial cache file /Users/slabbe/Applications/sage-git/local/var/tmp/sage/build/cmake-3.8.1/src/Bootstrap.cmk/InitialCacheFlags.cmake
215-- The C compiler identification is GNU 4.9.3
216-- The CXX compiler identification is GNU 4.9.3
217-- Checking whether C compiler has -isysroot
218-- Checking whether C compiler has -isysroot - yes
219-- Checking whether C compiler supports OSX deployment target flag
220-- Checking whether C compiler supports OSX deployment target flag - yes
221-- Check for working C compiler: /Users/slabbe/Applications/sage-git/local/libexec/ccache/gcc
222-- Check for working C compiler: /Users/slabbe/Applications/sage-git/local/libexec/ccache/gcc -- works
223-- Detecting C compiler ABI info
224-- Detecting C compiler ABI info - done
225-- Detecting C compile features
226-- Detecting C compile features - done
227-- Checking whether CXX compiler has -isysroot
228-- Checking whether CXX compiler has -isysroot - yes
229-- Checking whether CXX compiler supports OSX deployment target flag
230-- Checking whether CXX compiler supports OSX deployment target flag - yes
231-- Check for working CXX compiler: /Users/slabbe/Applications/sage-git/local/libexec/ccache/g++
232-- Check for working CXX compiler: /Users/slabbe/Applications/sage-git/local/libexec/ccache/g++ -- works
233-- Detecting CXX compiler ABI info
234-- Detecting CXX compiler ABI info - done
235-- Detecting CXX compile features
236-- Detecting CXX compile features - done
237-- Checking if compiler supports C11 _Thread_local
238-- Checking if compiler supports C11 _Thread_local - yes
239-- Checking if compiler supports C++14 cstdio
240-- Checking if compiler supports C++14 cstdio - yes
241-- Checking if compiler supports C++ auto_ptr
242-- Checking if compiler supports C++ auto_ptr - no
243-- Checking if compiler supports C++ make_unique
244-- Checking if compiler supports C++ make_unique - yes
245-- Checking if compiler supports C++ nullptr
246-- Checking if compiler supports C++ nullptr - yes
247-- Checking if compiler supports C++ override
248-- Checking if compiler supports C++ override - yes
249-- Checking if compiler supports C++ unordered_map
250-- Checking if compiler supports C++ unordered_map - yes
251-- Checking if compiler supports C++ unordered_set
252-- Checking if compiler supports C++ unordered_set - yes
253-- Looking for unsetenv
254-- Looking for unsetenv - found
255-- Looking for environ
256-- Looking for environ - not found
257-- Checking whether header cstdio is available
258-- Checking whether header cstdio is available - yes
259-- Checking for Large File Support
260-- Checking for Large File Support - yes
261-- Checking whether C++ compiler has 'long long'
262-- Checking whether C++ compiler has 'long long' - yes
263-- Checking whether C++ compiler has '__int64'
264-- Checking whether C++ compiler has '__int64' - no
265-- Checking whether wstring is available
266-- Checking whether wstring is available - yes
267-- Checking if istream supports long long
268-- Checking if istream supports long long - yes
269-- Checking if ostream supports long long
270-- Checking if ostream supports long long - yes
271-- Checking whether C compiler has ptrdiff_t in stddef.h
272-- Checking whether C compiler has ptrdiff_t in stddef.h - yes
273-- Checking whether C compiler has ssize_t in unistd.h
274-- Checking whether C compiler has ssize_t in unistd.h - yes
275-- Checking whether CXX compiler has setenv
276-- Checking whether CXX compiler has setenv - yes
277-- Checking whether CXX compiler has unsetenv
278-- Checking whether CXX compiler has unsetenv - yes
279-- Checking whether CXX compiler has environ in stdlib.h
280-- Checking whether CXX compiler has environ in stdlib.h - no
281-- Checking whether CXX compiler has utimes
282-- Checking whether CXX compiler has utimes - yes
283-- Checking whether CXX compiler has utimensat
284-- Checking whether CXX compiler has utimensat - no
285-- Checking whether CXX compiler struct stat has st_mtim member
286-- Checking whether CXX compiler struct stat has st_mtim member - no
287-- Checking whether CXX compiler struct stat has st_mtimespec member
288-- Checking whether CXX compiler struct stat has st_mtimespec member - yes
289-- Looking for include files sys/types.h, ifaddrs.h
290-- Looking for include files sys/types.h, ifaddrs.h - found
291-- Checking whether CXX compiler has rlimit64
292-- Checking whether CXX compiler has rlimit64 - no
293-- Checking whether CXX compiler has atol
294-- Checking whether CXX compiler has atol - yes
295-- Checking whether CXX compiler has atoll
296-- Checking whether CXX compiler has atoll - yes
297-- Checking whether CXX compiler has _atoi64
298-- Checking whether CXX compiler has _atoi64 - no
299-- Looking for C++ include execinfo.h
300-- Looking for C++ include execinfo.h - found
301-- Checking whether backtrace works with this C++ compiler
302-- Checking whether backtrace works with this C++ compiler - yes
303-- Looking for C++ include dlfcn.h
304-- Looking for C++ include dlfcn.h - found
305-- Checking whether dladdr works with this C++ compiler
306-- Checking whether dladdr works with this C++ compiler - yes
307-- Looking for C++ include cxxabi.h
308-- Looking for C++ include cxxabi.h - found
309-- Checking whether cxxabi works with this C++ compiler
310-- Checking whether cxxabi works with this C++ compiler - yes
311-- Checking whether CXX compiler has getloadavg
312-- Checking whether CXX compiler has getloadavg - yes
313-- Checking whether <ext/stdio_filebuf.h> is available
314-- Checking whether <ext/stdio_filebuf.h> is available - yes
315-- Using system-installed BZIP2
316-- Using system-installed CURL
317-- Using system-installed LIBLZMA
318-- Using system-installed ZLIB
319-- Found ZLIB: /Users/slabbe/Applications/sage-git/local/lib/libz.dylib (found version "1.2.8")
320-- Found CURL: /Users/slabbe/Applications/sage-git/local/lib/libcurl.dylib (found version "7.53.1")
321-- Looking for dlfcn.h
322-- Looking for dlfcn.h - found
323-- Looking for fcntl.h
324-- Looking for fcntl.h - found
325-- Looking for inttypes.h
326-- Looking for inttypes.h - found
327-- Looking for memory.h
328-- Looking for memory.h - found
329-- Looking for stdint.h
330-- Looking for stdint.h - found
331-- Looking for stdlib.h
332-- Looking for stdlib.h - found
333-- Looking for strings.h
334-- Looking for strings.h - found
335-- Looking for string.h
336-- Looking for string.h - found
337-- Looking for sys/stat.h
338-- Looking for sys/stat.h - found
339-- Looking for sys/types.h
340-- Looking for sys/types.h - found
341-- Looking for unistd.h
342-- Looking for unistd.h - found
343-- Looking for getpagesize
344-- Looking for getpagesize - found
345-- Looking for bcopy
346-- Looking for bcopy - found
347-- Looking for memmove
348-- Looking for memmove - found
349-- Looking for mmap
350-- Looking for mmap - found
351-- Looking for 4 include files stdlib.h, ..., float.h
352-- Looking for 4 include files stdlib.h, ..., float.h - found
353-- Check if the system is big endian
354-- Searching 16 bit integer
355-- Looking for stddef.h
356-- Looking for stddef.h - found
357-- Check size of unsigned short
358-- Check size of unsigned short - done
359-- Using unsigned short
360-- Check if the system is big endian - little endian
361-- Looking for off_t
362-- Looking for off_t - not found
363-- Looking for size_t
364-- Looking for size_t - not found
365-- Found BZip2: /Users/slabbe/Applications/sage-git/local/lib/libbz2.dylib (found version "1.0.6")
366-- Looking for BZ2_bzCompressInit
367-- Looking for BZ2_bzCompressInit - found
368-- Looking for lzma_auto_decoder in /Users/slabbe/Applications/sage-git/local/lib/liblzma.dylib
369-- Looking for lzma_auto_decoder in /Users/slabbe/Applications/sage-git/local/lib/liblzma.dylib - found
370-- Looking for lzma_easy_encoder in /Users/slabbe/Applications/sage-git/local/lib/liblzma.dylib
371-- Looking for lzma_easy_encoder in /Users/slabbe/Applications/sage-git/local/lib/liblzma.dylib - found
372-- Looking for lzma_lzma_preset in /Users/slabbe/Applications/sage-git/local/lib/liblzma.dylib
373-- Looking for lzma_lzma_preset in /Users/slabbe/Applications/sage-git/local/lib/liblzma.dylib - found
374-- Found LibLZMA: /Users/slabbe/Applications/sage-git/local/include (found version "5.2.2")
375-- Performing Test HAVE_DIRENT_H
376-- Performing Test HAVE_DIRENT_H - Success
377-- Looking for include files sys/types.h, ctype.h
378-- Looking for include files sys/types.h, ctype.h - found
379-- Looking for 3 include files sys/types.h, ..., copyfile.h
380-- Looking for 3 include files sys/types.h, ..., copyfile.h - found
381-- Looking for 4 include files sys/types.h, ..., direct.h
382-- Looking for 4 include files sys/types.h, ..., direct.h - not found
383-- Looking for 5 include files sys/types.h, ..., errno.h
384-- Looking for 5 include files sys/types.h, ..., errno.h - found
385-- Looking for 6 include files sys/types.h, ..., ext2fs/ext2_fs.h
386-- Looking for 6 include files sys/types.h, ..., ext2fs/ext2_fs.h - not found
387-- Performing Test HAVE_WORKING_EXT2_IOC_GETFLAGS
388-- Performing Test HAVE_WORKING_EXT2_IOC_GETFLAGS - Failed
389-- Looking for 7 include files sys/types.h, ..., grp.h
390-- Looking for 7 include files sys/types.h, ..., grp.h - found
391-- Looking for 9 include files sys/types.h, ..., io.h
392-- Looking for 9 include files sys/types.h, ..., io.h - not found
393-- Looking for 9 include files sys/types.h, ..., langinfo.h
394-- Looking for 9 include files sys/types.h, ..., langinfo.h - found
395-- Looking for 10 include files sys/types.h, ..., limits.h
396-- Looking for 10 include files sys/types.h, ..., limits.h - found
397-- Looking for 11 include files sys/types.h, ..., linux/types.h
398-- Looking for 11 include files sys/types.h, ..., linux/types.h - not found
399-- Looking for 11 include files sys/types.h, ..., linux/fiemap.h
400-- Looking for 11 include files sys/types.h, ..., linux/fiemap.h - not found
401-- Looking for 11 include files sys/types.h, ..., linux/fs.h
402-- Looking for 11 include files sys/types.h, ..., linux/fs.h - not found
403-- Looking for 11 include files sys/types.h, ..., linux/magic.h
404-- Looking for 11 include files sys/types.h, ..., linux/magic.h - not found
405-- Looking for 11 include files sys/types.h, ..., locale.h
406-- Looking for 11 include files sys/types.h, ..., locale.h - found
407-- Looking for 13 include files sys/types.h, ..., paths.h
408-- Looking for 13 include files sys/types.h, ..., paths.h - found
409-- Looking for 14 include files sys/types.h, ..., poll.h
410-- Looking for 14 include files sys/types.h, ..., poll.h - found
411-- Looking for 15 include files sys/types.h, ..., process.h
412-- Looking for 15 include files sys/types.h, ..., process.h - not found
413-- Looking for 15 include files sys/types.h, ..., pwd.h
414-- Looking for 15 include files sys/types.h, ..., pwd.h - found
415-- Looking for 16 include files sys/types.h, ..., readpassphrase.h
416-- Looking for 16 include files sys/types.h, ..., readpassphrase.h - found
417-- Looking for 17 include files sys/types.h, ..., regex.h
418-- Looking for 17 include files sys/types.h, ..., regex.h - found
419-- Looking for 18 include files sys/types.h, ..., signal.h
420-- Looking for 18 include files sys/types.h, ..., signal.h - found
421-- Looking for 19 include files sys/types.h, ..., spawn.h
422-- Looking for 19 include files sys/types.h, ..., spawn.h - found
423-- Looking for 20 include files sys/types.h, ..., stdarg.h
424-- Looking for 20 include files sys/types.h, ..., stdarg.h - found
425-- Looking for 25 include files sys/types.h, ..., sys/acl.h
426-- Looking for 25 include files sys/types.h, ..., sys/acl.h - found
427-- Looking for 26 include files sys/types.h, ..., sys/cdefs.h
428-- Looking for 26 include files sys/types.h, ..., sys/cdefs.h - found
429-- Looking for 27 include files sys/types.h, ..., sys/ioctl.h
430-- Looking for 27 include files sys/types.h, ..., sys/ioctl.h - found
431-- Looking for 28 include files sys/types.h, ..., sys/mkdev.h
432-- Looking for 28 include files sys/types.h, ..., sys/mkdev.h - not found
433-- Looking for 28 include files sys/types.h, ..., sys/mount.h
434-- Looking for 28 include files sys/types.h, ..., sys/mount.h - found
435-- Looking for 29 include files sys/types.h, ..., sys/param.h
436-- Looking for 29 include files sys/types.h, ..., sys/param.h - found
437-- Looking for 30 include files sys/types.h, ..., sys/poll.h
438-- Looking for 30 include files sys/types.h, ..., sys/poll.h - found
439-- Looking for 31 include files sys/types.h, ..., sys/select.h
440-- Looking for 31 include files sys/types.h, ..., sys/select.h - found
441-- Looking for 33 include files sys/types.h, ..., sys/statfs.h
442-- Looking for 33 include files sys/types.h, ..., sys/statfs.h - not found
443-- Looking for 33 include files sys/types.h, ..., sys/statvfs.h
444-- Looking for 33 include files sys/types.h, ..., sys/statvfs.h - found
445-- Looking for 34 include files sys/types.h, ..., sys/time.h
446-- Looking for 34 include files sys/types.h, ..., sys/time.h - found
447-- Looking for 35 include files sys/types.h, ..., sys/utime.h
448-- Looking for 35 include files sys/types.h, ..., sys/utime.h - not found
449-- Looking for 35 include files sys/types.h, ..., sys/utsname.h
450-- Looking for 35 include files sys/types.h, ..., sys/utsname.h - found
451-- Looking for 36 include files sys/types.h, ..., sys/vfs.h
452-- Looking for 36 include files sys/types.h, ..., sys/vfs.h - not found
453-- Looking for 36 include files sys/types.h, ..., sys/wait.h
454-- Looking for 36 include files sys/types.h, ..., sys/wait.h - found
455-- Looking for 37 include files sys/types.h, ..., time.h
456-- Looking for 37 include files sys/types.h, ..., time.h - found
457-- Looking for 39 include files sys/types.h, ..., utime.h
458-- Looking for 39 include files sys/types.h, ..., utime.h - found
459-- Looking for 40 include files sys/types.h, ..., wchar.h
460-- Looking for 40 include files sys/types.h, ..., wchar.h - found
461-- Looking for 41 include files sys/types.h, ..., wctype.h
462-- Looking for 41 include files sys/types.h, ..., wctype.h - found
463-- Looking for 42 include files sys/types.h, ..., windows.h
464-- Looking for 42 include files sys/types.h, ..., windows.h - not found
465-- Looking for 42 include files sys/types.h, ..., wincrypt.h
466-- Looking for 42 include files sys/types.h, ..., wincrypt.h - not found
467-- Looking for 42 include files sys/types.h, ..., winioctl.h
468-- Looking for 42 include files sys/types.h, ..., winioctl.h - not found
469-- Performing Test SAFE_TO_DEFINE_EXTENSIONS
470-- Performing Test SAFE_TO_DEFINE_EXTENSIONS - Success
471-- Looking for MD5Init in md
472-- Looking for MD5Init in md - not found
473-- Looking for _CrtSetReportMode
474-- Looking for _CrtSetReportMode - not found
475-- Looking for arc4random_buf
476-- Looking for arc4random_buf - found
477-- Looking for chflags
478-- Looking for chflags - found
479-- Looking for chown
480-- Looking for chown - found
481-- Looking for chroot
482-- Looking for chroot - found
483-- Looking for ctime_r
484-- Looking for ctime_r - found
485-- Looking for dirfd
486-- Looking for dirfd - found
487-- Looking for fchdir
488-- Looking for fchdir - found
489-- Looking for fchflags
490-- Looking for fchflags - found
491-- Looking for fchmod
492-- Looking for fchmod - found
493-- Looking for fchown
494-- Looking for fchown - found
495-- Looking for fcntl
496-- Looking for fcntl - found
497-- Looking for fdopendir
498-- Looking for fdopendir - not found
499-- Looking for fork
500-- Looking for fork - found
501-- Looking for fstat
502-- Looking for fstat - found
503-- Looking for fstatat
504-- Looking for fstatat - not found
505-- Looking for fstatfs
506-- Looking for fstatfs - found
507-- Looking for fstatvfs
508-- Looking for fstatvfs - found
509-- Looking for ftruncate
510-- Looking for ftruncate - found
511-- Looking for futimens
512-- Looking for futimens - not found
513-- Looking for futimes
514-- Looking for futimes - found
515-- Looking for futimesat
516-- Looking for futimesat - not found
517-- Looking for geteuid
518-- Looking for geteuid - found
519-- Looking for getgrgid_r
520-- Looking for getgrgid_r - found
521-- Looking for getgrnam_r
522-- Looking for getgrnam_r - found
523-- Looking for getpwnam_r
524-- Looking for getpwnam_r - found
525-- Looking for getpwuid_r
526-- Looking for getpwuid_r - found
527-- Looking for getpid
528-- Looking for getpid - found
529-- Looking for getvfsbyname
530-- Looking for getvfsbyname - found
531-- Looking for gmtime_r
532-- Looking for gmtime_r - found
533-- Looking for lchflags
534-- Looking for lchflags - found
535-- Looking for lchmod
536-- Looking for lchmod - found
537-- Looking for lchown
538-- Looking for lchown - found
539-- Looking for link
540-- Looking for link - found
541-- Looking for localtime_r
542-- Looking for localtime_r - found
543-- Looking for lstat
544-- Looking for lstat - found
545-- Looking for lutimes
546-- Looking for lutimes - found
547-- Looking for mbrtowc
548-- Looking for mbrtowc - found
549-- Looking for mkdir
550-- Looking for mkdir - found
551-- Looking for mkfifo
552-- Looking for mkfifo - found
553-- Looking for mknod
554-- Looking for mknod - found
555-- Looking for mkstemp
556-- Looking for mkstemp - found
557-- Looking for nl_langinfo
558-- Looking for nl_langinfo - found
559-- Looking for openat
560-- Looking for openat - not found
561-- Looking for pipe
562-- Looking for pipe - found
563-- Looking for poll
564-- Looking for poll - found
565-- Looking for posix_spawnp
566-- Looking for posix_spawnp - found
567-- Looking for readlink
568-- Looking for readlink - found
569-- Looking for readpassphrase
570-- Looking for readpassphrase - found
571-- Looking for select
572-- Looking for select - found
573-- Looking for setenv
574-- Looking for setenv - found
575-- Looking for setlocale
576-- Looking for setlocale - found
577-- Looking for sigaction
578-- Looking for sigaction - found
579-- Looking for statfs
580-- Looking for statfs - found
581-- Looking for statvfs
582-- Looking for statvfs - found
583-- Looking for strchr
584-- Looking for strchr - found
585-- Looking for strdup
586-- Looking for strdup - found
587-- Looking for strerror
588-- Looking for strerror - found
589-- Looking for strncpy_s
590-- Looking for strncpy_s - not found
591-- Looking for strrchr
592-- Looking for strrchr - found
593-- Looking for symlink
594-- Looking for symlink - found
595-- Looking for timegm
596-- Looking for timegm - found
597-- Looking for tzset
598-- Looking for tzset - found
599-- Looking for utime
600-- Looking for utime - found
601-- Looking for utimes
602-- Looking for utimes - found
603-- Looking for utimensat
604-- Looking for utimensat - not found
605-- Looking for vfork
606-- Looking for vfork - found
607-- Looking for wcrtomb
608-- Looking for wcrtomb - found
609-- Looking for wcscmp
610-- Looking for wcscmp - found
611-- Looking for wcscpy
612-- Looking for wcscpy - found
613-- Looking for wcslen
614-- Looking for wcslen - found
615-- Looking for wctomb
616-- Looking for wctomb - found
617-- Looking for _ctime64_s
618-- Looking for _ctime64_s - not found
619-- Looking for _fseeki64
620-- Looking for _fseeki64 - not found
621-- Looking for _get_timezone
622-- Looking for _get_timezone - not found
623-- Looking for _localtime64_s
624-- Looking for _localtime64_s - not found
625-- Looking for _mkgmtime64
626-- Looking for _mkgmtime64 - not found
627-- Looking for cygwin_conv_path
628-- Looking for cygwin_conv_path - not found
629-- Looking for fseeko
630-- Looking for fseeko - found
631-- Looking for strerror_r
632-- Looking for strerror_r - found
633-- Looking for strftime
634-- Looking for strftime - found
635-- Looking for vprintf
636-- Looking for vprintf - found
637-- Looking for wmemcmp
638-- Looking for wmemcmp - found
639-- Looking for wmemcpy
640-- Looking for wmemcpy - found
641-- Looking for wmemmove
642-- Looking for wmemmove - found
643-- Performing Test HAVE_READDIR_R
644-- Performing Test HAVE_READDIR_R - Success
645-- Performing Test HAVE_READLINKAT
646-- Performing Test HAVE_READLINKAT - Failed
647-- Performing Test MAJOR_IN_MKDEV
648-- Performing Test MAJOR_IN_MKDEV - Failed
649-- Performing Test MAJOR_IN_SYSMACROS
650-- Performing Test MAJOR_IN_SYSMACROS - Failed
651-- Looking for EFTYPE
652-- Looking for EFTYPE - found
653-- Looking for EILSEQ
654-- Looking for EILSEQ - found
655-- Looking for D_MD_ORDER
656-- Looking for D_MD_ORDER - found
657-- Looking for INT32_MAX
658-- Looking for INT32_MAX - found
659-- Looking for INT32_MIN
660-- Looking for INT32_MIN - found
661-- Looking for INT64_MAX
662-- Looking for INT64_MAX - found
663-- Looking for INT64_MIN
664-- Looking for INT64_MIN - found
665-- Looking for INTMAX_MAX
666-- Looking for INTMAX_MAX - found
667-- Looking for INTMAX_MIN
668-- Looking for INTMAX_MIN - found
669-- Looking for UINT32_MAX
670-- Looking for UINT32_MAX - found
671-- Looking for UINT64_MAX
672-- Looking for UINT64_MAX - found
673-- Looking for UINTMAX_MAX
674-- Looking for UINTMAX_MAX - found
675-- Looking for SIZE_MAX
676-- Looking for SIZE_MAX - found
677-- Looking for SSIZE_MAX
678-- Looking for SSIZE_MAX - found
679-- Performing Test HAVE_STRUCT_TM_TM_GMTOFF
680-- Performing Test HAVE_STRUCT_TM_TM_GMTOFF - Success
681-- Performing Test HAVE_STRUCT_TM___TM_GMTOFF
682-- Performing Test HAVE_STRUCT_TM___TM_GMTOFF - Failed
683-- Performing Test HAVE_STRUCT_STATFS_F_NAMEMAX
684-- Performing Test HAVE_STRUCT_STATFS_F_NAMEMAX - Failed
685-- Performing Test HAVE_STRUCT_STAT_ST_BIRTHTIME
686-- Performing Test HAVE_STRUCT_STAT_ST_BIRTHTIME - Success
687-- Performing Test HAVE_STRUCT_STAT_ST_BIRTHTIMESPEC_TV_NSEC
688-- Performing Test HAVE_STRUCT_STAT_ST_BIRTHTIMESPEC_TV_NSEC - Success
689-- Performing Test HAVE_STRUCT_STAT_ST_MTIMESPEC_TV_NSEC
690-- Performing Test HAVE_STRUCT_STAT_ST_MTIMESPEC_TV_NSEC - Success
691-- Performing Test HAVE_STRUCT_STAT_ST_MTIM_TV_NSEC
692-- Performing Test HAVE_STRUCT_STAT_ST_MTIM_TV_NSEC - Failed
693-- Performing Test HAVE_STRUCT_STAT_ST_MTIME_N
694-- Performing Test HAVE_STRUCT_STAT_ST_MTIME_N - Failed
695-- Performing Test HAVE_STRUCT_STAT_ST_UMTIME
696-- Performing Test HAVE_STRUCT_STAT_ST_UMTIME - Failed
697-- Performing Test HAVE_STRUCT_STAT_ST_MTIME_USEC
698-- Performing Test HAVE_STRUCT_STAT_ST_MTIME_USEC - Failed
699-- Performing Test HAVE_STRUCT_STAT_ST_BLKSIZE
700-- Performing Test HAVE_STRUCT_STAT_ST_BLKSIZE - Success
701-- Performing Test HAVE_STRUCT_STAT_ST_FLAGS
702-- Performing Test HAVE_STRUCT_STAT_ST_FLAGS - Success
703-- Performing Test HAVE_STRUCT_STATVFS_F_IOSIZE
704-- Performing Test HAVE_STRUCT_STATVFS_F_IOSIZE - Failed
705-- Performing Test TIME_WITH_SYS_TIME
706-- Performing Test TIME_WITH_SYS_TIME - Success
707-- Check size of short
708-- Check size of short - done
709-- Check size of int
710-- Check size of int - done
711-- Check size of long
712-- Check size of long - done
713-- Check size of long long
714-- Check size of long long - done
715-- Check size of unsigned short
716-- Check size of unsigned short - done
717-- Check size of unsigned
718-- Check size of unsigned - done
719-- Check size of unsigned long
720-- Check size of unsigned long - done
721-- Check size of unsigned long long
722-- Check size of unsigned long long - done
723-- Check size of __int64
724-- Check size of __int64 - failed
725-- Check size of unsigned __int64
726-- Check size of unsigned __int64 - failed
727-- Check size of int16_t
728-- Check size of int16_t - done
729-- Check size of int32_t
730-- Check size of int32_t - done
731-- Check size of int64_t
732-- Check size of int64_t - done
733-- Check size of intmax_t
734-- Check size of intmax_t - done
735-- Check size of uint8_t
736-- Check size of uint8_t - done
737-- Check size of uint16_t
738-- Check size of uint16_t - done
739-- Check size of uint32_t
740-- Check size of uint32_t - done
741-- Check size of uint64_t
742-- Check size of uint64_t - done
743-- Check size of uintmax_t
744-- Check size of uintmax_t - done
745-- Check size of dev_t
746-- Check size of dev_t - done
747-- Check size of gid_t
748-- Check size of gid_t - done
749-- Check size of id_t
750-- Check size of id_t - done
751-- Check size of mode_t
752-- Check size of mode_t - done
753-- Check size of off_t
754-- Check size of off_t - done
755-- Check size of size_t
756-- Check size of size_t - done
757-- Check size of ssize_t
758-- Check size of ssize_t - done
759-- Check size of uid_t
760-- Check size of uid_t - done
761-- Check size of pid_t
762-- Check size of pid_t - done
763-- Check size of intptr_t
764-- Check size of intptr_t - done
765-- Check size of uintptr_t
766-- Check size of uintptr_t - done
767-- Check size of wchar_t
768-- Check size of wchar_t - done
769-- Checking _FILE_OFFSET_BITS for large files
770-- Checking _FILE_OFFSET_BITS for large files - not needed
771-- Checking support for ARCHIVE_CRYPTO_MD5_LIBC
772-- Checking support for ARCHIVE_CRYPTO_MD5_LIBC -- not found
773-- Checking support for ARCHIVE_CRYPTO_RMD160_LIBC
774-- Checking support for ARCHIVE_CRYPTO_RMD160_LIBC -- not found
775-- Checking support for ARCHIVE_CRYPTO_SHA1_LIBC
776-- Checking support for ARCHIVE_CRYPTO_SHA1_LIBC -- not found
777-- Checking support for ARCHIVE_CRYPTO_SHA256_LIBC
778-- Checking support for ARCHIVE_CRYPTO_SHA256_LIBC -- not found
779-- Checking support for ARCHIVE_CRYPTO_SHA384_LIBC
780-- Checking support for ARCHIVE_CRYPTO_SHA384_LIBC -- not found
781-- Checking support for ARCHIVE_CRYPTO_SHA512_LIBC
782-- Checking support for ARCHIVE_CRYPTO_SHA512_LIBC -- not found
783-- Checking support for ARCHIVE_CRYPTO_SHA256_LIBC2
784-- Checking support for ARCHIVE_CRYPTO_SHA256_LIBC2 -- not found
785-- Checking support for ARCHIVE_CRYPTO_SHA384_LIBC2
786-- Checking support for ARCHIVE_CRYPTO_SHA384_LIBC2 -- not found
787-- Checking support for ARCHIVE_CRYPTO_SHA512_LIBC2
788-- Checking support for ARCHIVE_CRYPTO_SHA512_LIBC2 -- not found
789-- Checking support for ARCHIVE_CRYPTO_SHA256_LIBC3
790-- Checking support for ARCHIVE_CRYPTO_SHA256_LIBC3 -- not found
791-- Checking support for ARCHIVE_CRYPTO_SHA384_LIBC3
792-- Checking support for ARCHIVE_CRYPTO_SHA384_LIBC3 -- not found
793-- Checking support for ARCHIVE_CRYPTO_SHA512_LIBC3
794-- Checking support for ARCHIVE_CRYPTO_SHA512_LIBC3 -- not found
795-- Checking support for ARCHIVE_CRYPTO_MD5_LIBSYSTEM
796-- Checking support for ARCHIVE_CRYPTO_MD5_LIBSYSTEM -- found
797-- Checking support for ARCHIVE_CRYPTO_SHA1_LIBSYSTEM
798-- Checking support for ARCHIVE_CRYPTO_SHA1_LIBSYSTEM -- found
799-- Checking support for ARCHIVE_CRYPTO_SHA256_LIBSYSTEM
800-- Checking support for ARCHIVE_CRYPTO_SHA256_LIBSYSTEM -- found
801-- Checking support for ARCHIVE_CRYPTO_SHA384_LIBSYSTEM
802-- Checking support for ARCHIVE_CRYPTO_SHA384_LIBSYSTEM -- found
803-- Checking support for ARCHIVE_CRYPTO_SHA512_LIBSYSTEM
804-- Checking support for ARCHIVE_CRYPTO_SHA512_LIBSYSTEM -- found
805-- Checking support for ARCHIVE_CRYPTO_RMD160_LIBMD
806-- Checking support for ARCHIVE_CRYPTO_RMD160_LIBMD -- not found
807-- Performing Test HAVE_CoreServices_OS_X_10_5
808-- Performing Test HAVE_CoreServices_OS_X_10_5 - Failed
809-- Looking for cbreak in /Users/slabbe/Applications/sage-git/local/lib/libncurses.dylib
810-- Looking for cbreak in /Users/slabbe/Applications/sage-git/local/lib/libncurses.dylib - not found
811-- Looking for elf.h
812-- Looking for elf.h - not found
813-- Looking for CoreServices/CoreServices.h
814-- Looking for CoreServices/CoreServices.h - not found
815CMake Warning at Source/CMakeLists.txt:970 (message):
816  This compiler does not appear to support
817
818    #include <CoreServices/CoreServices.h>
819
820  Some CPack functionality may be limited.
821
822  See CMakeFiles/CMakeError.log for details of the failure.
823
824
825-- Looking for a Fortran compiler
826-- Looking for a Fortran compiler - /Users/slabbe/Applications/sage-git/local/bin/gfortran
827-- Performing Test run_pic_test
828-- Performing Test run_pic_test - Success
829-- Configuring done
830-- Generating done
831-- Build files have been written to: /Users/slabbe/Applications/sage-git/local/var/tmp/sage/build/cmake-3.8.1/src
832---------------------------------------------
833CMake has bootstrapped.  Now run make.
834Scanning dependencies of target cmsys_c
835[  0%] Building C object Source/kwsys/CMakeFiles/cmsys_c.dir/ProcessUNIX.c.o
836Scanning dependencies of target cmsys
837[  0%] Building C object Source/kwsys/CMakeFiles/cmsys_c.dir/Base64.c.o
838[  0%] Building C object Source/kwsys/CMakeFiles/cmsys.dir/ProcessUNIX.c.o
839[  1%] Building C object Source/kwsys/CMakeFiles/cmsys_c.dir/EncodingC.c.o
840[  1%] Building C object Source/kwsys/CMakeFiles/cmsys.dir/Base64.c.o
841[  1%] Building C object Source/kwsys/CMakeFiles/cmsys_c.dir/MD5.c.o
842[  1%] Building C object Source/kwsys/CMakeFiles/cmsys.dir/EncodingC.c.o
843[  1%] Building C object Source/kwsys/CMakeFiles/cmsys_c.dir/Terminal.c.o
844[  1%] Building C object Source/kwsys/CMakeFiles/cmsys.dir/MD5.c.o
845[  1%] Building C object Source/kwsys/CMakeFiles/cmsys_c.dir/System.c.o
846[  2%] Building C object Source/kwsys/CMakeFiles/cmsys.dir/Terminal.c.o
847[  2%] Building C object Source/kwsys/CMakeFiles/cmsys_c.dir/String.c.o
848[  2%] Building C object Source/kwsys/CMakeFiles/cmsys.dir/System.c.o
849[  2%] Linking C static library libcmsys_c.a
850[  2%] Building C object Source/kwsys/CMakeFiles/cmsys.dir/String.c.o
851[  2%] Building CXX object Source/kwsys/CMakeFiles/cmsys.dir/Directory.cxx.o
852[  2%] Built target cmsys_c
853[  2%] Building CXX object Source/kwsys/CMakeFiles/cmsys.dir/DynamicLoader.cxx.o
854[  2%] Building CXX object Source/kwsys/CMakeFiles/cmsys.dir/EncodingCXX.cxx.o
855Scanning dependencies of target kwiml_test
856[  3%] Building CXX object Source/kwsys/CMakeFiles/cmsys.dir/Glob.cxx.o
857[  4%] Building C object Utilities/KWIML/test/CMakeFiles/kwiml_test.dir/test.c.o
858[  4%] Building C object Utilities/KWIML/test/CMakeFiles/kwiml_test.dir/test_abi_C.c.o
859[  4%] Building CXX object Source/kwsys/CMakeFiles/cmsys.dir/RegularExpression.cxx.o
860[  4%] Building C object Utilities/KWIML/test/CMakeFiles/kwiml_test.dir/test_int_C.c.o
861[  4%] Building C object Utilities/KWIML/test/CMakeFiles/kwiml_test.dir/test_include_C.c.o
862[  4%] Building CXX object Source/kwsys/CMakeFiles/cmsys.dir/SystemTools.cxx.o
863[  4%] Building CXX object Utilities/KWIML/test/CMakeFiles/kwiml_test.dir/test_abi_CXX.cxx.o
864[  4%] Building CXX object Utilities/KWIML/test/CMakeFiles/kwiml_test.dir/test_int_CXX.cxx.o
865[  5%] Building CXX object Utilities/KWIML/test/CMakeFiles/kwiml_test.dir/test_include_CXX.cxx.o
866[  5%] Building CXX object Source/kwsys/CMakeFiles/cmsys.dir/CommandLineArguments.cxx.o
867[  5%] Linking CXX executable kwiml_test
868[  5%] Building CXX object Source/kwsys/CMakeFiles/cmsys.dir/IOStream.cxx.o
869[  5%] Building CXX object Source/kwsys/CMakeFiles/cmsys.dir/FStream.cxx.o
870[  5%] Built target kwiml_test
871[  5%] Building CXX object Source/kwsys/CMakeFiles/cmsys.dir/SystemInformation.cxx.o
872Scanning dependencies of target cmlibrhash
873[  5%] Building C object Utilities/cmlibrhash/CMakeFiles/cmlibrhash.dir/librhash/algorithms.c.o
874[  5%] Building C object Utilities/cmlibrhash/CMakeFiles/cmlibrhash.dir/librhash/byte_order.c.o
875[  6%] Linking CXX static library libcmsys.a
876[  7%] Building C object Utilities/cmlibrhash/CMakeFiles/cmlibrhash.dir/librhash/hex.c.o
877[  7%] Building C object Utilities/cmlibrhash/CMakeFiles/cmlibrhash.dir/librhash/md5.c.o
878[  7%] Built target cmsys
879[  7%] Building C object Utilities/cmlibrhash/CMakeFiles/cmlibrhash.dir/librhash/rhash.c.o
880Scanning dependencies of target cmcompress
881[  7%] Building C object Utilities/cmlibrhash/CMakeFiles/cmlibrhash.dir/librhash/sha1.c.o
882[  7%] Building C object Utilities/cmcompress/CMakeFiles/cmcompress.dir/cmcompress.c.o
883[  7%] Building C object Utilities/cmlibrhash/CMakeFiles/cmlibrhash.dir/librhash/sha256.c.o
884[  7%] Linking C static library libcmcompress.a
885[  7%] Building C object Utilities/cmlibrhash/CMakeFiles/cmlibrhash.dir/librhash/sha3.c.o
886[  8%] Building C object Utilities/cmlibrhash/CMakeFiles/cmlibrhash.dir/librhash/sha512.c.o
887[  8%] Built target cmcompress
888[  8%] Linking C static library libcmlibrhash.a
889Scanning dependencies of target cmexpat
890[  8%] Building C object Utilities/cmexpat/CMakeFiles/cmexpat.dir/lib/xmlparse.c.o
891[  8%] Built target cmlibrhash
892[  9%] Building C object Utilities/cmexpat/CMakeFiles/cmexpat.dir/lib/xmlrole.c.o
893[  9%] Building C object Utilities/cmexpat/CMakeFiles/cmexpat.dir/lib/xmltok.c.o
894[  9%] Building C object Utilities/cmexpat/CMakeFiles/cmexpat.dir/lib/xmltok_impl.c.o
895[  9%] Building C object Utilities/cmexpat/CMakeFiles/cmexpat.dir/lib/xmltok_ns.c.o
896[  9%] Linking C static library libcmexpat.a
897/Applications/Xcode.app/Contents/Developer/Toolchains/XcodeDefault.xctoolchain/usr/bin/ranlib: file: libcmexpat.a(xmltok_impl.c.o) has no symbols
898/Applications/Xcode.app/Contents/Developer/Toolchains/XcodeDefault.xctoolchain/usr/bin/ranlib: file: libcmexpat.a(xmltok_ns.c.o) has no symbols
899/Applications/Xcode.app/Contents/Developer/Toolchains/XcodeDefault.xctoolchain/usr/bin/ranlib: file: libcmexpat.a(xmltok_impl.c.o) has no symbols
900/Applications/Xcode.app/Contents/Developer/Toolchains/XcodeDefault.xctoolchain/usr/bin/ranlib: file: libcmexpat.a(xmltok_ns.c.o) has no symbols
901[  9%] Built target cmexpat
902Scanning dependencies of target cmjsoncpp
903[  9%] Building CXX object Utilities/cmjsoncpp/CMakeFiles/cmjsoncpp.dir/src/lib_json/json_reader.cpp.o
904[ 10%] Building CXX object Utilities/cmjsoncpp/CMakeFiles/cmjsoncpp.dir/src/lib_json/json_value.cpp.o
905[ 10%] Building CXX object Utilities/cmjsoncpp/CMakeFiles/cmjsoncpp.dir/src/lib_json/json_writer.cpp.o
906[ 10%] Linking CXX static library libcmjsoncpp.a
907[ 10%] Built target cmjsoncpp
908Scanning dependencies of target cmlibarchive
909Scanning dependencies of target cmForm
910[ 10%] Building C object Source/CursesDialog/form/CMakeFiles/cmForm.dir/fld_arg.c.o
911[ 10%] Building C object Utilities/cmlibarchive/libarchive/CMakeFiles/cmlibarchive.dir/archive_acl.c.o
912[ 10%] Building C object Source/CursesDialog/form/CMakeFiles/cmForm.dir/fld_attr.c.o
913[ 10%] Building C object Utilities/cmlibarchive/libarchive/CMakeFiles/cmlibarchive.dir/archive_check_magic.c.o
914[ 10%] Building C object Source/CursesDialog/form/CMakeFiles/cmForm.dir/fld_current.c.o
915[ 10%] Building C object Utilities/cmlibarchive/libarchive/CMakeFiles/cmlibarchive.dir/archive_cmdline.c.o
916[ 10%] Building C object Source/CursesDialog/form/CMakeFiles/cmForm.dir/fld_def.c.o
917[ 11%] Building C object Utilities/cmlibarchive/libarchive/CMakeFiles/cmlibarchive.dir/archive_cryptor.c.o
918[ 12%] Building C object Source/CursesDialog/form/CMakeFiles/cmForm.dir/fld_dup.c.o
919[ 12%] Building C object Utilities/cmlibarchive/libarchive/CMakeFiles/cmlibarchive.dir/archive_digest.c.o
920[ 12%] Building C object Source/CursesDialog/form/CMakeFiles/cmForm.dir/fld_ftchoice.c.o
921[ 12%] Building C object Utilities/cmlibarchive/libarchive/CMakeFiles/cmlibarchive.dir/archive_entry.c.o
922[ 12%] Building C object Source/CursesDialog/form/CMakeFiles/cmForm.dir/fld_ftlink.c.o
923[ 12%] Building C object Utilities/cmlibarchive/libarchive/CMakeFiles/cmlibarchive.dir/archive_entry_copy_stat.c.o
924[ 12%] Building C object Source/CursesDialog/form/CMakeFiles/cmForm.dir/fld_info.c.o
925[ 12%] Building C object Utilities/cmlibarchive/libarchive/CMakeFiles/cmlibarchive.dir/archive_entry_link_resolver.c.o
926[ 12%] Building C object Source/CursesDialog/form/CMakeFiles/cmForm.dir/fld_just.c.o
927[ 12%] Building C object Utilities/cmlibarchive/libarchive/CMakeFiles/cmlibarchive.dir/archive_entry_sparse.c.o
928[ 12%] Building C object Source/CursesDialog/form/CMakeFiles/cmForm.dir/fld_link.c.o
929[ 12%] Building C object Utilities/cmlibarchive/libarchive/CMakeFiles/cmlibarchive.dir/archive_entry_stat.c.o
930[ 13%] Building C object Source/CursesDialog/form/CMakeFiles/cmForm.dir/fld_max.c.o
931[ 14%] Building C object Utilities/cmlibarchive/libarchive/CMakeFiles/cmlibarchive.dir/archive_entry_strmode.c.o
932[ 14%] Building C object Source/CursesDialog/form/CMakeFiles/cmForm.dir/fld_move.c.o
933[ 14%] Building C object Utilities/cmlibarchive/libarchive/CMakeFiles/cmlibarchive.dir/archive_entry_xattr.c.o
934[ 14%] Building C object Source/CursesDialog/form/CMakeFiles/cmForm.dir/fld_newftyp.c.o
935[ 14%] Building C object Source/CursesDialog/form/CMakeFiles/cmForm.dir/fld_opts.c.o
936[ 14%] Building C object Utilities/cmlibarchive/libarchive/CMakeFiles/cmlibarchive.dir/archive_getdate.c.o
937[ 14%] Building C object Utilities/cmlibarchive/libarchive/CMakeFiles/cmlibarchive.dir/archive_hmac.c.o
938[ 14%] Building C object Source/CursesDialog/form/CMakeFiles/cmForm.dir/fld_pad.c.o
939[ 14%] Building C object Utilities/cmlibarchive/libarchive/CMakeFiles/cmlibarchive.dir/archive_match.c.o
940[ 14%] Building C object Source/CursesDialog/form/CMakeFiles/cmForm.dir/fld_page.c.o
941[ 14%] Building C object Utilities/cmlibarchive/libarchive/CMakeFiles/cmlibarchive.dir/archive_options.c.o
942[ 14%] Building C object Source/CursesDialog/form/CMakeFiles/cmForm.dir/fld_stat.c.o
943[ 16%] Building C object Source/CursesDialog/form/CMakeFiles/cmForm.dir/fld_type.c.o
944[ 16%] Building C object Utilities/cmlibarchive/libarchive/CMakeFiles/cmlibarchive.dir/archive_pack_dev.c.o
945[ 16%] Building C object Utilities/cmlibarchive/libarchive/CMakeFiles/cmlibarchive.dir/archive_pathmatch.c.o
946[ 16%] Building C object Source/CursesDialog/form/CMakeFiles/cmForm.dir/fld_user.c.o
947[ 16%] Building C object Utilities/cmlibarchive/libarchive/CMakeFiles/cmlibarchive.dir/archive_ppmd7.c.o
948[ 16%] Building C object Source/CursesDialog/form/CMakeFiles/cmForm.dir/frm_cursor.c.o
949[ 16%] Building C object Utilities/cmlibarchive/libarchive/CMakeFiles/cmlibarchive.dir/archive_random.c.o
950[ 16%] Building C object Source/CursesDialog/form/CMakeFiles/cmForm.dir/frm_data.c.o
951[ 16%] Building C object Utilities/cmlibarchive/libarchive/CMakeFiles/cmlibarchive.dir/archive_rb.c.o
952[ 16%] Building C object Source/CursesDialog/form/CMakeFiles/cmForm.dir/frm_def.c.o
953[ 16%] Building C object Utilities/cmlibarchive/libarchive/CMakeFiles/cmlibarchive.dir/archive_read.c.o
954[ 16%] Building C object Source/CursesDialog/form/CMakeFiles/cmForm.dir/frm_driver.c.o
955[ 17%] Building C object Utilities/cmlibarchive/libarchive/CMakeFiles/cmlibarchive.dir/archive_read_add_passphrase.c.o
956[ 18%] Building C object Source/CursesDialog/form/CMakeFiles/cmForm.dir/frm_hook.c.o
957[ 18%] Building C object Utilities/cmlibarchive/libarchive/CMakeFiles/cmlibarchive.dir/archive_read_append_filter.c.o
958[ 18%] Building C object Source/CursesDialog/form/CMakeFiles/cmForm.dir/frm_opts.c.o
959[ 18%] Building C object Utilities/cmlibarchive/libarchive/CMakeFiles/cmlibarchive.dir/archive_read_data_into_fd.c.o
960[ 18%] Building C object Source/CursesDialog/form/CMakeFiles/cmForm.dir/frm_page.c.o
961[ 18%] Building C object Utilities/cmlibarchive/libarchive/CMakeFiles/cmlibarchive.dir/archive_read_disk_entry_from_file.c.o
962[ 18%] Building C object Source/CursesDialog/form/CMakeFiles/cmForm.dir/frm_post.c.o
963[ 18%] Building C object Utilities/cmlibarchive/libarchive/CMakeFiles/cmlibarchive.dir/archive_read_disk_posix.c.o
964[ 18%] Building C object Source/CursesDialog/form/CMakeFiles/cmForm.dir/frm_req_name.c.o
965[ 18%] Building C object Utilities/cmlibarchive/libarchive/CMakeFiles/cmlibarchive.dir/archive_read_disk_set_standard_lookup.c.o
966[ 18%] Building C object Source/CursesDialog/form/CMakeFiles/cmForm.dir/frm_scale.c.o
967[ 19%] Building C object Source/CursesDialog/form/CMakeFiles/cmForm.dir/frm_sub.c.o
968[ 20%] Building C object Utilities/cmlibarchive/libarchive/CMakeFiles/cmlibarchive.dir/archive_read_extract.c.o
969[ 20%] Building C object Source/CursesDialog/form/CMakeFiles/cmForm.dir/frm_user.c.o
970[ 20%] Building C object Utilities/cmlibarchive/libarchive/CMakeFiles/cmlibarchive.dir/archive_read_extract2.c.o
971[ 20%] Building C object Source/CursesDialog/form/CMakeFiles/cmForm.dir/frm_win.c.o
972[ 20%] Building C object Utilities/cmlibarchive/libarchive/CMakeFiles/cmlibarchive.dir/archive_read_open_fd.c.o
973[ 20%] Building C object Source/CursesDialog/form/CMakeFiles/cmForm.dir/fty_alnum.c.o
974[ 20%] Building C object Utilities/cmlibarchive/libarchive/CMakeFiles/cmlibarchive.dir/archive_read_open_file.c.o
975[ 20%] Building C object Source/CursesDialog/form/CMakeFiles/cmForm.dir/fty_alpha.c.o
976[ 20%] Building C object Utilities/cmlibarchive/libarchive/CMakeFiles/cmlibarchive.dir/archive_read_open_filename.c.o
977[ 20%] Building C object Source/CursesDialog/form/CMakeFiles/cmForm.dir/fty_enum.c.o
978[ 20%] Building C object Utilities/cmlibarchive/libarchive/CMakeFiles/cmlibarchive.dir/archive_read_open_memory.c.o
979[ 21%] Building C object Source/CursesDialog/form/CMakeFiles/cmForm.dir/fty_int.c.o
980[ 21%] Building C object Utilities/cmlibarchive/libarchive/CMakeFiles/cmlibarchive.dir/archive_read_set_format.c.o
981[ 21%] Building C object Source/CursesDialog/form/CMakeFiles/cmForm.dir/fty_ipv4.c.o
982[ 22%] Building C object Utilities/cmlibarchive/libarchive/CMakeFiles/cmlibarchive.dir/archive_read_set_options.c.o
983[ 22%] Building C object Source/CursesDialog/form/CMakeFiles/cmForm.dir/fty_num.c.o
984[ 22%] Building C object Utilities/cmlibarchive/libarchive/CMakeFiles/cmlibarchive.dir/archive_read_support_filter_all.c.o
985[ 22%] Building C object Source/CursesDialog/form/CMakeFiles/cmForm.dir/fty_regex.c.o
986[ 22%] Building C object Utilities/cmlibarchive/libarchive/CMakeFiles/cmlibarchive.dir/archive_read_support_filter_bzip2.c.o
987[ 22%] Linking C static library libcmForm.a
988[ 22%] Building C object Utilities/cmlibarchive/libarchive/CMakeFiles/cmlibarchive.dir/archive_read_support_filter_compress.c.o
989[ 22%] Building C object Utilities/cmlibarchive/libarchive/CMakeFiles/cmlibarchive.dir/archive_read_support_filter_gzip.c.o
990[ 22%] Built target cmForm
991[ 22%] Building C object Utilities/cmlibarchive/libarchive/CMakeFiles/cmlibarchive.dir/archive_read_support_filter_grzip.c.o
992Scanning dependencies of target OSXScriptLauncher
993[ 23%] Building C object Utilities/cmlibarchive/libarchive/CMakeFiles/cmlibarchive.dir/archive_read_support_filter_lrzip.c.o
994[ 23%] Building CXX object Source/CMakeFiles/OSXScriptLauncher.dir/CPack/OSXScriptLauncher.cxx.o
995[ 23%] Building C object Utilities/cmlibarchive/libarchive/CMakeFiles/cmlibarchive.dir/archive_read_support_filter_lz4.c.o
996[ 23%] Building C object Utilities/cmlibarchive/libarchive/CMakeFiles/cmlibarchive.dir/archive_read_support_filter_lzop.c.o
997[ 23%] Building C object Utilities/cmlibarchive/libarchive/CMakeFiles/cmlibarchive.dir/archive_read_support_filter_none.c.o
998[ 23%] Building C object Utilities/cmlibarchive/libarchive/CMakeFiles/cmlibarchive.dir/archive_read_support_filter_program.c.o
999[ 23%] Building C object Utilities/cmlibarchive/libarchive/CMakeFiles/cmlibarchive.dir/archive_read_support_filter_rpm.c.o
1000[ 24%] Building C object Utilities/cmlibarchive/libarchive/CMakeFiles/cmlibarchive.dir/archive_read_support_filter_uu.c.o
1001[ 24%] Building C object Utilities/cmlibarchive/libarchive/CMakeFiles/cmlibarchive.dir/archive_read_support_filter_xz.c.o
1002[ 24%] Building C object Utilities/cmlibarchive/libarchive/CMakeFiles/cmlibarchive.dir/archive_read_support_format_7zip.c.o
1003[ 24%] Building C object Utilities/cmlibarchive/libarchive/CMakeFiles/cmlibarchive.dir/archive_read_support_format_all.c.o
1004[ 24%] Building C object Utilities/cmlibarchive/libarchive/CMakeFiles/cmlibarchive.dir/archive_read_support_format_ar.c.o
1005[ 24%] Building C object Utilities/cmlibarchive/libarchive/CMakeFiles/cmlibarchive.dir/archive_read_support_format_by_code.c.o
1006[ 25%] Building C object Utilities/cmlibarchive/libarchive/CMakeFiles/cmlibarchive.dir/archive_read_support_format_cab.c.o
1007[ 25%] Building C object Utilities/cmlibarchive/libarchive/CMakeFiles/cmlibarchive.dir/archive_read_support_format_cpio.c.o
1008[ 25%] Building C object Utilities/cmlibarchive/libarchive/CMakeFiles/cmlibarchive.dir/archive_read_support_format_empty.c.o
1009[ 25%] Building C object Utilities/cmlibarchive/libarchive/CMakeFiles/cmlibarchive.dir/archive_read_support_format_iso9660.c.o
1010[ 25%] Building C object Utilities/cmlibarchive/libarchive/CMakeFiles/cmlibarchive.dir/archive_read_support_format_lha.c.o
1011[ 25%] Building C object Utilities/cmlibarchive/libarchive/CMakeFiles/cmlibarchive.dir/archive_read_support_format_mtree.c.o
1012[ 26%] Building C object Utilities/cmlibarchive/libarchive/CMakeFiles/cmlibarchive.dir/archive_read_support_format_rar.c.o
1013[ 26%] Building C object Utilities/cmlibarchive/libarchive/CMakeFiles/cmlibarchive.dir/archive_read_support_format_raw.c.o
1014[ 26%] Building C object Utilities/cmlibarchive/libarchive/CMakeFiles/cmlibarchive.dir/archive_read_support_format_tar.c.o
1015[ 26%] Building C object Utilities/cmlibarchive/libarchive/CMakeFiles/cmlibarchive.dir/archive_read_support_format_warc.c.o
1016[ 26%] Building C object Utilities/cmlibarchive/libarchive/CMakeFiles/cmlibarchive.dir/archive_read_support_format_xar.c.o
1017[ 26%] Building C object Utilities/cmlibarchive/libarchive/CMakeFiles/cmlibarchive.dir/archive_read_support_format_zip.c.o
1018[ 26%] Building C object Utilities/cmlibarchive/libarchive/CMakeFiles/cmlibarchive.dir/archive_string.c.o
1019[ 27%] Building C object Utilities/cmlibarchive/libarchive/CMakeFiles/cmlibarchive.dir/archive_string_sprintf.c.o
1020[ 27%] Building C object Utilities/cmlibarchive/libarchive/CMakeFiles/cmlibarchive.dir/archive_util.c.o
1021[ 27%] Building C object Utilities/cmlibarchive/libarchive/CMakeFiles/cmlibarchive.dir/archive_virtual.c.o
1022[ 27%] Building C object Utilities/cmlibarchive/libarchive/CMakeFiles/cmlibarchive.dir/archive_write.c.o
1023[ 27%] Building C object Utilities/cmlibarchive/libarchive/CMakeFiles/cmlibarchive.dir/archive_write_disk_acl.c.o
1024[ 27%] Building C object Utilities/cmlibarchive/libarchive/CMakeFiles/cmlibarchive.dir/archive_write_disk_posix.c.o
1025[ 28%] Building C object Utilities/cmlibarchive/libarchive/CMakeFiles/cmlibarchive.dir/archive_write_disk_set_standard_lookup.c.o
1026[ 28%] Building C object Utilities/cmlibarchive/libarchive/CMakeFiles/cmlibarchive.dir/archive_write_open_fd.c.o
1027[ 28%] Building C object Utilities/cmlibarchive/libarchive/CMakeFiles/cmlibarchive.dir/archive_write_open_file.c.o
1028[ 28%] Building C object Utilities/cmlibarchive/libarchive/CMakeFiles/cmlibarchive.dir/archive_write_open_filename.c.o
1029[ 28%] Building C object Utilities/cmlibarchive/libarchive/CMakeFiles/cmlibarchive.dir/archive_write_open_memory.c.o
1030[ 28%] Building C object Utilities/cmlibarchive/libarchive/CMakeFiles/cmlibarchive.dir/archive_write_add_filter.c.o
1031[ 29%] Building C object Utilities/cmlibarchive/libarchive/CMakeFiles/cmlibarchive.dir/archive_write_add_filter_b64encode.c.o
1032[ 29%] Building C object Utilities/cmlibarchive/libarchive/CMakeFiles/cmlibarchive.dir/archive_write_add_filter_by_name.c.o
1033[ 29%] Building C object Utilities/cmlibarchive/libarchive/CMakeFiles/cmlibarchive.dir/archive_write_add_filter_bzip2.c.o
1034[ 29%] Building C object Utilities/cmlibarchive/libarchive/CMakeFiles/cmlibarchive.dir/archive_write_add_filter_compress.c.o
1035[ 29%] Building C object Utilities/cmlibarchive/libarchive/CMakeFiles/cmlibarchive.dir/archive_write_add_filter_grzip.c.o
1036[ 29%] Building C object Utilities/cmlibarchive/libarchive/CMakeFiles/cmlibarchive.dir/archive_write_add_filter_gzip.c.o
1037[ 30%] Building C object Utilities/cmlibarchive/libarchive/CMakeFiles/cmlibarchive.dir/archive_write_add_filter_lrzip.c.o
1038[ 30%] Building C object Utilities/cmlibarchive/libarchive/CMakeFiles/cmlibarchive.dir/archive_write_add_filter_lz4.c.o
1039[ 30%] Building C object Utilities/cmlibarchive/libarchive/CMakeFiles/cmlibarchive.dir/archive_write_add_filter_lzop.c.o
1040[ 30%] Building C object Utilities/cmlibarchive/libarchive/CMakeFiles/cmlibarchive.dir/archive_write_add_filter_none.c.o
1041[ 30%] Building C object Utilities/cmlibarchive/libarchive/CMakeFiles/cmlibarchive.dir/archive_write_add_filter_program.c.o
1042[ 30%] Building C object Utilities/cmlibarchive/libarchive/CMakeFiles/cmlibarchive.dir/archive_write_add_filter_uuencode.c.o
1043[ 30%] Building C object Utilities/cmlibarchive/libarchive/CMakeFiles/cmlibarchive.dir/archive_write_add_filter_xz.c.o
1044[ 31%] Building C object Utilities/cmlibarchive/libarchive/CMakeFiles/cmlibarchive.dir/archive_write_set_format.c.o
1045[ 31%] Building C object Utilities/cmlibarchive/libarchive/CMakeFiles/cmlibarchive.dir/archive_write_set_format_7zip.c.o
1046[ 31%] Building C object Utilities/cmlibarchive/libarchive/CMakeFiles/cmlibarchive.dir/archive_write_set_format_ar.c.o
1047[ 31%] Building C object Utilities/cmlibarchive/libarchive/CMakeFiles/cmlibarchive.dir/archive_write_set_format_by_name.c.o
1048[ 31%] Building C object Utilities/cmlibarchive/libarchive/CMakeFiles/cmlibarchive.dir/archive_write_set_format_cpio.c.o
1049[ 31%] Building C object Utilities/cmlibarchive/libarchive/CMakeFiles/cmlibarchive.dir/archive_write_set_format_cpio_newc.c.o
1050[ 32%] Building C object Utilities/cmlibarchive/libarchive/CMakeFiles/cmlibarchive.dir/archive_write_set_format_filter_by_ext.c.o
1051In file included from /Applications/Xcode.app/Contents/Developer/Platforms/MacOSX.platform/Developer/SDKs/MacOSX10.9.sdk/usr/include/dispatch/dispatch.h:50:0,
1052                 from /Applications/Xcode.app/Contents/Developer/Platforms/MacOSX.platform/Developer/SDKs/MacOSX10.9.sdk/System/Library/Frameworks/CoreFoundation.framework/Headers/CFStream.h:15,
1053                 from /Applications/Xcode.app/Contents/Developer/Platforms/MacOSX.platform/Developer/SDKs/MacOSX10.9.sdk/System/Library/Frameworks/CoreFoundation.framework/Headers/CFPropertyList.h:13,
1054                 from /Applications/Xcode.app/Contents/Developer/Platforms/MacOSX.platform/Developer/SDKs/MacOSX10.9.sdk/System/Library/Frameworks/CoreFoundation.framework/Headers/CoreFoundation.h:55,
1055                 from CPack/OSXScriptLauncher.cxx:11:
1056../../../../../../../include/dispatch/object.h:321:1: error: 'DISPATCH_UNAVAILABLE' does not name a type
1057 DISPATCH_UNAVAILABLE
1058 ^
1059In file included from /Applications/Xcode.app/Contents/Developer/Platforms/MacOSX.platform/Developer/SDKs/MacOSX10.9.sdk/usr/include/dispatch/dispatch.h:50:0,
1060                 from /Applications/Xcode.app/Contents/Developer/Platforms/MacOSX.platform/Developer/SDKs/MacOSX10.9.sdk/System/Library/Frameworks/CoreFoundation.framework/Headers/CFStream.h:15,
1061                 from /Applications/Xcode.app/Contents/Developer/Platforms/MacOSX.platform/Developer/SDKs/MacOSX10.9.sdk/System/Library/Frameworks/CoreFoundation.framework/Headers/CFPropertyList.h:13,
1062                 from /Applications/Xcode.app/Contents/Developer/Platforms/MacOSX.platform/Developer/SDKs/MacOSX10.9.sdk/System/Library/Frameworks/CoreFoundation.framework/Headers/CoreFoundation.h:55,
1063                 from CPack/OSXScriptLauncher.cxx:11:
1064../../../../../../../include/dispatch/object.h:358:1: error: 'DISPATCH_UNAVAILABLE' does not name a type
1065 DISPATCH_UNAVAILABLE
1066 ^
1067In file included from /Applications/Xcode.app/Contents/Developer/Platforms/MacOSX.platform/Developer/SDKs/MacOSX10.9.sdk/usr/include/dispatch/dispatch.h:50:0,
1068                 from /Applications/Xcode.app/Contents/Developer/Platforms/MacOSX.platform/Developer/SDKs/MacOSX10.9.sdk/System/Library/Frameworks/CoreFoundation.framework/Headers/CFStream.h:15,
1069                 from /Applications/Xcode.app/Contents/Developer/Platforms/MacOSX.platform/Developer/SDKs/MacOSX10.9.sdk/System/Library/Frameworks/CoreFoundation.framework/Headers/CFPropertyList.h:13,
1070                 from /Applications/Xcode.app/Contents/Developer/Platforms/MacOSX.platform/Developer/SDKs/MacOSX10.9.sdk/System/Library/Frameworks/CoreFoundation.framework/Headers/CoreFoundation.h:55,
1071                 from CPack/OSXScriptLauncher.cxx:11:
1072../../../../../../../include/dispatch/object.h:387:1: error: 'DISPATCH_UNAVAILABLE' does not name a type
1073 DISPATCH_UNAVAILABLE
1074 ^
1075In file included from /Applications/Xcode.app/Contents/Developer/Platforms/MacOSX.platform/Developer/SDKs/MacOSX10.9.sdk/usr/include/dispatch/dispatch.h:50:0,
1076                 from /Applications/Xcode.app/Contents/Developer/Platforms/MacOSX.platform/Developer/SDKs/MacOSX10.9.sdk/System/Library/Frameworks/CoreFoundation.framework/Headers/CFStream.h:15,
1077                 from /Applications/Xcode.app/Contents/Developer/Platforms/MacOSX.platform/Developer/SDKs/MacOSX10.9.sdk/System/Library/Frameworks/CoreFoundation.framework/Headers/CFPropertyList.h:13,
1078                 from /Applications/Xcode.app/Contents/Developer/Platforms/MacOSX.platform/Developer/SDKs/MacOSX10.9.sdk/System/Library/Frameworks/CoreFoundation.framework/Headers/CoreFoundation.h:55,
1079                 from CPack/OSXScriptLauncher.cxx:11:
1080../../../../../../../include/dispatch/object.h:418:1: error: 'DISPATCH_UNAVAILABLE' does not name a type
1081 DISPATCH_UNAVAILABLE
1082 ^
1083make[4]: *** [Source/CMakeFiles/OSXScriptLauncher.dir/CPack/OSXScriptLauncher.cxx.o] Error 1
1084make[3]: *** [Source/CMakeFiles/OSXScriptLauncher.dir/all] Error 2
1085make[3]: *** Waiting for unfinished jobs....
1086[ 32%] Building C object Utilities/cmlibarchive/libarchive/CMakeFiles/cmlibarchive.dir/archive_write_set_format_gnutar.c.o
1087[ 32%] Building C object Utilities/cmlibarchive/libarchive/CMakeFiles/cmlibarchive.dir/archive_write_set_format_iso9660.c.o
1088[ 32%] Building C object Utilities/cmlibarchive/libarchive/CMakeFiles/cmlibarchive.dir/archive_write_set_format_mtree.c.o
1089[ 32%] Building C object Utilities/cmlibarchive/libarchive/CMakeFiles/cmlibarchive.dir/archive_write_set_format_pax.c.o
1090[ 32%] Building C object Utilities/cmlibarchive/libarchive/CMakeFiles/cmlibarchive.dir/archive_write_set_format_raw.c.o
1091[ 33%] Building C object Utilities/cmlibarchive/libarchive/CMakeFiles/cmlibarchive.dir/archive_write_set_format_shar.c.o
1092[ 33%] Building C object Utilities/cmlibarchive/libarchive/CMakeFiles/cmlibarchive.dir/archive_write_set_format_ustar.c.o
1093[ 33%] Building C object Utilities/cmlibarchive/libarchive/CMakeFiles/cmlibarchive.dir/archive_write_set_format_v7tar.c.o
1094[ 33%] Building C object Utilities/cmlibarchive/libarchive/CMakeFiles/cmlibarchive.dir/archive_write_set_format_warc.c.o
1095[ 33%] Building C object Utilities/cmlibarchive/libarchive/CMakeFiles/cmlibarchive.dir/archive_write_set_format_xar.c.o
1096[ 33%] Building C object Utilities/cmlibarchive/libarchive/CMakeFiles/cmlibarchive.dir/archive_write_set_format_zip.c.o
1097[ 34%] Building C object Utilities/cmlibarchive/libarchive/CMakeFiles/cmlibarchive.dir/archive_write_set_options.c.o
1098[ 34%] Building C object Utilities/cmlibarchive/libarchive/CMakeFiles/cmlibarchive.dir/archive_write_set_passphrase.c.o
1099[ 34%] Building C object Utilities/cmlibarchive/libarchive/CMakeFiles/cmlibarchive.dir/filter_fork_posix.c.o
1100[ 34%] Building C object Utilities/cmlibarchive/libarchive/CMakeFiles/cmlibarchive.dir/xxhash.c.o
1101[ 34%] Linking C static library libcmlibarchive.a
1102[ 34%] Built target cmlibarchive
1103make[2]: *** [all] Error 2
1104Error installing CMake.
1105
1106real    3m12.199s
1107user    1m45.730s
1108sys     1m13.808s
1109************************************************************************
1110Error installing package cmake-3.8.1
1111************************************************************************
1112Please email sage-devel (http://groups.google.com/group/sage-devel)
1113explaining the problem and including the log file
1114  /Users/slabbe/Applications/sage-git/logs/pkgs/cmake-3.8.1.log
1115Describe your computer, operating system, etc.
1116If you want to try to fix the problem yourself, *don't* just cd to
1117/Users/slabbe/Applications/sage-git/local/var/tmp/sage/build/cmake-3.8.1 and type 'make' or whatever is appropriate.
1118Instead, the following commands setup all environment variables
1119correctly and load a subshell for you to debug the error:
1120  (cd '/Users/slabbe/Applications/sage-git/local/var/tmp/sage/build/cmake-3.8.1' && '/Users/slabbe/Applications/sage-git/sage' --sh)
1121When you are done debugging, you can type "exit" to leave the subshell.
1122************************************************************************