Ticket #19663: pynac-0.5.2.log

File pynac-0.5.2.log, 36.1 KB (added by tscrim, 4 years ago)
Line 
1Found local metadata for pynac-0.5.2
2Using cached file /home/Travis/sage/upstream/pynac-0.5.2.tar.bz2
3pynac-0.5.2
4====================================================
5Setting up build directory for pynac-0.5.2
6Finished set up
7****************************************************
8Host system:
9CYGWIN_NT-6.3-WOW apricot 2.3.1(0.291/5/3) 2015-11-14 12:42 i686 Cygwin
10****************************************************
11C compiler: gcc
12C compiler version:
13Using built-in specs.
14COLLECT_GCC=gcc
15COLLECT_LTO_WRAPPER=/usr/lib/gcc/i686-pc-cygwin/4.9.3/lto-wrapper.exe
16Target: i686-pc-cygwin
17Configured with: /cygdrive/i/szsz/tmpp/gcc/gcc-4.9.3-1.i686/src/gcc-4.9.3/configure --srcdir=/cygdrive/i/szsz/tmpp/gcc/gcc-4.9.3-1.i686/src/gcc-4.9.3 --prefix=/usr --exec-prefix=/usr --localstatedir=/var --sysconfdir=/etc --docdir=/usr/share/doc/gcc --htmldir=/usr/share/doc/gcc/html -C --build=i686-pc-cygwin --host=i686-pc-cygwin --target=i686-pc-cygwin --without-libiconv-prefix --without-libintl-prefix --libexecdir=/usr/lib --enable-shared --enable-shared-libgcc --enable-static --enable-version-specific-runtime-libs --enable-bootstrap --enable-__cxa_atexit --with-dwarf2 --with-arch=i686 --with-tune=generic --disable-sjlj-exceptions --enable-languages=ada,c,c++,fortran,java,lto,objc,obj-c++ --enable-graphite --enable-threads=posix --enable-libatomic --enable-libgomp --disable-libitm --enable-libquadmath --enable-libquadmath-support --enable-libssp --enable-libada --enable-libjava --enable-libgcj-sublibs --disable-java-awt --disable-symvers --with-ecj-jar=/usr/share/java/ecj.jar --with-gnu-ld --with-gnu-as --with-cloog-include=/usr/include/cloog-isl --without-libiconv-prefix --without-libintl-prefix --with-system-zlib --enable-linker-build-id
18Thread model: posix
19gcc version 4.9.3 (GCC)
20****************************************************
21Starting build...
22Running build_pynac...
23checking for a BSD-compatible install... /usr/bin/install -c
24checking whether build environment is sane... yes
25checking for a thread-safe mkdir -p... /usr/bin/mkdir -p
26checking for gawk... gawk
27checking whether make sets $(MAKE)... yes
28checking whether make supports nested variables... yes
29checking for style of include used by make... GNU
30checking for gcc... gcc
31checking whether the C compiler works... yes
32checking for C compiler default output file name... a.exe
33checking for suffix of executables... .exe
34checking whether we are cross compiling... no
35checking for suffix of object files... o
36checking whether we are using the GNU C compiler... yes
37checking whether gcc accepts -g... yes
38checking for gcc option to accept ISO C89... none needed
39checking dependency style of gcc... gcc3
40checking for python... /home/Travis/sage/local/bin/python
41checking for a version of Python >= '2.1.0'... yes
42checking for the distutils Python package... yes
43checking for Python include path... -I/home/Travis/sage/local/include/python2.7
44checking for Python library path... -L/home/Travis/sage/local/lib -lpython2.7
45checking for Python site-packages path... /home/Travis/sage/local/lib/python2.7/site-packages
46checking python extra libraries... -ldl -lm
47checking python extra linking flags...
48checking consistency of all components of python development environment... yes
49checking build system type... i686-pc-cygwin
50checking host system type... i686-pc-cygwin
51checking for Cygwin...
52checking whether make supports nested variables... (cached) yes
53checking whether we are using the GNU C++ compiler... yes
54checking whether g++ accepts -g... yes
55checking dependency style of g++... gcc3
56checking how to run the C++ preprocessor... g++ -E
57checking how to print strings... printf
58checking for a sed that does not truncate output... /usr/bin/sed
59checking for grep that handles long lines and -e... /usr/bin/grep
60checking for egrep... /usr/bin/grep -E
61checking for fgrep... /usr/bin/grep -F
62checking for ld used by gcc... ld
63checking if the linker (ld) is GNU ld... yes
64checking for BSD- or MS-compatible name lister (nm)... /usr/bin/nm -B
65checking the name lister (/usr/bin/nm -B) interface... BSD nm
66checking whether ln -s works... yes
67checking the maximum length of command line arguments... 8192
68checking whether the shell understands some XSI constructs... yes
69checking whether the shell understands "+="... yes
70checking how to convert i686-pc-cygwin file names to i686-pc-cygwin format... func_convert_file_noop
71checking how to convert i686-pc-cygwin file names to toolchain format... func_convert_file_noop
72checking for ld option to reload object files... -r
73checking for objdump... objdump
74checking how to recognize dependent libraries... file_magic ^x86 archive import|^x86 DLL
75checking for dlltool... dlltool
76checking how to associate runtime and link libraries... func_cygming_dll_for_implib
77checking for archiver @FILE support... @
78checking for strip... strip
79checking for ranlib... ranlib
80checking command to parse /usr/bin/nm -B output from gcc object... ok
81checking for sysroot... no
82checking for mt... no
83checking if : is a manifest tool... no
84checking how to run the C preprocessor... gcc -E
85checking for ANSI C header files... yes
86checking for sys/types.h... yes
87checking for sys/stat.h... yes
88checking for stdlib.h... yes
89checking for string.h... yes
90checking for memory.h... yes
91checking for strings.h... yes
92checking for inttypes.h... yes
93checking for stdint.h... yes
94checking for unistd.h... yes
95checking for dlfcn.h... yes
96checking for objdir... .libs
97checking if gcc supports -fno-rtti -fno-exceptions... no
98checking for gcc option to produce PIC... -DDLL_EXPORT -DPIC
99checking if gcc PIC flag -DDLL_EXPORT -DPIC works... yes
100checking if gcc static flag -static works... yes
101checking if gcc supports -c -o file.o... yes
102checking if gcc supports -c -o file.o... (cached) yes
103checking whether the gcc linker (ld) supports shared libraries... yes
104checking whether -lc should be explicitly linked in... yes
105checking dynamic linker characteristics... Win32 ld.exe
106checking how to hardcode library paths into programs... immediate
107checking whether stripping libraries is possible... yes
108checking if libtool supports shared libraries... yes
109checking whether to build shared libraries... yes
110checking whether to build static libraries... no
111checking how to run the C++ preprocessor... g++ -E
112checking for ld used by g++... ld
113checking if the linker (ld) is GNU ld... yes
114checking whether the g++ linker (ld) supports shared libraries... yes
115checking for g++ option to produce PIC... -DDLL_EXPORT -DPIC
116checking if g++ PIC flag -DDLL_EXPORT -DPIC works... yes
117checking if g++ static flag -static works... yes
118checking if g++ supports -c -o file.o... yes
119checking if g++ supports -c -o file.o... (cached) yes
120checking whether the g++ linker (ld) supports shared libraries... yes
121checking dynamic linker characteristics... Win32 ld.exe
122checking how to hardcode library paths into programs... immediate
123checking for as... as
124checking for dlltool... (cached) dlltool
125checking for objdump... (cached) objdump
126checking size of int... 4
127checking size of long... 4
128checking size of long long... 8
129checking size of long double... 12
130checking size of void *... 4
131checking whether g++ supports C++11 features by default... no
132checking whether g++ supports C++11 features with -std=gnu++11... yes
133checking iosfwd usability... yes
134checking iosfwd presence... yes
135checking for iosfwd... yes
136checking iostream usability... yes
137checking iostream presence... yes
138checking for iostream... yes
139checking vector usability... yes
140checking vector presence... yes
141checking for vector... yes
142checking list usability... yes
143checking list presence... yes
144checking for list... yes
145checking map usability... yes
146checking map presence... yes
147checking for map... yes
148checking string usability... yes
149checking string presence... yes
150checking for string... yes
151checking sstream usability... yes
152checking sstream presence... yes
153checking for sstream... yes
154checking typeinfo usability... yes
155checking typeinfo presence... yes
156checking for typeinfo... yes
157checking stdexcept usability... yes
158checking stdexcept presence... yes
159checking for stdexcept... yes
160checking algorithm usability... yes
161checking algorithm presence... yes
162checking for algorithm... yes
163checking limits usability... yes
164checking limits presence... yes
165checking for limits... yes
166checking gmp.h usability... yes
167checking gmp.h presence... yes
168checking for gmp.h... yes
169checking for rm... /usr/bin/rm
170checking that generated files are newer than configure... done
171configure: creating ./config.status
172config.status: creating Makefile
173config.status: creating pynac.spec
174config.status: creating pynac.pc
175config.status: creating ginac/Makefile
176config.status: creating ginac/version.h
177config.status: creating config.h
178config.status: executing depfiles commands
179config.status: executing libtool commands
180Configuration of GiNaC 0.5.2 done. Now type "make".
181make[3]: Entering directory '/home/Travis/sage/local/var/tmp/sage/build/pynac-0.5.2/src'
182make  all-recursive
183make[4]: Entering directory '/home/Travis/sage/local/var/tmp/sage/build/pynac-0.5.2/src'
184Making all in ginac
185make[5]: Entering directory '/home/Travis/sage/local/var/tmp/sage/build/pynac-0.5.2/src/ginac'
186  CXX      libpynac_la-py_funcs.lo
187  CXX      libpynac_la-add.lo
188  CXX      libpynac_la-archive.lo
189  CXX      libpynac_la-basic.lo
190  CXX      libpynac_la-clifford.lo
191  CXX      libpynac_la-constant.lo
192  CXX      libpynac_la-ex.lo
193  CXX      libpynac_la-expair.lo
194  CXX      libpynac_la-expairseq.lo
195  CXX      libpynac_la-exprseq.lo
196  CXX      libpynac_la-fail.lo
197  CXX      libpynac_la-fderivative.lo
198  CXX      libpynac_la-function.lo
199  CXX      libpynac_la-idx.lo
200  CXX      libpynac_la-indexed.lo
201  CXX      libpynac_la-infinity.lo
202  CXX      libpynac_la-inifcns.lo
203  CXX      libpynac_la-inifcns_trans.lo
204  CXX      libpynac_la-inifcns_gamma.lo
205  CXX      libpynac_la-inifcns_nstdsums.lo
206  CXX      libpynac_la-integral.lo
207  CXX      libpynac_la-lst.lo
208  CXX      libpynac_la-matrix.lo
209  CXX      libpynac_la-mul.lo
210  CXX      libpynac_la-ncmul.lo
211  CXX      libpynac_la-normal.lo
212  CXX      libpynac_la-numeric.lo
213  CXX      libpynac_la-operators.lo
214  CXX      libpynac_la-power.lo
215  CXX      libpynac_la-registrar.lo
216  CXX      libpynac_la-relational.lo
217  CXX      libpynac_la-remember.lo
218  CXX      libpynac_la-pseries.lo
219  CXX      libpynac_la-print.lo
220  CXX      libpynac_la-symbol.lo
221  CXX      libpynac_la-symmetry.lo
222  CXX      libpynac_la-tensor.lo
223  CXX      libpynac_la-utils.lo
224  CXX      libpynac_la-wildcard.lo
225  CXX      libpynac_la-templates.lo
226  CXX      libpynac_la-infoflagbase.lo
227  CXX      libpynac_la-order.lo
228  CXX      libpynac_la-assume.lo
229  CXXLD    libpynac.la
230.libs/libpynac_la-numeric.o: In function `ZN5GiNaC7numericD2Ev':
231/home/Travis/sage/local/var/tmp/sage/build/pynac-0.5.2/src/ginac/numeric.cpp:621: undefined reference to `_imp____gmpq_clear'
232/home/Travis/sage/local/var/tmp/sage/build/pynac-0.5.2/src/ginac/numeric.cpp:618: undefined reference to `_imp____gmpz_clear'
233.libs/libpynac_la-numeric.o: In function `mpq_pythonhash':
234/home/Travis/sage/local/var/tmp/sage/build/pynac-0.5.2/src/ginac/numeric.cpp:419: undefined reference to `_imp____gmpq_init'
235/home/Travis/sage/local/var/tmp/sage/build/pynac-0.5.2/src/ginac/numeric.cpp:420: undefined reference to `_imp____gmpq_set'
236/home/Travis/sage/local/var/tmp/sage/build/pynac-0.5.2/src/ginac/numeric.cpp:421: undefined reference to `_imp____gmpq_canonicalize'
237/home/Travis/sage/local/var/tmp/sage/build/pynac-0.5.2/src/ginac/numeric.cpp:429: undefined reference to `_imp____gmpq_clear'
238.libs/libpynac_la-numeric.o: In function `ZNK5GiNaC7numeric7archiveERNS_12archive_nodeE':
239/home/Travis/sage/local/var/tmp/sage/build/pynac-0.5.2/src/ginac/numeric.cpp:694: undefined reference to `_imp____gmpz_sizeinbase'
240/home/Travis/sage/local/var/tmp/sage/build/pynac-0.5.2/src/ginac/numeric.cpp:697: undefined reference to `_imp____gmpq_get_str'
241/home/Travis/sage/local/var/tmp/sage/build/pynac-0.5.2/src/ginac/numeric.cpp:687: undefined reference to `_imp____gmpz_sizeinbase'
242/home/Travis/sage/local/var/tmp/sage/build/pynac-0.5.2/src/ginac/numeric.cpp:688: undefined reference to `_imp____gmpz_get_str'
243.libs/libpynac_la-numeric.o: In function `ZN5GiNaClsERSoRKNS_7numericE':
244/home/Travis/sage/local/var/tmp/sage/build/pynac-0.5.2/src/ginac/numeric.cpp:292: undefined reference to `_imp____gmpz_sizeinbase'
245/home/Travis/sage/local/var/tmp/sage/build/pynac-0.5.2/src/ginac/numeric.cpp:295: undefined reference to `_imp____gmpq_get_str'
246/home/Travis/sage/local/var/tmp/sage/build/pynac-0.5.2/src/ginac/numeric.cpp:286: undefined reference to `_imp____gmpz_sizeinbase'
247/home/Travis/sage/local/var/tmp/sage/build/pynac-0.5.2/src/ginac/numeric.cpp:287: undefined reference to `_imp____gmpz_get_str'
248.libs/libpynac_la-numeric.o: In function `ZN5GiNaC7numericaSERKS0_':
249/home/Travis/sage/local/var/tmp/sage/build/pynac-0.5.2/src/ginac/numeric.cpp:344: undefined reference to `_imp____gmpq_init'
250/home/Travis/sage/local/var/tmp/sage/build/pynac-0.5.2/src/ginac/numeric.cpp:345: undefined reference to `_imp____gmpq_set'
251/home/Travis/sage/local/var/tmp/sage/build/pynac-0.5.2/src/ginac/numeric.cpp:340: undefined reference to `_imp____gmpz_init'
252/home/Travis/sage/local/var/tmp/sage/build/pynac-0.5.2/src/ginac/numeric.cpp:341: undefined reference to `_imp____gmpz_set'
253/home/Travis/sage/local/var/tmp/sage/build/pynac-0.5.2/src/ginac/numeric.cpp:328: undefined reference to `_imp____gmpq_clear'
254/home/Travis/sage/local/var/tmp/sage/build/pynac-0.5.2/src/ginac/numeric.cpp:325: undefined reference to `_imp____gmpz_clear'
255.libs/libpynac_la-numeric.o: In function `ZN5GiNaC7numericC2Ev':
256/home/Travis/sage/local/var/tmp/sage/build/pynac-0.5.2/src/ginac/numeric.cpp:452: undefined reference to `_imp____gmpz_init'
257/home/Travis/sage/local/var/tmp/sage/build/pynac-0.5.2/src/ginac/numeric.cpp:453: undefined reference to `_imp____gmpz_set_ui'
258.libs/libpynac_la-numeric.o: In function `ZN5GiNaC7numericC2ERKS0_':
259/home/Travis/sage/local/var/tmp/sage/build/pynac-0.5.2/src/ginac/numeric.cpp:480: undefined reference to `_imp____gmpq_init'
260/home/Travis/sage/local/var/tmp/sage/build/pynac-0.5.2/src/ginac/numeric.cpp:481: undefined reference to `_imp____gmpq_set'
261/home/Travis/sage/local/var/tmp/sage/build/pynac-0.5.2/src/ginac/numeric.cpp:476: undefined reference to `_imp____gmpz_init'
262/home/Travis/sage/local/var/tmp/sage/build/pynac-0.5.2/src/ginac/numeric.cpp:477: undefined reference to `_imp____gmpz_set'
263.libs/libpynac_la-numeric.o: In function `ZN5GiNaC7numericC2EP7_objectb':
264/home/Travis/sage/local/var/tmp/sage/build/pynac-0.5.2/src/ginac/numeric.cpp:491: undefined reference to `_imp____gmpz_init'
265/home/Travis/sage/local/var/tmp/sage/build/pynac-0.5.2/src/ginac/numeric.cpp:492: undefined reference to `_imp____gmpz_set_si'
266/home/Travis/sage/local/var/tmp/sage/build/pynac-0.5.2/src/ginac/numeric.cpp:501: undefined reference to `_imp____gmpz_init_set'
267/home/Travis/sage/local/var/tmp/sage/build/pynac-0.5.2/src/ginac/numeric.cpp:509: undefined reference to `_imp____gmpq_init'
268/home/Travis/sage/local/var/tmp/sage/build/pynac-0.5.2/src/ginac/numeric.cpp:510: undefined reference to `_imp____gmpq_set'
269.libs/libpynac_la-numeric.o: In function `ZN5GiNaC7numericC2Ei':
270/home/Travis/sage/local/var/tmp/sage/build/pynac-0.5.2/src/ginac/numeric.cpp:533: undefined reference to `_imp____gmpz_init'
271/home/Travis/sage/local/var/tmp/sage/build/pynac-0.5.2/src/ginac/numeric.cpp:534: undefined reference to `_imp____gmpz_set_si'
272.libs/libpynac_la-numeric.o: In function `ZN5GiNaC7numericC2Ej':
273/home/Travis/sage/local/var/tmp/sage/build/pynac-0.5.2/src/ginac/numeric.cpp:541: undefined reference to `_imp____gmpz_init'
274/home/Travis/sage/local/var/tmp/sage/build/pynac-0.5.2/src/ginac/numeric.cpp:542: undefined reference to `_imp____gmpz_set_ui'
275.libs/libpynac_la-numeric.o: In function `ZN5GiNaC7numericC2El':
276/home/Travis/sage/local/var/tmp/sage/build/pynac-0.5.2/src/ginac/numeric.cpp:549: undefined reference to `_imp____gmpz_init'
277/home/Travis/sage/local/var/tmp/sage/build/pynac-0.5.2/src/ginac/numeric.cpp:550: undefined reference to `_imp____gmpz_set_si'
278.libs/libpynac_la-numeric.o: In function `ZN5GiNaC7numericC2Em':
279/home/Travis/sage/local/var/tmp/sage/build/pynac-0.5.2/src/ginac/numeric.cpp:557: undefined reference to `_imp____gmpz_init'
280/home/Travis/sage/local/var/tmp/sage/build/pynac-0.5.2/src/ginac/numeric.cpp:558: undefined reference to `_imp____gmpz_set_ui'
281.libs/libpynac_la-numeric.o: In function `ZN5GiNaC7numericC2EP12__mpz_struct':
282/home/Travis/sage/local/var/tmp/sage/build/pynac-0.5.2/src/ginac/numeric.cpp:565: undefined reference to `_imp____gmpz_init_set'
283/home/Travis/sage/local/var/tmp/sage/build/pynac-0.5.2/src/ginac/numeric.cpp:566: undefined reference to `_imp____gmpz_clear'
284.libs/libpynac_la-numeric.o: In function `ZN5GiNaC7numericC2EP12__mpq_struct':
285/home/Travis/sage/local/var/tmp/sage/build/pynac-0.5.2/src/ginac/numeric.cpp:573: undefined reference to `_imp____gmpq_init'
286/home/Travis/sage/local/var/tmp/sage/build/pynac-0.5.2/src/ginac/numeric.cpp:574: undefined reference to `_imp____gmpq_set'
287/home/Travis/sage/local/var/tmp/sage/build/pynac-0.5.2/src/ginac/numeric.cpp:576: undefined reference to `_imp____gmpq_clear'
288.libs/libpynac_la-numeric.o: In function `ZN5GiNaC7numericC2Ell':
289/home/Travis/sage/local/var/tmp/sage/build/pynac-0.5.2/src/ginac/numeric.cpp:595: undefined reference to `_imp____gmpq_init'
290/home/Travis/sage/local/var/tmp/sage/build/pynac-0.5.2/src/ginac/numeric.cpp:596: undefined reference to `_imp____gmpq_set_si'
291/home/Travis/sage/local/var/tmp/sage/build/pynac-0.5.2/src/ginac/numeric.cpp:597: undefined reference to `_imp____gmpq_canonicalize'
292/home/Travis/sage/local/var/tmp/sage/build/pynac-0.5.2/src/ginac/numeric.cpp:588: undefined reference to `_imp____gmpz_init'
293/home/Travis/sage/local/var/tmp/sage/build/pynac-0.5.2/src/ginac/numeric.cpp:589: undefined reference to `_imp____gmpz_set_si'
294.libs/libpynac_la-numeric.o: In function `ZN5GiNaC7numericC2ERKNS_12archive_nodeERNS_9containerISt4listEE':
295/home/Travis/sage/local/var/tmp/sage/build/pynac-0.5.2/src/ginac/numeric.cpp:649: undefined reference to `_imp____gmpq_init'
296/home/Travis/sage/local/var/tmp/sage/build/pynac-0.5.2/src/ginac/numeric.cpp:650: undefined reference to `_imp____gmpq_set_str'
297/home/Travis/sage/local/var/tmp/sage/build/pynac-0.5.2/src/ginac/numeric.cpp:644: undefined reference to `_imp____gmpz_init'
298/home/Travis/sage/local/var/tmp/sage/build/pynac-0.5.2/src/ginac/numeric.cpp:645: undefined reference to `_imp____gmpz_set_str'
299.libs/libpynac_la-numeric.o: In function `ZNK5GiNaC7numeric8negativeEv':
300/home/Travis/sage/local/var/tmp/sage/build/pynac-0.5.2/src/ginac/numeric.cpp:1323: undefined reference to `_imp____gmpq_init'
301/home/Travis/sage/local/var/tmp/sage/build/pynac-0.5.2/src/ginac/numeric.cpp:1324: undefined reference to `_imp____gmpq_set'
302/home/Travis/sage/local/var/tmp/sage/build/pynac-0.5.2/src/ginac/numeric.cpp:1318: undefined reference to `_imp____gmpz_init_set'
303.libs/libpynac_la-numeric.o: In function `ZNK5GiNaC7numeric10is_integerEv':
304/home/Travis/sage/local/var/tmp/sage/build/pynac-0.5.2/src/ginac/numeric.cpp:1463: undefined reference to `_imp____gmpq_init'
305/home/Travis/sage/local/var/tmp/sage/build/pynac-0.5.2/src/ginac/numeric.cpp:1464: undefined reference to `_imp____gmpq_set'
306/home/Travis/sage/local/var/tmp/sage/build/pynac-0.5.2/src/ginac/numeric.cpp:1465: undefined reference to `_imp____gmpq_canonicalize'
307/home/Travis/sage/local/var/tmp/sage/build/pynac-0.5.2/src/ginac/numeric.cpp:1466: undefined reference to `_imp____gmpz_cmp_ui'
308/home/Travis/sage/local/var/tmp/sage/build/pynac-0.5.2/src/ginac/numeric.cpp:1467: undefined reference to `_imp____gmpq_clear'
309.libs/libpynac_la-numeric.o: In function `ZNK5GiNaC7numeric7is_evenEv':
310/home/Travis/sage/local/var/tmp/sage/build/pynac-0.5.2/src/ginac/numeric.cpp:1524: undefined reference to `_imp____gmpz_tstbit'
311.libs/libpynac_la-numeric.o: In function `ZNK5GiNaC7numeric6is_oddEv':
312/home/Travis/sage/local/var/tmp/sage/build/pynac-0.5.2/src/ginac/numeric.cpp:1541: undefined reference to `_imp____gmpz_tstbit'
313.libs/libpynac_la-numeric.o: In function `ZNK5GiNaC7numeric8is_primeEv':
314/home/Travis/sage/local/var/tmp/sage/build/pynac-0.5.2/src/ginac/numeric.cpp:1561: undefined reference to `_imp____gmpz_probab_prime_p'
315.libs/libpynac_la-numeric.o: In function `ZNK5GiNaC7numeric7to_longEv':
316/home/Travis/sage/local/var/tmp/sage/build/pynac-0.5.2/src/ginac/numeric.cpp:1836: undefined reference to `_imp____gmpz_init'
317/home/Travis/sage/local/var/tmp/sage/build/pynac-0.5.2/src/ginac/numeric.cpp:1837: undefined reference to `_imp____gmpz_fdiv_q'
318/home/Travis/sage/local/var/tmp/sage/build/pynac-0.5.2/src/ginac/numeric.cpp:1838: undefined reference to `_imp____gmpz_get_si'
319/home/Travis/sage/local/var/tmp/sage/build/pynac-0.5.2/src/ginac/numeric.cpp:1839: undefined reference to `_imp____gmpz_clear'
320/home/Travis/sage/local/var/tmp/sage/build/pynac-0.5.2/src/ginac/numeric.cpp:1833: undefined reference to `_imp____gmpz_get_si'
321.libs/libpynac_la-numeric.o: In function `ZNK5GiNaC7numeric11to_pyobjectEv':
322/home/Travis/sage/local/var/tmp/sage/build/pynac-0.5.2/src/ginac/numeric.cpp:1872: undefined reference to `_imp____gmpq_init'
323/home/Travis/sage/local/var/tmp/sage/build/pynac-0.5.2/src/ginac/numeric.cpp:1873: undefined reference to `_imp____gmpq_set'
324/home/Travis/sage/local/var/tmp/sage/build/pynac-0.5.2/src/ginac/numeric.cpp:1875: undefined reference to `_imp____gmpq_clear'
325/home/Travis/sage/local/var/tmp/sage/build/pynac-0.5.2/src/ginac/numeric.cpp:1866: undefined reference to `_imp____gmpz_init_set'
326/home/Travis/sage/local/var/tmp/sage/build/pynac-0.5.2/src/ginac/numeric.cpp:1868: undefined reference to `_imp____gmpz_clear'
327.libs/libpynac_la-numeric.o: In function `ZNK5GiNaC7numeric9to_doubleEv':
328/home/Travis/sage/local/var/tmp/sage/build/pynac-0.5.2/src/ginac/numeric.cpp:1908: undefined reference to `_imp____gmpq_get_d'
329/home/Travis/sage/local/var/tmp/sage/build/pynac-0.5.2/src/ginac/numeric.cpp:1906: undefined reference to `_imp____gmpz_get_d'
330.libs/libpynac_la-numeric.o: In function `ZNK5GiNaC7numeric5numerEv':
331/home/Travis/sage/local/var/tmp/sage/build/pynac-0.5.2/src/ginac/numeric.cpp:1970: undefined reference to `_imp____gmpz_init_set'
332.libs/libpynac_la-numeric.o: In function `ZNK5GiNaC7numeric5denomEv':
333/home/Travis/sage/local/var/tmp/sage/build/pynac-0.5.2/src/ginac/numeric.cpp:1999: undefined reference to `_imp____gmpz_init_set'
334.libs/libpynac_la-numeric.o: In function `ZNK5GiNaC7numeric3absEv':
335/home/Travis/sage/local/var/tmp/sage/build/pynac-0.5.2/src/ginac/numeric.cpp:2146: undefined reference to `_imp____gmpq_init'
336.libs/libpynac_la-numeric.o: In function `_gmpq_abs':
337/home/Travis/sage/local/include/gmp.h:2078: undefined reference to `_imp____gmpq_set'
338.libs/libpynac_la-numeric.o: In function `ZNK5GiNaC7numeric3absEv':
339/home/Travis/sage/local/var/tmp/sage/build/pynac-0.5.2/src/ginac/numeric.cpp:2140: undefined reference to `_imp____gmpz_init'
340.libs/libpynac_la-numeric.o: In function `_gmpz_abs':
341/home/Travis/sage/local/include/gmp.h:1898: undefined reference to `_imp____gmpz_set'
342.libs/libpynac_la-numeric.o: In function `ZNK5GiNaC7numeric3modERKS0_':
343/home/Travis/sage/local/var/tmp/sage/build/pynac-0.5.2/src/ginac/numeric.cpp:2157: undefined reference to `_imp____gmpz_init'
344/home/Travis/sage/local/var/tmp/sage/build/pynac-0.5.2/src/ginac/numeric.cpp:2158: undefined reference to `_imp____gmpz_mod'
345.libs/libpynac_la-numeric.o: In function `ZNK5GiNaC7numeric4iremERKS0_':
346/home/Travis/sage/local/var/tmp/sage/build/pynac-0.5.2/src/ginac/numeric.cpp:2172: undefined reference to `_imp____gmpz_init'
347/home/Travis/sage/local/var/tmp/sage/build/pynac-0.5.2/src/ginac/numeric.cpp:2173: undefined reference to `_imp____gmpz_fdiv_r'
348.libs/libpynac_la-numeric.o: In function `ZNK5GiNaC7numeric4iquoERKS0_':
349/home/Travis/sage/local/var/tmp/sage/build/pynac-0.5.2/src/ginac/numeric.cpp:2183: undefined reference to `_imp____gmpz_init'
350/home/Travis/sage/local/var/tmp/sage/build/pynac-0.5.2/src/ginac/numeric.cpp:2184: undefined reference to `_imp____gmpz_fdiv_q'
351.libs/libpynac_la-numeric.o: In function `ZNK5GiNaC7numeric3gcdERKS0_':
352/home/Travis/sage/local/var/tmp/sage/build/pynac-0.5.2/src/ginac/numeric.cpp:2198: undefined reference to `_imp____gmpz_init'
353/home/Travis/sage/local/var/tmp/sage/build/pynac-0.5.2/src/ginac/numeric.cpp:2199: undefined reference to `_imp____gmpz_gcd'
354.libs/libpynac_la-numeric.o: In function `ZNK5GiNaC7numeric3lcmERKS0_':
355/home/Travis/sage/local/var/tmp/sage/build/pynac-0.5.2/src/ginac/numeric.cpp:2209: undefined reference to `_imp____gmpz_init'
356/home/Travis/sage/local/var/tmp/sage/build/pynac-0.5.2/src/ginac/numeric.cpp:2210: undefined reference to `_imp____gmpz_lcm'
357.libs/libpynac_la-numeric.o: In function `ZN5GiNaC6coerceERNS_7numericES1_RKS0_S3_':
358/home/Travis/sage/local/var/tmp/sage/build/pynac-0.5.2/src/ginac/numeric.cpp:2254: undefined reference to `_imp____gmpq_init'
359/home/Travis/sage/local/var/tmp/sage/build/pynac-0.5.2/src/ginac/numeric.cpp:2255: undefined reference to `_imp____gmpq_set_z'
360/home/Travis/sage/local/var/tmp/sage/build/pynac-0.5.2/src/ginac/numeric.cpp:2278: undefined reference to `_imp____gmpq_init'
361/home/Travis/sage/local/var/tmp/sage/build/pynac-0.5.2/src/ginac/numeric.cpp:2279: undefined reference to `_imp____gmpq_set_z'
362/home/Travis/sage/local/var/tmp/sage/build/pynac-0.5.2/src/ginac/numeric.cpp:2261: undefined reference to `_imp____gmpz_init_set'
363/home/Travis/sage/local/var/tmp/sage/build/pynac-0.5.2/src/ginac/numeric.cpp:2265: undefined reference to `_imp____gmpz_clear'
364/home/Travis/sage/local/var/tmp/sage/build/pynac-0.5.2/src/ginac/numeric.cpp:2284: undefined reference to `_imp____gmpq_init'
365/home/Travis/sage/local/var/tmp/sage/build/pynac-0.5.2/src/ginac/numeric.cpp:2285: undefined reference to `_imp____gmpq_set'
366/home/Travis/sage/local/var/tmp/sage/build/pynac-0.5.2/src/ginac/numeric.cpp:2287: undefined reference to `_imp____gmpq_clear'
367/home/Travis/sage/local/var/tmp/sage/build/pynac-0.5.2/src/ginac/numeric.cpp:2324: undefined reference to `_imp____gmpq_init'
368/home/Travis/sage/local/var/tmp/sage/build/pynac-0.5.2/src/ginac/numeric.cpp:2325: undefined reference to `_imp____gmpq_set'
369/home/Travis/sage/local/var/tmp/sage/build/pynac-0.5.2/src/ginac/numeric.cpp:2327: undefined reference to `_imp____gmpq_clear'
370/home/Travis/sage/local/var/tmp/sage/build/pynac-0.5.2/src/ginac/numeric.cpp:2318: undefined reference to `_imp____gmpz_init_set'
371/home/Travis/sage/local/var/tmp/sage/build/pynac-0.5.2/src/ginac/numeric.cpp:2320: undefined reference to `_imp____gmpz_clear'
372.libs/libpynac_la-numeric.o: In function `ZNK5GiNaC7numeric17compare_same_typeERKS0_':
373/home/Travis/sage/local/var/tmp/sage/build/pynac-0.5.2/src/ginac/numeric.cpp:381: undefined reference to `_imp____gmpq_cmp'
374/home/Travis/sage/local/var/tmp/sage/build/pynac-0.5.2/src/ginac/numeric.cpp:374: undefined reference to `_imp____gmpz_cmp'
375.libs/libpynac_la-numeric.o: In function `ZNK5GiNaC7numeric3addERKS0_':
376/home/Travis/sage/local/var/tmp/sage/build/pynac-0.5.2/src/ginac/numeric.cpp:975: undefined reference to `_imp____gmpq_init'
377/home/Travis/sage/local/var/tmp/sage/build/pynac-0.5.2/src/ginac/numeric.cpp:976: undefined reference to `_imp____gmpq_add'
378/home/Travis/sage/local/var/tmp/sage/build/pynac-0.5.2/src/ginac/numeric.cpp:977: undefined reference to `_imp____gmpq_canonicalize'
379/home/Travis/sage/local/var/tmp/sage/build/pynac-0.5.2/src/ginac/numeric.cpp:970: undefined reference to `_imp____gmpz_init'
380/home/Travis/sage/local/var/tmp/sage/build/pynac-0.5.2/src/ginac/numeric.cpp:971: undefined reference to `_imp____gmpz_add'
381.libs/libpynac_la-numeric.o: In function `ZNK5GiNaC7numeric3subERKS0_':
382/home/Travis/sage/local/var/tmp/sage/build/pynac-0.5.2/src/ginac/numeric.cpp:1005: undefined reference to `_imp____gmpq_init'
383/home/Travis/sage/local/var/tmp/sage/build/pynac-0.5.2/src/ginac/numeric.cpp:1006: undefined reference to `_imp____gmpq_sub'
384/home/Travis/sage/local/var/tmp/sage/build/pynac-0.5.2/src/ginac/numeric.cpp:1007: undefined reference to `_imp____gmpq_canonicalize'
385/home/Travis/sage/local/var/tmp/sage/build/pynac-0.5.2/src/ginac/numeric.cpp:1000: undefined reference to `_imp____gmpz_init'
386/home/Travis/sage/local/var/tmp/sage/build/pynac-0.5.2/src/ginac/numeric.cpp:1001: undefined reference to `_imp____gmpz_sub'
387.libs/libpynac_la-numeric.o: In function `ZNK5GiNaC7numeric3mulERKS0_':
388/home/Travis/sage/local/var/tmp/sage/build/pynac-0.5.2/src/ginac/numeric.cpp:1035: undefined reference to `_imp____gmpq_init'
389/home/Travis/sage/local/var/tmp/sage/build/pynac-0.5.2/src/ginac/numeric.cpp:1036: undefined reference to `_imp____gmpq_mul'
390/home/Travis/sage/local/var/tmp/sage/build/pynac-0.5.2/src/ginac/numeric.cpp:1037: undefined reference to `_imp____gmpq_canonicalize'
391/home/Travis/sage/local/var/tmp/sage/build/pynac-0.5.2/src/ginac/numeric.cpp:1030: undefined reference to `_imp____gmpz_init'
392/home/Travis/sage/local/var/tmp/sage/build/pynac-0.5.2/src/ginac/numeric.cpp:1031: undefined reference to `_imp____gmpz_mul'
393.libs/libpynac_la-numeric.o: In function `ZNK5GiNaC7numeric3divERKS0_':
394/home/Travis/sage/local/var/tmp/sage/build/pynac-0.5.2/src/ginac/numeric.cpp:1082: undefined reference to `_imp____gmpq_init'
395/home/Travis/sage/local/var/tmp/sage/build/pynac-0.5.2/src/ginac/numeric.cpp:1083: undefined reference to `_imp____gmpq_div'
396/home/Travis/sage/local/var/tmp/sage/build/pynac-0.5.2/src/ginac/numeric.cpp:1084: undefined reference to `_imp____gmpq_canonicalize'
397/home/Travis/sage/local/var/tmp/sage/build/pynac-0.5.2/src/ginac/numeric.cpp:1063: undefined reference to `_imp____gmpz_divisible_p'
398/home/Travis/sage/local/var/tmp/sage/build/pynac-0.5.2/src/ginac/numeric.cpp:1065: undefined reference to `_imp____gmpz_init'
399/home/Travis/sage/local/var/tmp/sage/build/pynac-0.5.2/src/ginac/numeric.cpp:1066: undefined reference to `_imp____gmpz_divexact'
400/home/Travis/sage/local/var/tmp/sage/build/pynac-0.5.2/src/ginac/numeric.cpp:1071: undefined reference to `_imp____gmpq_init'
401/home/Travis/sage/local/var/tmp/sage/build/pynac-0.5.2/src/ginac/numeric.cpp:1073: undefined reference to `_imp____gmpq_set_z'
402/home/Travis/sage/local/var/tmp/sage/build/pynac-0.5.2/src/ginac/numeric.cpp:1075: undefined reference to `_imp____gmpq_div'
403/home/Travis/sage/local/var/tmp/sage/build/pynac-0.5.2/src/ginac/numeric.cpp:1076: undefined reference to `_imp____gmpq_clear'
404.libs/libpynac_la-numeric.o: In function `ZNK5GiNaC7numeric5powerERKS0_':
405/home/Travis/sage/local/var/tmp/sage/build/pynac-0.5.2/src/ginac/numeric.cpp:1134: undefined reference to `_imp____gmpz_fits_sint_p'
406/home/Travis/sage/local/var/tmp/sage/build/pynac-0.5.2/src/ginac/numeric.cpp:1137: undefined reference to `_imp____gmpz_get_si'
407/home/Travis/sage/local/var/tmp/sage/build/pynac-0.5.2/src/ginac/numeric.cpp:1163: undefined reference to `_imp____gmpz_init'
408/home/Travis/sage/local/var/tmp/sage/build/pynac-0.5.2/src/ginac/numeric.cpp:1164: undefined reference to `_imp____gmpq_init'
409/home/Travis/sage/local/var/tmp/sage/build/pynac-0.5.2/src/ginac/numeric.cpp:1167: undefined reference to `_imp____gmpz_pow_ui'
410/home/Travis/sage/local/var/tmp/sage/build/pynac-0.5.2/src/ginac/numeric.cpp:1168: undefined reference to `_imp____gmpq_set_z'
411/home/Travis/sage/local/var/tmp/sage/build/pynac-0.5.2/src/ginac/numeric.cpp:1171: undefined reference to `_imp____gmpq_div'
412/home/Travis/sage/local/var/tmp/sage/build/pynac-0.5.2/src/ginac/numeric.cpp:1180: undefined reference to `_imp____gmpz_clear'
413/home/Travis/sage/local/var/tmp/sage/build/pynac-0.5.2/src/ginac/numeric.cpp:1181: undefined reference to `_imp____gmpq_clear'
414/home/Travis/sage/local/var/tmp/sage/build/pynac-0.5.2/src/ginac/numeric.cpp:1131: undefined reference to `_imp____gmpz_set_si'
415/home/Travis/sage/local/var/tmp/sage/build/pynac-0.5.2/src/ginac/numeric.cpp:1199: undefined reference to `_imp____gmpq_init'
416/home/Travis/sage/local/var/tmp/sage/build/pynac-0.5.2/src/ginac/numeric.cpp:1200: undefined reference to `_imp____gmpq_set'
417/home/Travis/sage/local/var/tmp/sage/build/pynac-0.5.2/src/ginac/numeric.cpp:1206: undefined reference to `_imp____gmpq_clear'
418/home/Travis/sage/local/var/tmp/sage/build/pynac-0.5.2/src/ginac/numeric.cpp:1145: undefined reference to `_imp____gmpz_init'
419/home/Travis/sage/local/var/tmp/sage/build/pynac-0.5.2/src/ginac/numeric.cpp:1146: undefined reference to `_imp____gmpz_pow_ui'
420/home/Travis/sage/local/var/tmp/sage/build/pynac-0.5.2/src/ginac/numeric.cpp:1151: undefined reference to `_imp____gmpz_init_set'
421/home/Travis/sage/local/var/tmp/sage/build/pynac-0.5.2/src/ginac/numeric.cpp:1152: undefined reference to `_imp____gmpz_pow_ui'
422/home/Travis/sage/local/var/tmp/sage/build/pynac-0.5.2/src/ginac/numeric.cpp:1154: undefined reference to `_imp____gmpq_init'
423/home/Travis/sage/local/var/tmp/sage/build/pynac-0.5.2/src/ginac/numeric.cpp:1155: undefined reference to `_imp____gmpq_set_z'
424/home/Travis/sage/local/var/tmp/sage/build/pynac-0.5.2/src/ginac/numeric.cpp:1156: undefined reference to `_imp____gmpq_inv'
425/home/Travis/sage/local/var/tmp/sage/build/pynac-0.5.2/src/ginac/numeric.cpp:1157: undefined reference to `_imp____gmpz_clear'
426/home/Travis/sage/local/var/tmp/sage/build/pynac-0.5.2/src/ginac/numeric.cpp:1174: undefined reference to `_imp____gmpz_pow_ui'
427/home/Travis/sage/local/var/tmp/sage/build/pynac-0.5.2/src/ginac/numeric.cpp:1175: undefined reference to `_imp____gmpq_set_z'
428.libs/libpynac_la-numeric.o: In function `ZNK5GiNaC7numericeqERKS0_':
429/home/Travis/sage/local/var/tmp/sage/build/pynac-0.5.2/src/ginac/numeric.cpp:1660: undefined reference to `_imp____gmpq_equal'
430/home/Travis/sage/local/var/tmp/sage/build/pynac-0.5.2/src/ginac/numeric.cpp:1658: undefined reference to `_imp____gmpz_cmp'
431.libs/libpynac_la-numeric.o: In function `ZNK5GiNaC7numericneERKS0_':
432/home/Travis/sage/local/var/tmp/sage/build/pynac-0.5.2/src/ginac/numeric.cpp:1681: undefined reference to `_imp____gmpq_equal'
433/home/Travis/sage/local/var/tmp/sage/build/pynac-0.5.2/src/ginac/numeric.cpp:1679: undefined reference to `_imp____gmpz_cmp'
434.libs/libpynac_la-numeric.o: In function `ZNK5GiNaC7numericltERKS0_':
435/home/Travis/sage/local/var/tmp/sage/build/pynac-0.5.2/src/ginac/numeric.cpp:1742: undefined reference to `_imp____gmpq_cmp'
436/home/Travis/sage/local/var/tmp/sage/build/pynac-0.5.2/src/ginac/numeric.cpp:1740: undefined reference to `_imp____gmpz_cmp'
437.libs/libpynac_la-numeric.o: In function `ZNK5GiNaC7numericleERKS0_':
438/home/Travis/sage/local/var/tmp/sage/build/pynac-0.5.2/src/ginac/numeric.cpp:1766: undefined reference to `_imp____gmpq_cmp'
439/home/Travis/sage/local/var/tmp/sage/build/pynac-0.5.2/src/ginac/numeric.cpp:1764: undefined reference to `_imp____gmpz_cmp'
440.libs/libpynac_la-numeric.o: In function `ZNK5GiNaC7numericgtERKS0_':
441/home/Travis/sage/local/var/tmp/sage/build/pynac-0.5.2/src/ginac/numeric.cpp:1790: undefined reference to `_imp____gmpq_cmp'
442/home/Travis/sage/local/var/tmp/sage/build/pynac-0.5.2/src/ginac/numeric.cpp:1788: undefined reference to `_imp____gmpz_cmp'
443.libs/libpynac_la-numeric.o: In function `ZNK5GiNaC7numericgeERKS0_':
444/home/Travis/sage/local/var/tmp/sage/build/pynac-0.5.2/src/ginac/numeric.cpp:1814: undefined reference to `_imp____gmpq_cmp'
445/home/Travis/sage/local/var/tmp/sage/build/pynac-0.5.2/src/ginac/numeric.cpp:1812: undefined reference to `_imp____gmpz_cmp'
446collect2: error: ld returned 1 exit status
447Makefile:475: recipe for target 'libpynac.la' failed
448make[5]: *** [libpynac.la] Error 1
449make[5]: Leaving directory '/home/Travis/sage/local/var/tmp/sage/build/pynac-0.5.2/src/ginac'
450Makefile:471: recipe for target 'all-recursive' failed
451make[4]: *** [all-recursive] Error 1
452make[4]: Leaving directory '/home/Travis/sage/local/var/tmp/sage/build/pynac-0.5.2/src'
453Makefile:377: recipe for target 'all' failed
454make[3]: *** [all] Error 2
455make[3]: Leaving directory '/home/Travis/sage/local/var/tmp/sage/build/pynac-0.5.2/src'
456Error building pynac.
457
458real    2m44.442s
459user    3m13.035s
460sys     1m19.695s
461************************************************************************
462Error installing package pynac-0.5.2
463************************************************************************
464Please email sage-devel (http://groups.google.com/group/sage-devel)
465explaining the problem and including the relevant part of the log file
466  /home/Travis/sage/logs/pkgs/pynac-0.5.2.log
467Describe your computer, operating system, etc.
468If you want to try to fix the problem yourself, *don't* just cd to
469/home/Travis/sage/local/var/tmp/sage/build/pynac-0.5.2 and type 'make' or whatever is appropriate.
470Instead, the following commands setup all environment variables
471correctly and load a subshell for you to debug the error:
472  (cd '/home/Travis/sage/local/var/tmp/sage/build/pynac-0.5.2' && '/home/Travis/sage/sage' --sh)
473When you are done debugging, you can type "exit" to leave the subshell.
474************************************************************************