Ticket #17635: linbox.log

File linbox.log, 63.2 KB (added by chapoton, 3 years ago)

shorter linbox log

Line 
1Found local metadata for linbox-1.4.2
2Using cached file /home/u1/chapoton/sage/upstream/linbox-1.4.2.tar.gz
3linbox-1.4.2
4====================================================
5Setting up build directory for linbox-1.4.2
6Finished extraction
7****************************************************
8Host system:
9Linux irma-atlas 3.16.0-71-generic #91~14.04.1-Ubuntu SMP Mon Apr 18 19:43:36 UTC 2016 x86_64 x86_64 x86_64 GNU/Linux
10****************************************************
11C compiler: gcc
12C compiler version:
13Using built-in specs.
14COLLECT_GCC=/usr/bin/gcc
15COLLECT_LTO_WRAPPER=/usr/lib/gcc/x86_64-linux-gnu/4.9/lto-wrapper
16Target: x86_64-linux-gnu
17Configured with: ../src/configure -v --with-pkgversion='Ubuntu 4.9.3-8ubuntu2~14.04' --with-bugurl=file:///usr/share/doc/gcc-4.9/README.Bugs --enable-languages=c,c++,java,go,d,fortran,objc,obj-c++ --prefix=/usr --program-suffix=-4.9 --enable-shared --enable-linker-build-id --libexecdir=/usr/lib --without-included-gettext --enable-threads=posix --with-gxx-include-dir=/usr/include/c++/4.9 --libdir=/usr/lib --enable-nls --with-sysroot=/ --enable-clocale=gnu --enable-libstdcxx-debug --enable-libstdcxx-time=yes --enable-gnu-unique-object --disable-vtable-verify --enable-plugin --with-system-zlib --disable-browser-plugin --enable-java-awt=gtk --enable-gtk-cairo --with-java-home=/usr/lib/jvm/java-1.5.0-gcj-4.9-amd64/jre --enable-java-home --with-jvm-root-dir=/usr/lib/jvm/java-1.5.0-gcj-4.9-amd64 --with-jvm-jar-dir=/usr/lib/jvm-exports/java-1.5.0-gcj-4.9-amd64 --with-arch-directory=amd64 --with-ecj-jar=/usr/share/java/eclipse-ecj.jar --enable-objc-gc --enable-multiarch --disable-werror --with-arch-32=i686 --with-abi=m64 --with-multilib-list=m32,m64,mx32 --enable-multilib --with-tune=generic --enable-checking=release --build=x86_64-linux-gnu --host=x86_64-linux-gnu --target=x86_64-linux-gnu
18Thread model: posix
19gcc version 4.9.3 (Ubuntu 4.9.3-8ubuntu2~14.04)
20****************************************************
21checking for a BSD-compatible install... /usr/bin/install -c
22checking whether build environment is sane... yes
23checking for a thread-safe mkdir -p... /bin/mkdir -p
24checking for gawk... gawk
25checking whether make sets $(MAKE)... yes
26checking whether make supports nested variables... yes
27checking for rm... /bin/rm
28checking whether to enable maintainer-specific portions of Makefiles... no
29-----------------------------------------------
30checking whether to enable debugging options in the library... no
31checking whether to enable profiling everything in the library... no
32checking whether to enable warnings when compiling the library... no
33-----------------------------------------------
34checking whether the C++ compiler works... yes
35checking for C++ compiler default output file name... a.out
36checking for suffix of executables...
37checking whether we are cross compiling... no
38checking for suffix of object files... o
39checking whether we are using the GNU C++ compiler... yes
40checking whether g++ accepts -g... yes
41checking for family name of compiler... gcc (Ubuntu 4.9.3-8ubuntu2~14.04) 4.9.3
42checking whether g++ supports C++11 features by default... no
43checking whether g++ supports C++11 features with -std=gnu++11... yes
44checking how to run the C++ preprocessor... g++ -E
45checking for grep that handles long lines and -e... /bin/grep
46checking for egrep... /bin/grep -E
47checking for ANSI C header files... yes
48checking build system type... x86_64-unknown-linux-gnu
49checking host system type... x86_64-unknown-linux-gnu
50checking how to print strings... printf
51checking for gcc... gcc
52checking whether we are using the GNU C compiler... yes
53checking whether gcc accepts -g... yes
54checking for gcc option to accept ISO C89... none needed
55checking whether gcc understands -c and -o together... yes
56checking for a sed that does not truncate output... /bin/sed
57checking for fgrep... /bin/grep -F
58checking for ld used by gcc... ld
59checking if the linker (ld) is GNU ld... yes
60checking for BSD- or MS-compatible name lister (nm)... /usr/bin/nm -B
61checking the name lister (/usr/bin/nm -B) interface... BSD nm
62checking whether ln -s works... yes
63checking the maximum length of command line arguments... 3458764513820540925
64checking whether the shell understands some XSI constructs... yes
65checking whether the shell understands "+="... yes
66checking how to convert x86_64-unknown-linux-gnu file names to x86_64-unknown-linux-gnu format... func_convert_file_noop
67checking how to convert x86_64-unknown-linux-gnu file names to toolchain format... func_convert_file_noop
68checking for ld option to reload object files... -r
69checking for objdump... objdump
70checking how to recognize dependent libraries... pass_all
71checking for dlltool... no
72checking how to associate runtime and link libraries... printf %s\n
73checking for archiver @FILE support... @
74checking for strip... strip
75checking for ranlib... ranlib
76checking command to parse /usr/bin/nm -B output from gcc object... ok
77checking for sysroot... no
78checking for mt... mt
79checking if mt is a manifest tool... no
80checking for sys/types.h... yes
81checking for sys/stat.h... yes
82checking for stdlib.h... yes
83checking for string.h... yes
84checking for memory.h... yes
85checking for strings.h... yes
86checking for inttypes.h... yes
87checking for stdint.h... yes
88checking for unistd.h... yes
89checking for dlfcn.h... yes
90checking for objdir... .libs
91checking if gcc supports -fno-rtti -fno-exceptions... no
92checking for gcc option to produce PIC... -fPIC -DPIC
93checking if gcc PIC flag -fPIC -DPIC works... yes
94checking if gcc static flag -static works... yes
95checking if gcc supports -c -o file.o... yes
96checking if gcc supports -c -o file.o... (cached) yes
97checking whether the gcc linker (ld -m elf_x86_64) supports shared libraries... yes
98checking whether -lc should be explicitly linked in... no
99checking dynamic linker characteristics... GNU/Linux ld.so
100checking how to hardcode library paths into programs... immediate
101checking whether stripping libraries is possible... yes
102checking if libtool supports shared libraries... yes
103checking whether to build shared libraries... yes
104checking whether to build static libraries... no
105checking how to run the C++ preprocessor... g++ -E
106checking for ld used by g++... ld -m elf_x86_64
107checking if the linker (ld -m elf_x86_64) is GNU ld... yes
108checking whether the g++ linker (ld -m elf_x86_64) supports shared libraries... yes
109checking for g++ option to produce PIC... -fPIC -DPIC
110checking if g++ PIC flag -fPIC -DPIC works... yes
111checking if g++ static flag -static works... yes
112checking if g++ supports -c -o file.o... yes
113checking if g++ supports -c -o file.o... (cached) yes
114checking whether the g++ linker (ld -m elf_x86_64) supports shared libraries... yes
115checking dynamic linker characteristics... (cached) GNU/Linux ld.so
116checking how to hardcode library paths into programs... immediate
117-----------------------------------------------
118        START  LINBOX CONFIG                   
119-----------------------------------------------
120-----------------------------------------------
121checking enabling OpenMP... no
122-----------------------------------------------
123checking size of char... 1
124checking size of short... 2
125checking size of int... 4
126checking size of long... 8
127checking size of long long... 8
128checking size of __int64... 0
129checking for ANSI C header files... (cached) yes
130checking float.h usability... yes
131checking float.h presence... yes
132checking for float.h... yes
133checking limits.h usability... yes
134checking limits.h presence... yes
135checking for limits.h... yes
136checking stddef.h usability... yes
137checking stddef.h presence... yes
138checking for stddef.h... yes
139checking for stdlib.h... (cached) yes
140checking for string.h... (cached) yes
141checking sys/time.h usability... yes
142checking sys/time.h presence... yes
143checking for sys/time.h... yes
144checking for stdint.h... (cached) yes
145checking pthread.h usability... yes
146checking pthread.h presence... yes
147checking for pthread.h... yes
148checking whether byte ordering is bigendian... no
149-----------------------------------------------
150Default path = /usr /usr/local
151Checking all external packages in /home/u1/chapoton/sage/local /usr /usr/local
152checking whether to compile the drivers... no
153-----------------------------------------------
154checking for pkg-config... /home/u1/chapoton/sage/local/bin/pkg-config
155checking pkg-config is at least version 0.9.0... yes
156checking for FFLAS_FFPACK... yes
157checking for LAPACK in fflas-ffpack... no
158checking for IML... found
159checking for M4RI... found
160checking for M4RIE... found
161checking for MPFR... found
162checking for FPLLL >= 4.0.1... found
163checking for FLINT... found
164checking for NTL >= 5.0... found
165checking for SACLIB >= 2.0... not found
166checking for MAPLE >= 9.0... ./configure: line 18187: /bin/maple.system.type: No such file or directory
167./configure: line 18198: /bin/maple: No such file or directory
168cat: maple_version.txt: No such file or directory
169./configure: line 18201: test: -lt: unary operator expected
170found
171./configure: line 18219: test: -ge: unary operator expected
172checking whether to compile the SAGE interface... yes
173checking whether gnuplot works... no
174
175You must have gnuplot installed to create benchmark 
176graphics for LinBox. Download the appropriate package
177for your distribution, or get the source tarball from
178http://www.gnuplot.info/download.html               
179checking whether ps2pdf works... yes
180checking if tinyxml2 is available... no
181configure: WARNING: tinyxml2 is not installed (no import/export of benchmarks).
182checking whether to build documentation... no
183checking whether dot works... yes
184checking for OpenCL >= 1.0... found
185-----------------------------------------------
186CXXFLAGS       =  -std=gnu++11  -g -fPIC
187LIBS           =
188DEPS_CFLAGS    = -O2 -Wall -DNDEBUG -UFFLASFFPACK_DEBUG -D__FFLASFFPACK_HAVE_CBLAS -g -fPIC -std=gnu++11 -mmmx -mpopcnt -msse -msse2 -msse3 -msse4.1 -msse4.2 -msse4a -mavx -mfma -mfma4 -fabi-version=6 -DFFLAS_COMPILED -DFFPACK_COMPILED -mfpmath=sse -I/home/u1/chapoton/sage/local/include -I/home/u1/chapoton/sage/local//include   -I/home/u1/chapoton/sage/local/include -I/home/u1/chapoton/sage/local/include -I/home/u1/chapoton/sage/local/include -I/home/u1/chapoton/sage/local/include -I/home/u1/chapoton/sage/local/include
189DEPS_LIBS      =  -L/home/u1/chapoton/sage/local/lib -lntl -L/home/u1/chapoton/sage/local/lib -lmpfr -L/home/u1/chapoton/sage/local/lib -lfplll -L/home/u1/chapoton/sage/local/lib -liml -L/home/u1/chapoton/sage/local/lib -lflint -lOpenCL -lpthread -L/home/u1/chapoton/sage/local/lib -L/home/u1/chapoton/sage/local//lib -lfflas -lffpack -lcblas -latlas -lgivaro -lgmpxx -lgmp   
190DEFAULT CFLAGS = -O2   -Wall -g -DNDEBUG -U_LB_DEBUG
191TESTS CFLAGS   = -O2 -Wall -g -DNDEBUG -U_LB_DEBUG
192-----------------------------------------------
193         END   LINBOX CONFIG                   
194-----------------------------------------------
195checking that generated files are newer than configure... done
196configure: creating ./config.status
197config.status: creating Makefile
198config.status: creating linbox-config
199config.status: creating examples/Makefile
200config.status: creating doc/Makefile
201config.status: creating linbox/Makefile
202config.status: creating linbox/algorithms/Makefile
203config.status: creating linbox/algorithms/gauss/Makefile
204config.status: creating linbox/algorithms/matrix-blas3/Makefile
205config.status: creating linbox/algorithms/opencl-kernels/Makefile
206config.status: creating linbox/algorithms/polynomial-matrix/Makefile
207config.status: creating linbox/blackbox/Makefile
208config.status: creating linbox/element/Makefile
209config.status: creating linbox/field/Makefile
210config.status: creating linbox/matrix/Makefile
211config.status: creating linbox/matrix/sparsematrix/Makefile
212config.status: creating linbox/matrix/densematrix/Makefile
213config.status: creating linbox/matrix/matrixdomain/Makefile
214config.status: creating linbox/matrix/sliced3/Makefile
215config.status: creating linbox/randiter/Makefile
216config.status: creating linbox/ring/Makefile
217config.status: creating linbox/ring/ntl/Makefile
218config.status: creating linbox/ring/modular/Makefile
219config.status: creating linbox/solutions/Makefile
220config.status: creating linbox/util/Makefile
221config.status: creating linbox/util/formats/Makefile
222config.status: creating linbox/vector/Makefile
223config.status: creating tests/Makefile
224config.status: creating tests/data/Makefile
225config.status: creating tests/matrix/Makefile
226config.status: creating interfaces/Makefile
227config.status: creating interfaces/driver/Makefile
228config.status: creating interfaces/maple/Makefile
229config.status: creating interfaces/kaapi/Makefile
230config.status: creating interfaces/sage/Makefile
231config.status: creating macros/Makefile
232config.status: creating benchmarks/Makefile
233config.status: creating benchmarks/data/Makefile
234config.status: creating benchmarks/matrix/Makefile
235config.status: creating linbox.pc
236config.status: creating config.h
237config.status: executing linbox/config.h commands
238config.status: creating linbox/config.h - prefix __LINBOX for config.h defines
239config.status: executing depfiles commands
240config.status: executing libtool commands
241-----------------------------------------------
242make[3]: Entering directory `/home/u1/chapoton/sage/local/var/tmp/sage/build/linbox-1.4.2/src'
243make  all-recursive
244make[4]: Entering directory `/home/u1/chapoton/sage/local/var/tmp/sage/build/linbox-1.4.2/src'
245Making all in linbox
246make[5]: Entering directory `/home/u1/chapoton/sage/local/var/tmp/sage/build/linbox-1.4.2/src/linbox'
247Making all in util
248make[6]: Entering directory `/home/u1/chapoton/sage/local/var/tmp/sage/build/linbox-1.4.2/src/linbox/util'
249Making all in formats
250make[7]: Entering directory `/home/u1/chapoton/sage/local/var/tmp/sage/build/linbox-1.4.2/src/linbox/util/formats'
251make[7]: Nothing to be done for `all'.
252make[7]: Leaving directory `/home/u1/chapoton/sage/local/var/tmp/sage/build/linbox-1.4.2/src/linbox/util/formats'
253make[7]: Entering directory `/home/u1/chapoton/sage/local/var/tmp/sage/build/linbox-1.4.2/src/linbox/util'
254/bin/bash ../../libtool  --tag=CXX   --mode=compile g++ -DHAVE_CONFIG_H -I. -I../..  -I../../linbox -O2 -Wall -DNDEBUG -UFFLASFFPACK_DEBUG -D__FFLASFFPACK_HAVE_CBLAS -g -fPIC -std=gnu++11 -mmmx -mpopcnt -msse -msse2 -msse3 -msse4.1 -msse4.2 -msse4a -mavx -mfma -mfma4 -fabi-version=6 -DFFLAS_COMPILED -DFFPACK_COMPILED -mfpmath=sse -I/home/u1/chapoton/sage/local/include -I/home/u1/chapoton/sage/local//include   -I/home/u1/chapoton/sage/local/include -I/home/u1/chapoton/sage/local/include -I/home/u1/chapoton/sage/local/include -I/home/u1/chapoton/sage/local/include -I/home/u1/chapoton/sage/local/include -O2   -Wall -g -DNDEBUG -U_LB_DEBUG -DDISABLE_COMMENTATOR  -std=gnu++11  -g -fPIC -c -o error.lo error.C
255libtool: compile:  g++ -DHAVE_CONFIG_H -I. -I../.. -I../../linbox -O2 -Wall -DNDEBUG -UFFLASFFPACK_DEBUG -D__FFLASFFPACK_HAVE_CBLAS -g -fPIC -std=gnu++11 -mmmx -mpopcnt -msse -msse2 -msse3 -msse4.1 -msse4.2 -msse4a -mavx -mfma -mfma4 -fabi-version=6 -DFFLAS_COMPILED -DFFPACK_COMPILED -mfpmath=sse -I/home/u1/chapoton/sage/local/include -I/home/u1/chapoton/sage/local//include -I/home/u1/chapoton/sage/local/include -I/home/u1/chapoton/sage/local/include -I/home/u1/chapoton/sage/local/include -I/home/u1/chapoton/sage/local/include -I/home/u1/chapoton/sage/local/include -O2 -Wall -g -DNDEBUG -U_LB_DEBUG -DDISABLE_COMMENTATOR -std=gnu++11 -g -fPIC -c error.C  -fPIC -DPIC -o .libs/error.o
256/bin/bash ../../libtool  --tag=CXX   --mode=compile g++ -DHAVE_CONFIG_H -I. -I../..  -I../../linbox -O2 -Wall -DNDEBUG -UFFLASFFPACK_DEBUG -D__FFLASFFPACK_HAVE_CBLAS -g -fPIC -std=gnu++11 -mmmx -mpopcnt -msse -msse2 -msse3 -msse4.1 -msse4.2 -msse4a -mavx -mfma -mfma4 -fabi-version=6 -DFFLAS_COMPILED -DFFPACK_COMPILED -mfpmath=sse -I/home/u1/chapoton/sage/local/include -I/home/u1/chapoton/sage/local//include   -I/home/u1/chapoton/sage/local/include -I/home/u1/chapoton/sage/local/include -I/home/u1/chapoton/sage/local/include -I/home/u1/chapoton/sage/local/include -I/home/u1/chapoton/sage/local/include -O2   -Wall -g -DNDEBUG -U_LB_DEBUG -DDISABLE_COMMENTATOR  -std=gnu++11  -g -fPIC -c -o debug.lo debug.C
257libtool: compile:  g++ -DHAVE_CONFIG_H -I. -I../.. -I../../linbox -O2 -Wall -DNDEBUG -UFFLASFFPACK_DEBUG -D__FFLASFFPACK_HAVE_CBLAS -g -fPIC -std=gnu++11 -mmmx -mpopcnt -msse -msse2 -msse3 -msse4.1 -msse4.2 -msse4a -mavx -mfma -mfma4 -fabi-version=6 -DFFLAS_COMPILED -DFFPACK_COMPILED -mfpmath=sse -I/home/u1/chapoton/sage/local/include -I/home/u1/chapoton/sage/local//include -I/home/u1/chapoton/sage/local/include -I/home/u1/chapoton/sage/local/include -I/home/u1/chapoton/sage/local/include -I/home/u1/chapoton/sage/local/include -I/home/u1/chapoton/sage/local/include -O2 -Wall -g -DNDEBUG -U_LB_DEBUG -DDISABLE_COMMENTATOR -std=gnu++11 -g -fPIC -c debug.C  -fPIC -DPIC -o .libs/debug.o
258/bin/bash ../../libtool  --tag=CXX   --mode=link g++  -std=gnu++11  -g -fPIC -L/home/u1/chapoton/sage/local/lib -Wl,-rpath,/home/u1/chapoton/sage/local/lib  -L/home/u1/chapoton/sage/local/lib -Wl,-rpath,/home/u1/chapoton/sage/local/lib  -o libutil.la  error.lo debug.lo 
259libtool: link: ar cru .libs/libutil.a .libs/error.o .libs/debug.o
260libtool: link: ranlib .libs/libutil.a
261libtool: link: ( cd ".libs" && rm -f "libutil.la" && ln -s "../libutil.la" "libutil.la" )
262make[7]: Leaving directory `/home/u1/chapoton/sage/local/var/tmp/sage/build/linbox-1.4.2/src/linbox/util'
263make[6]: Leaving directory `/home/u1/chapoton/sage/local/var/tmp/sage/build/linbox-1.4.2/src/linbox/util'
264Making all in element
265make[6]: Entering directory `/home/u1/chapoton/sage/local/var/tmp/sage/build/linbox-1.4.2/src/linbox/element'
266make[6]: Nothing to be done for `all'.
267make[6]: Leaving directory `/home/u1/chapoton/sage/local/var/tmp/sage/build/linbox-1.4.2/src/linbox/element'
268Making all in field
269make[6]: Entering directory `/home/u1/chapoton/sage/local/var/tmp/sage/build/linbox-1.4.2/src/linbox/field'
270make[6]: Nothing to be done for `all'.
271make[6]: Leaving directory `/home/u1/chapoton/sage/local/var/tmp/sage/build/linbox-1.4.2/src/linbox/field'
272Making all in randiter
273make[6]: Entering directory `/home/u1/chapoton/sage/local/var/tmp/sage/build/linbox-1.4.2/src/linbox/randiter'
274/bin/bash ../../libtool  --tag=CXX   --mode=compile g++ -DHAVE_CONFIG_H -I. -I../..  -I../../linbox -O2 -Wall -DNDEBUG -UFFLASFFPACK_DEBUG -D__FFLASFFPACK_HAVE_CBLAS -g -fPIC -std=gnu++11 -mmmx -mpopcnt -msse -msse2 -msse3 -msse4.1 -msse4.2 -msse4a -mavx -mfma -mfma4 -fabi-version=6 -DFFLAS_COMPILED -DFFPACK_COMPILED -mfpmath=sse -I/home/u1/chapoton/sage/local/include -I/home/u1/chapoton/sage/local//include   -I/home/u1/chapoton/sage/local/include -I/home/u1/chapoton/sage/local/include -I/home/u1/chapoton/sage/local/include -I/home/u1/chapoton/sage/local/include -I/home/u1/chapoton/sage/local/include -DDISABLE_COMMENTATOR  -std=gnu++11  -g -fPIC -c -o mersenne-twister.lo mersenne-twister.C
275libtool: compile:  g++ -DHAVE_CONFIG_H -I. -I../.. -I../../linbox -O2 -Wall -DNDEBUG -UFFLASFFPACK_DEBUG -D__FFLASFFPACK_HAVE_CBLAS -g -fPIC -std=gnu++11 -mmmx -mpopcnt -msse -msse2 -msse3 -msse4.1 -msse4.2 -msse4a -mavx -mfma -mfma4 -fabi-version=6 -DFFLAS_COMPILED -DFFPACK_COMPILED -mfpmath=sse -I/home/u1/chapoton/sage/local/include -I/home/u1/chapoton/sage/local//include -I/home/u1/chapoton/sage/local/include -I/home/u1/chapoton/sage/local/include -I/home/u1/chapoton/sage/local/include -I/home/u1/chapoton/sage/local/include -I/home/u1/chapoton/sage/local/include -DDISABLE_COMMENTATOR -std=gnu++11 -g -fPIC -c mersenne-twister.C  -fPIC -DPIC -o .libs/mersenne-twister.o
276/bin/bash ../../libtool  --tag=CXX   --mode=link g++  -std=gnu++11  -g -fPIC  -L/home/u1/chapoton/sage/local/lib -Wl,-rpath,/home/u1/chapoton/sage/local/lib  -o libranditer.la  mersenne-twister.lo 
277libtool: link: ar cru .libs/libranditer.a .libs/mersenne-twister.o
278libtool: link: ranlib .libs/libranditer.a
279libtool: link: ( cd ".libs" && rm -f "libranditer.la" && ln -s "../libranditer.la" "libranditer.la" )
280make[6]: Leaving directory `/home/u1/chapoton/sage/local/var/tmp/sage/build/linbox-1.4.2/src/linbox/randiter'
281Making all in vector
282make[6]: Entering directory `/home/u1/chapoton/sage/local/var/tmp/sage/build/linbox-1.4.2/src/linbox/vector'
283make[6]: Nothing to be done for `all'.
284make[6]: Leaving directory `/home/u1/chapoton/sage/local/var/tmp/sage/build/linbox-1.4.2/src/linbox/vector'
285Making all in matrix
286make[6]: Entering directory `/home/u1/chapoton/sage/local/var/tmp/sage/build/linbox-1.4.2/src/linbox/matrix'
287Making all in sparsematrix
288make[7]: Entering directory `/home/u1/chapoton/sage/local/var/tmp/sage/build/linbox-1.4.2/src/linbox/matrix/sparsematrix'
289make[7]: Nothing to be done for `all'.
290make[7]: Leaving directory `/home/u1/chapoton/sage/local/var/tmp/sage/build/linbox-1.4.2/src/linbox/matrix/sparsematrix'
291Making all in densematrix
292make[7]: Entering directory `/home/u1/chapoton/sage/local/var/tmp/sage/build/linbox-1.4.2/src/linbox/matrix/densematrix'
293make[7]: Nothing to be done for `all'.
294make[7]: Leaving directory `/home/u1/chapoton/sage/local/var/tmp/sage/build/linbox-1.4.2/src/linbox/matrix/densematrix'
295Making all in matrixdomain
296make[7]: Entering directory `/home/u1/chapoton/sage/local/var/tmp/sage/build/linbox-1.4.2/src/linbox/matrix/matrixdomain'
297make[7]: Nothing to be done for `all'.
298make[7]: Leaving directory `/home/u1/chapoton/sage/local/var/tmp/sage/build/linbox-1.4.2/src/linbox/matrix/matrixdomain'
299Making all in sliced3
300make[7]: Entering directory `/home/u1/chapoton/sage/local/var/tmp/sage/build/linbox-1.4.2/src/linbox/matrix/sliced3'
301make[7]: Nothing to be done for `all'.
302make[7]: Leaving directory `/home/u1/chapoton/sage/local/var/tmp/sage/build/linbox-1.4.2/src/linbox/matrix/sliced3'
303make[7]: Entering directory `/home/u1/chapoton/sage/local/var/tmp/sage/build/linbox-1.4.2/src/linbox/matrix'
304make[7]: Nothing to be done for `all-am'.
305make[7]: Leaving directory `/home/u1/chapoton/sage/local/var/tmp/sage/build/linbox-1.4.2/src/linbox/matrix'
306make[6]: Leaving directory `/home/u1/chapoton/sage/local/var/tmp/sage/build/linbox-1.4.2/src/linbox/matrix'
307Making all in blackbox
308make[6]: Entering directory `/home/u1/chapoton/sage/local/var/tmp/sage/build/linbox-1.4.2/src/linbox/blackbox'
309make[6]: Nothing to be done for `all'.
310make[6]: Leaving directory `/home/u1/chapoton/sage/local/var/tmp/sage/build/linbox-1.4.2/src/linbox/blackbox'
311Making all in algorithms
312make[6]: Entering directory `/home/u1/chapoton/sage/local/var/tmp/sage/build/linbox-1.4.2/src/linbox/algorithms'
313Making all in gauss
314make[7]: Entering directory `/home/u1/chapoton/sage/local/var/tmp/sage/build/linbox-1.4.2/src/linbox/algorithms/gauss'
315make[7]: Nothing to be done for `all'.
316make[7]: Leaving directory `/home/u1/chapoton/sage/local/var/tmp/sage/build/linbox-1.4.2/src/linbox/algorithms/gauss'
317Making all in opencl-kernels
318make[7]: Entering directory `/home/u1/chapoton/sage/local/var/tmp/sage/build/linbox-1.4.2/src/linbox/algorithms/opencl-kernels'
319make[7]: Nothing to be done for `all'.
320make[7]: Leaving directory `/home/u1/chapoton/sage/local/var/tmp/sage/build/linbox-1.4.2/src/linbox/algorithms/opencl-kernels'
321Making all in matrix-blas3
322make[7]: Entering directory `/home/u1/chapoton/sage/local/var/tmp/sage/build/linbox-1.4.2/src/linbox/algorithms/matrix-blas3'
323make[7]: Nothing to be done for `all'.
324make[7]: Leaving directory `/home/u1/chapoton/sage/local/var/tmp/sage/build/linbox-1.4.2/src/linbox/algorithms/matrix-blas3'
325Making all in polynomial-matrix
326make[7]: Entering directory `/home/u1/chapoton/sage/local/var/tmp/sage/build/linbox-1.4.2/src/linbox/algorithms/polynomial-matrix'
327make[7]: Nothing to be done for `all'.
328make[7]: Leaving directory `/home/u1/chapoton/sage/local/var/tmp/sage/build/linbox-1.4.2/src/linbox/algorithms/polynomial-matrix'
329make[7]: Entering directory `/home/u1/chapoton/sage/local/var/tmp/sage/build/linbox-1.4.2/src/linbox/algorithms'
330/bin/bash ../../libtool  --tag=CXX   --mode=compile g++ -DHAVE_CONFIG_H -I. -I../..  -I../../linbox -O2 -Wall -DNDEBUG -UFFLASFFPACK_DEBUG -D__FFLASFFPACK_HAVE_CBLAS -g -fPIC -std=gnu++11 -mmmx -mpopcnt -msse -msse2 -msse3 -msse4.1 -msse4.2 -msse4a -mavx -mfma -mfma4 -fabi-version=6 -DFFLAS_COMPILED -DFFPACK_COMPILED -mfpmath=sse -I/home/u1/chapoton/sage/local/include -I/home/u1/chapoton/sage/local//include   -I/home/u1/chapoton/sage/local/include -I/home/u1/chapoton/sage/local/include -I/home/u1/chapoton/sage/local/include -I/home/u1/chapoton/sage/local/include -I/home/u1/chapoton/sage/local/include -O2   -Wall -g -DNDEBUG -U_LB_DEBUG -DDISABLE_COMMENTATOR  -std=gnu++11  -g -fPIC -c -o diophantine-solver.lo diophantine-solver.C
331libtool: compile:  g++ -DHAVE_CONFIG_H -I. -I../.. -I../../linbox -O2 -Wall -DNDEBUG -UFFLASFFPACK_DEBUG -D__FFLASFFPACK_HAVE_CBLAS -g -fPIC -std=gnu++11 -mmmx -mpopcnt -msse -msse2 -msse3 -msse4.1 -msse4.2 -msse4a -mavx -mfma -mfma4 -fabi-version=6 -DFFLAS_COMPILED -DFFPACK_COMPILED -mfpmath=sse -I/home/u1/chapoton/sage/local/include -I/home/u1/chapoton/sage/local//include -I/home/u1/chapoton/sage/local/include -I/home/u1/chapoton/sage/local/include -I/home/u1/chapoton/sage/local/include -I/home/u1/chapoton/sage/local/include -I/home/u1/chapoton/sage/local/include -O2 -Wall -g -DNDEBUG -U_LB_DEBUG -DDISABLE_COMMENTATOR -std=gnu++11 -g -fPIC -c diophantine-solver.C  -fPIC -DPIC -o .libs/diophantine-solver.o
332In file included from ../../linbox/matrix/matrixdomain/opencl-domain-factory.h:46:0,
333                 from ../../linbox/matrix/matrixdomain/opencl-domain.h:981,
334                 from ../../linbox/matrix/matrix-domain.h:73,
335                 from ../../linbox/matrix/transpose-matrix.h:47,
336                 from ../../linbox/matrix/matrixdomain/matrix-domain.inl:34,
337                 from ../../linbox/matrix/matrixdomain/matrix-domain.h:1233,
338                 from ../../linbox/matrix/densematrix/blas-matrix.h:55,
339                 from ../../linbox/matrix/dense-matrix.h:79,
340                 from ../../linbox/algorithms/rational-solver.h:43,
341                 from ../../linbox/algorithms/diophantine-solver.h:29,
342                 from diophantine-solver.C:26:
343../../linbox/algorithms/opencl-resource-controller.h: In function 'std::string LinBox::getPlatformName(cl_platform_id)':
344../../linbox/algorithms/opencl-resource-controller.h:95:10: warning: variable 'errcode' set but not used [-Wunused-but-set-variable]
345   cl_int errcode;
346          ^
347../../linbox/algorithms/opencl-resource-controller.h: In function 'double LinBox::getPlatformVersion(cl_platform_id)':
348../../linbox/algorithms/opencl-resource-controller.h:129:10: warning: variable 'errcode' set but not used [-Wunused-but-set-variable]
349   cl_int errcode;
350          ^
351../../linbox/algorithms/opencl-resource-controller.h: In function 'std::vector<std::basic_string<char> > LinBox::getPlatformExtensions(cl_platform_id)':
352../../linbox/algorithms/opencl-resource-controller.h:178:10: warning: variable 'errcode' set but not used [-Wunused-but-set-variable]
353   cl_int errcode;
354          ^
355/bin/bash ../../libtool  --tag=CXX   --mode=link g++  -std=gnu++11  -g -fPIC  -L/home/u1/chapoton/sage/local/lib -Wl,-rpath,/home/u1/chapoton/sage/local/lib  -o libalgorithms.la  diophantine-solver.lo 
356libtool: link: ar cru .libs/libalgorithms.a .libs/diophantine-solver.o
357libtool: link: ranlib .libs/libalgorithms.a
358libtool: link: ( cd ".libs" && rm -f "libalgorithms.la" && ln -s "../libalgorithms.la" "libalgorithms.la" )
359make[7]: Leaving directory `/home/u1/chapoton/sage/local/var/tmp/sage/build/linbox-1.4.2/src/linbox/algorithms'
360make[6]: Leaving directory `/home/u1/chapoton/sage/local/var/tmp/sage/build/linbox-1.4.2/src/linbox/algorithms'
361Making all in solutions
362make[6]: Entering directory `/home/u1/chapoton/sage/local/var/tmp/sage/build/linbox-1.4.2/src/linbox/solutions'
363make[6]: Nothing to be done for `all'.
364make[6]: Leaving directory `/home/u1/chapoton/sage/local/var/tmp/sage/build/linbox-1.4.2/src/linbox/solutions'
365Making all in ring
366make[6]: Entering directory `/home/u1/chapoton/sage/local/var/tmp/sage/build/linbox-1.4.2/src/linbox/ring'
367Making all in ntl
368make[7]: Entering directory `/home/u1/chapoton/sage/local/var/tmp/sage/build/linbox-1.4.2/src/linbox/ring/ntl'
369make[7]: Nothing to be done for `all'.
370make[7]: Leaving directory `/home/u1/chapoton/sage/local/var/tmp/sage/build/linbox-1.4.2/src/linbox/ring/ntl'
371Making all in modular
372make[7]: Entering directory `/home/u1/chapoton/sage/local/var/tmp/sage/build/linbox-1.4.2/src/linbox/ring/modular'
373make[7]: Nothing to be done for `all'.
374make[7]: Leaving directory `/home/u1/chapoton/sage/local/var/tmp/sage/build/linbox-1.4.2/src/linbox/ring/modular'
375make[7]: Entering directory `/home/u1/chapoton/sage/local/var/tmp/sage/build/linbox-1.4.2/src/linbox/ring'
376make[7]: Nothing to be done for `all-am'.
377make[7]: Leaving directory `/home/u1/chapoton/sage/local/var/tmp/sage/build/linbox-1.4.2/src/linbox/ring'
378make[6]: Leaving directory `/home/u1/chapoton/sage/local/var/tmp/sage/build/linbox-1.4.2/src/linbox/ring'
379make[6]: Entering directory `/home/u1/chapoton/sage/local/var/tmp/sage/build/linbox-1.4.2/src/linbox'
380/bin/bash ../libtool  --tag=CXX   --mode=compile g++ -DHAVE_CONFIG_H -I. -I..  -I../linbox -O2 -Wall -DNDEBUG -UFFLASFFPACK_DEBUG -D__FFLASFFPACK_HAVE_CBLAS -g -fPIC -std=gnu++11 -mmmx -mpopcnt -msse -msse2 -msse3 -msse4.1 -msse4.2 -msse4a -mavx -mfma -mfma4 -fabi-version=6 -DFFLAS_COMPILED -DFFPACK_COMPILED -mfpmath=sse -I/home/u1/chapoton/sage/local/include -I/home/u1/chapoton/sage/local//include   -I/home/u1/chapoton/sage/local/include -I/home/u1/chapoton/sage/local/include -I/home/u1/chapoton/sage/local/include -I/home/u1/chapoton/sage/local/include -I/home/u1/chapoton/sage/local/include -O2   -Wall -g -DNDEBUG -U_LB_DEBUG -DDISABLE_COMMENTATOR  -std=gnu++11  -g -fPIC -c -o dummy.lo dummy.C
381libtool: compile:  g++ -DHAVE_CONFIG_H -I. -I.. -I../linbox -O2 -Wall -DNDEBUG -UFFLASFFPACK_DEBUG -D__FFLASFFPACK_HAVE_CBLAS -g -fPIC -std=gnu++11 -mmmx -mpopcnt -msse -msse2 -msse3 -msse4.1 -msse4.2 -msse4a -mavx -mfma -mfma4 -fabi-version=6 -DFFLAS_COMPILED -DFFPACK_COMPILED -mfpmath=sse -I/home/u1/chapoton/sage/local/include -I/home/u1/chapoton/sage/local//include -I/home/u1/chapoton/sage/local/include -I/home/u1/chapoton/sage/local/include -I/home/u1/chapoton/sage/local/include -I/home/u1/chapoton/sage/local/include -I/home/u1/chapoton/sage/local/include -O2 -Wall -g -DNDEBUG -U_LB_DEBUG -DDISABLE_COMMENTATOR -std=gnu++11 -g -fPIC -c dummy.C  -fPIC -DPIC -o .libs/dummy.o
382dummy.C:35:12: warning: 'dummy' defined but not used [-Wunused-variable]
383 static int dummy;
384            ^
385/bin/bash ../libtool  --tag=CXX   --mode=link g++  -std=gnu++11  -g -fPIC -L/home/u1/chapoton/sage/local/lib -lntl -L/home/u1/chapoton/sage/local/lib -lmpfr -L/home/u1/chapoton/sage/local/lib -lfplll -L/home/u1/chapoton/sage/local/lib -liml -L/home/u1/chapoton/sage/local/lib -lflint -lOpenCL -lpthread -L/home/u1/chapoton/sage/local/lib -L/home/u1/chapoton/sage/local//lib -lfflas -lffpack -lcblas -latlas -lgivaro -lgmpxx -lgmp    -L/home/u1/chapoton/sage/local/lib -Wl,-rpath,/home/u1/chapoton/sage/local/lib  -no-undefined -L/home/u1/chapoton/sage/local/lib -Wl,-rpath,/home/u1/chapoton/sage/local/lib  -o liblinbox.la -rpath /home/u1/chapoton/sage/local/lib dummy.lo util/libutil.la randiter/libranditer.la algorithms/libalgorithms.la -L/home/u1/chapoton/sage/local/lib -lmpfr -L/home/u1/chapoton/sage/local/lib -liml -lOpenCL -lpthread
386libtool: link: g++  -fPIC -DPIC -shared -nostdlib /usr/lib/gcc/x86_64-linux-gnu/4.9/../../../x86_64-linux-gnu/crti.o /usr/lib/gcc/x86_64-linux-gnu/4.9/crtbeginS.o  .libs/dummy.o  -Wl,--whole-archive util/.libs/libutil.a randiter/.libs/libranditer.a algorithms/.libs/libalgorithms.a -Wl,--no-whole-archive  -L/home/u1/chapoton/sage/local/lib -lntl -lfplll -lflint -L/home/u1/chapoton/sage/local//lib -lfflas -lffpack -lcblas -latlas -lgivaro -lgmpxx -lgmp -lmpfr -liml -lOpenCL -lpthread -L/home/u1/chapoton/sage/local/lib/../lib -L/usr/lib/gcc/x86_64-linux-gnu/4.9 -L/usr/lib/gcc/x86_64-linux-gnu/4.9/../../../x86_64-linux-gnu -L/usr/lib/gcc/x86_64-linux-gnu/4.9/../../../../lib -L/lib/x86_64-linux-gnu -L/lib/../lib -L/usr/lib/x86_64-linux-gnu -L/usr/lib/../lib -L/usr/lib/gcc/x86_64-linux-gnu/4.9/../../.. -lstdc++ -lm -lc -lgcc_s /usr/lib/gcc/x86_64-linux-gnu/4.9/crtendS.o /usr/lib/gcc/x86_64-linux-gnu/4.9/../../../x86_64-linux-gnu/crtn.o  -Wl,-rpath -Wl,/home/u1/chapoton/sage/local/lib -Wl,-rpath -Wl,/home/u1/chapoton/sage/local/lib   -Wl,-soname -Wl,liblinbox.so.0 -o .libs/liblinbox.so.0.0.0
387libtool: link: (cd ".libs" && rm -f "liblinbox.so.0" && ln -s "liblinbox.so.0.0.0" "liblinbox.so.0")
388libtool: link: (cd ".libs" && rm -f "liblinbox.so" && ln -s "liblinbox.so.0.0.0" "liblinbox.so")
389libtool: link: ( cd ".libs" && rm -f "liblinbox.la" && ln -s "../liblinbox.la" "liblinbox.la" )
390make[6]: Leaving directory `/home/u1/chapoton/sage/local/var/tmp/sage/build/linbox-1.4.2/src/linbox'
391make[5]: Leaving directory `/home/u1/chapoton/sage/local/var/tmp/sage/build/linbox-1.4.2/src/linbox'
392Making all in benchmarks
393make[5]: Entering directory `/home/u1/chapoton/sage/local/var/tmp/sage/build/linbox-1.4.2/src/benchmarks'
394Making all in data
395make[6]: Entering directory `/home/u1/chapoton/sage/local/var/tmp/sage/build/linbox-1.4.2/src/benchmarks/data'
396make[6]: Nothing to be done for `all'.
397make[6]: Leaving directory `/home/u1/chapoton/sage/local/var/tmp/sage/build/linbox-1.4.2/src/benchmarks/data'
398Making all in matrix
399make[6]: Entering directory `/home/u1/chapoton/sage/local/var/tmp/sage/build/linbox-1.4.2/src/benchmarks/matrix'
400make[6]: Nothing to be done for `all'.
401make[6]: Leaving directory `/home/u1/chapoton/sage/local/var/tmp/sage/build/linbox-1.4.2/src/benchmarks/matrix'
402make[6]: Entering directory `/home/u1/chapoton/sage/local/var/tmp/sage/build/linbox-1.4.2/src/benchmarks'
403/bin/bash ../libtool  --tag=CXX   --mode=compile g++ -DHAVE_CONFIG_H -I. -I..  -I.. -I../linbox -O2   -Wall -g -DNDEBUG -U_LB_DEBUG   -DDISABLE_COMMENTATOR -DLinBoxSrcOnly  -O2 -Wall -DNDEBUG -UFFLASFFPACK_DEBUG -D__FFLASFFPACK_HAVE_CBLAS -g -fPIC -std=gnu++11 -mmmx -mpopcnt -msse -msse2 -msse3 -msse4.1 -msse4.2 -msse4a -mavx -mfma -mfma4 -fabi-version=6 -DFFLAS_COMPILED -DFFPACK_COMPILED -mfpmath=sse -I/home/u1/chapoton/sage/local/include -I/home/u1/chapoton/sage/local//include   -I/home/u1/chapoton/sage/local/include -I/home/u1/chapoton/sage/local/include -I/home/u1/chapoton/sage/local/include -I/home/u1/chapoton/sage/local/include -I/home/u1/chapoton/sage/local/include -DDISABLE_COMMENTATOR  -std=gnu++11  -g -fPIC -c -o benchmark.lo benchmark.C
404libtool: compile:  g++ -DHAVE_CONFIG_H -I. -I.. -I.. -I../linbox -O2 -Wall -g -DNDEBUG -U_LB_DEBUG -DDISABLE_COMMENTATOR -DLinBoxSrcOnly -O2 -Wall -DNDEBUG -UFFLASFFPACK_DEBUG -D__FFLASFFPACK_HAVE_CBLAS -g -fPIC -std=gnu++11 -mmmx -mpopcnt -msse -msse2 -msse3 -msse4.1 -msse4.2 -msse4a -mavx -mfma -mfma4 -fabi-version=6 -DFFLAS_COMPILED -DFFPACK_COMPILED -mfpmath=sse -I/home/u1/chapoton/sage/local/include -I/home/u1/chapoton/sage/local//include -I/home/u1/chapoton/sage/local/include -I/home/u1/chapoton/sage/local/include -I/home/u1/chapoton/sage/local/include -I/home/u1/chapoton/sage/local/include -I/home/u1/chapoton/sage/local/include -DDISABLE_COMMENTATOR -std=gnu++11 -g -fPIC -c benchmark.C  -fPIC -DPIC -o .libs/benchmark.o
405/bin/bash ../libtool  --tag=CXX   --mode=link g++  -std=gnu++11  -g -fPIC -L/home/u1/chapoton/sage/local/lib -Wl,-rpath,/home/u1/chapoton/sage/local/lib  -L/home/u1/chapoton/sage/local/lib -lntl -L/home/u1/chapoton/sage/local/lib -lmpfr -L/home/u1/chapoton/sage/local/lib -lfplll -L/home/u1/chapoton/sage/local/lib -liml -L/home/u1/chapoton/sage/local/lib -lflint -lOpenCL -lpthread -L/home/u1/chapoton/sage/local/lib -L/home/u1/chapoton/sage/local//lib -lfflas -lffpack -lcblas -latlas -lgivaro -lgmpxx -lgmp    -L/home/u1/chapoton/sage/local/lib -Wl,-rpath,/home/u1/chapoton/sage/local/lib  -o libbenchmarks.la  benchmark.lo ../linbox/liblinbox.la
406libtool: link: ar cru .libs/libbenchmarks.a .libs/benchmark.o
407libtool: link: ranlib .libs/libbenchmarks.a
408libtool: link: ( cd ".libs" && rm -f "libbenchmarks.la" && ln -s "../libbenchmarks.la" "libbenchmarks.la" )
409make[6]: Leaving directory `/home/u1/chapoton/sage/local/var/tmp/sage/build/linbox-1.4.2/src/benchmarks'
410make[5]: Leaving directory `/home/u1/chapoton/sage/local/var/tmp/sage/build/linbox-1.4.2/src/benchmarks'
411Making all in macros
412make[5]: Entering directory `/home/u1/chapoton/sage/local/var/tmp/sage/build/linbox-1.4.2/src/macros'
413make[5]: Nothing to be done for `all'.
414make[5]: Leaving directory `/home/u1/chapoton/sage/local/var/tmp/sage/build/linbox-1.4.2/src/macros'
415Making all in tests
416make[5]: Entering directory `/home/u1/chapoton/sage/local/var/tmp/sage/build/linbox-1.4.2/src/tests'
417Making all in data
418make[6]: Entering directory `/home/u1/chapoton/sage/local/var/tmp/sage/build/linbox-1.4.2/src/tests/data'
419make[6]: Nothing to be done for `all'.
420make[6]: Leaving directory `/home/u1/chapoton/sage/local/var/tmp/sage/build/linbox-1.4.2/src/tests/data'
421Making all in matrix
422make[6]: Entering directory `/home/u1/chapoton/sage/local/var/tmp/sage/build/linbox-1.4.2/src/tests/matrix'
423make[6]: Nothing to be done for `all'.
424make[6]: Leaving directory `/home/u1/chapoton/sage/local/var/tmp/sage/build/linbox-1.4.2/src/tests/matrix'
425make[6]: Entering directory `/home/u1/chapoton/sage/local/var/tmp/sage/build/linbox-1.4.2/src/tests'
426make[6]: Nothing to be done for `all-am'.
427make[6]: Leaving directory `/home/u1/chapoton/sage/local/var/tmp/sage/build/linbox-1.4.2/src/tests'
428make[5]: Leaving directory `/home/u1/chapoton/sage/local/var/tmp/sage/build/linbox-1.4.2/src/tests'
429Making all in interfaces
430make[5]: Entering directory `/home/u1/chapoton/sage/local/var/tmp/sage/build/linbox-1.4.2/src/interfaces'
431Making all in driver
432make[6]: Entering directory `/home/u1/chapoton/sage/local/var/tmp/sage/build/linbox-1.4.2/src/interfaces/driver'
433/bin/bash ../../libtool  --tag=CXX   --mode=compile g++ -DHAVE_CONFIG_H -I. -I../..  -I../.. -I. -I../../linbox -DDISABLE_COMMENTATOR -O2   -Wall -g -DNDEBUG -U_LB_DEBUG -DDISABLE_COMMENTATOR -I/home/u1/chapoton/sage/local/include -std=gnu++11  -g -fPIC -c -o lb-element.lo lb-element.C
434libtool: compile:  g++ -DHAVE_CONFIG_H -I. -I../.. -I../.. -I. -I../../linbox -DDISABLE_COMMENTATOR -O2 -Wall -g -DNDEBUG -U_LB_DEBUG -DDISABLE_COMMENTATOR -I/home/u1/chapoton/sage/local/include -std=gnu++11 -g -fPIC -c lb-element.C  -fPIC -DPIC -o .libs/lb-element.o
435In file included from ../../../../../../../../include/linbox/field/Givaro/givaro-zpz.h:506:0,
436                 from ../../../../../../../../include/linbox/field/givaro.h:31,
437                 from ./lb-domain-type.h:31,
438                 from ./lb-domain-functor.h:30,
439                 from ./lb-domain-function.h:30,
440                 from ./lb-element-data.h:33,
441                 from lb-element.C:30:
442../../../../../../../../include/linbox/field/Givaro/givaro-zpz.inl: In member function 'LinBox::GivaroZpz<Givaro::Std32>::Element& LinBox::DotProductDomain<LinBox::GivaroZpz<Givaro::Std32> >::dotSpecializedDD(LinBox::GivaroZpz<Givaro::Std32>::Element&, const Vector1&, const Vector2&) const':
443../../../../../../../../include/linbox/field/Givaro/givaro-zpz.inl:58:43: error: '_field' was not declared in this scope
444    uint64_t min       = Max / (Corr+ (uint64_t)(_field.characteristic()-1)*(uint64_t)(_field.characteristic()-1));
445                                           ^
446../../../../../../../../include/linbox/field/Givaro/givaro-zpz.inl: In member function 'LinBox::GivaroZpz<Givaro::Std32>::Element& LinBox::DotProductDomain<LinBox::GivaroZpz<Givaro::Std32> >::dotSpecializedDSP(LinBox::GivaroZpz<Givaro::Std32>::Element&, const Vector1&, const Vector2&) const':
447../../../../../../../../include/linbox/field/Givaro/givaro-zpz.inl:97:43: error: '_field' was not declared in this scope
448    uint64_t min       = Max / (Corr+ (uint64_t)(_field.characteristic()-1)*(uint64_t)(_field.characteristic()-1));
449                                           ^
450../../../../../../../../include/linbox/field/Givaro/givaro-zpz.inl: In member function 'LinBox::GivaroZpz<Givaro::Std16>::Element& LinBox::DotProductDomain<LinBox::GivaroZpz<Givaro::Std16> >::dotSpecializedDD(LinBox::GivaroZpz<Givaro::Std16>::Element&, const Vector1&, const Vector2&) const':
451../../../../../../../../include/linbox/field/Givaro/givaro-zpz.inl:137:43: error: '_field' was not declared in this scope
452    uint32_t min       = Max / (Corr+ ((uint32_t)_field.characteristic()-1)*(uint32_t)(_field.characteristic()-1));
453                                           ^
454../../../../../../../../include/linbox/field/Givaro/givaro-zpz.inl: In member function 'LinBox::GivaroZpz<Givaro::Std16>::Element& LinBox::DotProductDomain<LinBox::GivaroZpz<Givaro::Std16> >::dotSpecializedDSP(LinBox::GivaroZpz<Givaro::Std16>::Element&, const Vector1&, const Vector2&) const':
455../../../../../../../../include/linbox/field/Givaro/givaro-zpz.inl:176:43: error: '_field' was not declared in this scope
456    uint32_t min       = Max / (Corr+ (uint32_t)(_field.characteristic()-1)*(uint32_t)(_field.characteristic()-1));
457                                           ^
458In file included from ../../../../../../../../include/linbox/field/givaro.h:33:0,
459                 from ./lb-domain-type.h:31,
460                 from ./lb-domain-functor.h:30,
461                 from ./lb-domain-function.h:30,
462                 from ./lb-element-data.h:33,
463                 from lb-element.C:30:
464../../../../../../../../include/linbox/field/Givaro/givaro-gfq.h: In static member function 'static bool LinBox::FieldTraits<Field>::goodModulus(const integer&) [with Field = LinBox::GivaroGfq; LinBox::integer = Givaro::Integer]':
465../../../../../../../../include/linbox/field/Givaro/givaro-gfq.h:88:30: error: 'probab_prime' was not declared in this scope
466   return probab_prime( i, 10 );
467                              ^
468../../../../../../../../include/linbox/field/Givaro/givaro-gfq.h:88:30: note: suggested alternative:
469In file included from ../../../../../../../../include/gmp++/gmp++.h:56:0,
470                 from ../../linbox/integer.h:46,
471                 from ./lb-domain-collection.h:28,
472                 from ./lb-element.h:30,
473                 from lb-element.C:29:
474../../../../../../../../include/gmp++/gmp++_int.h:1497:32: note:   'Givaro::Protected::probab_prime'
475                 friend giv_all_inlined  int32_t Protected::probab_prime(const Integer& p, int32_t r);
476                                ^
477In file included from ../../../../../../../../include/linbox/field/Givaro/givaro-rational.h:120:0,
478                 from ../../../../../../../../include/linbox/field/givaro.h:34,
479                 from ./lb-domain-type.h:31,
480                 from ./lb-domain-functor.h:30,
481                 from ./lb-domain-function.h:30,
482                 from ./lb-element-data.h:33,
483                 from lb-element.C:30:
484../../linbox/field/hom.h: At global scope:
485../../linbox/field/hom.h:521:13: error: 'GFq' is not a member of 'Givaro'
486  class Hom <Givaro::GFq,Givaro::GFq> {
487             ^
488../../linbox/field/hom.h:521:13: error: 'GFq' is not a member of 'Givaro'
489../../linbox/field/hom.h:521:25: error: 'GFq' is not a member of 'Givaro'
490  class Hom <Givaro::GFq,Givaro::GFq> {
491                         ^
492../../linbox/field/hom.h:521:25: error: 'GFq' is not a member of 'Givaro'
493../../linbox/field/hom.h:521:36: error: template argument 1 is invalid
494  class Hom <Givaro::GFq,Givaro::GFq> {
495                                    ^
496../../linbox/field/hom.h:521:36: error: template argument 2 is invalid
497In file included from ./lb-domain-functor.h:30:0,
498                 from ./lb-domain-function.h:30,
499                 from ./lb-element-data.h:33,
500                 from lb-element.C:30:
501./lb-domain-type.h:45:26: error: 'Givaro' is not a member of 'LinBox'
502 typedef LinBoxTypelist < LinBox::Givaro::ZRing<Integer>              , DL1> DL2;
503                          ^
504./lb-domain-type.h:45:26: note: suggested alternative:
505In file included from ../../../../../../../../include/gmp++/gmp++_int.h:41:0,
506                 from ../../../../../../../../include/gmp++/gmp++.h:56,
507                 from ../../linbox/integer.h:46,
508                 from ./lb-domain-collection.h:28,
509                 from ./lb-element.h:30,
510                 from lb-element.C:29:
511../../../../../../../../include/givaro/givcaster.h:19:18: note:   'Givaro'
512 namespace Givaro {
513                  ^
514In file included from ./lb-domain-functor.h:30:0,
515                 from ./lb-domain-function.h:30,
516                 from ./lb-element-data.h:33,
517                 from lb-element.C:30:
518./lb-domain-type.h:45:26: error: 'Givaro' is not a member of 'LinBox'
519 typedef LinBoxTypelist < LinBox::Givaro::ZRing<Integer>              , DL1> DL2;
520                          ^
521./lb-domain-type.h:45:26: note: suggested alternative:
522In file included from ../../../../../../../../include/gmp++/gmp++_int.h:41:0,
523                 from ../../../../../../../../include/gmp++/gmp++.h:56,
524                 from ../../linbox/integer.h:46,
525                 from ./lb-domain-collection.h:28,
526                 from ./lb-element.h:30,
527                 from lb-element.C:29:
528../../../../../../../../include/givaro/givcaster.h:19:18: note:   'Givaro'
529 namespace Givaro {
530                  ^
531In file included from ./lb-domain-functor.h:30:0,
532                 from ./lb-domain-function.h:30,
533                 from ./lb-element-data.h:33,
534                 from lb-element.C:30:
535./lb-domain-type.h:45:62: error: wrong number of template arguments (1, should be 2)
536 typedef LinBoxTypelist < LinBox::Givaro::ZRing<Integer>              , DL1> DL2;
537                                                              ^
538In file included from ./lb-domain-abstract.h:28:0,
539                 from ./lb-domain-collection.h:31,
540                 from ./lb-element.h:30,
541                 from lb-element.C:29:
542./lb-utilities.h:94:8: error: provided for 'template<class T, class U> struct LinBoxTypelist'
543 struct LinBoxTypelist {
544        ^
545In file included from ./lb-domain-functor.h:30:0,
546                 from ./lb-domain-function.h:30,
547                 from ./lb-element-data.h:33,
548                 from lb-element.C:30:
549./lb-domain-type.h:45:67: error: invalid type in declaration before ';' token
550 typedef LinBoxTypelist < LinBox::Givaro::ZRing<Integer>              , DL1> DL2;
551                                                                   ^
552./lb-domain-type.h:48:26: error: 'Givaro' is not a member of 'LinBox'
553 typedef LinBoxTypelist < LinBox::Givaro::Modular<int64_t>         , DL4> DL5;
554                          ^
555./lb-domain-type.h:48:26: note: suggested alternative:
556In file included from ../../../../../../../../include/gmp++/gmp++_int.h:41:0,
557                 from ../../../../../../../../include/gmp++/gmp++.h:56,
558                 from ../../linbox/integer.h:46,
559                 from ./lb-domain-collection.h:28,
560                 from ./lb-element.h:30,
561                 from lb-element.C:29:
562../../../../../../../../include/givaro/givcaster.h:19:18: note:   'Givaro'
563 namespace Givaro {
564                  ^
565In file included from ./lb-domain-functor.h:30:0,
566                 from ./lb-domain-function.h:30,
567                 from ./lb-element-data.h:33,
568                 from lb-element.C:30:
569./lb-domain-type.h:48:26: error: 'Givaro' is not a member of 'LinBox'
570 typedef LinBoxTypelist < LinBox::Givaro::Modular<int64_t>         , DL4> DL5;
571                          ^
572./lb-domain-type.h:48:26: note: suggested alternative:
573In file included from ../../../../../../../../include/gmp++/gmp++_int.h:41:0,
574                 from ../../../../../../../../include/gmp++/gmp++.h:56,
575                 from ../../linbox/integer.h:46,
576                 from ./lb-domain-collection.h:28,
577                 from ./lb-element.h:30,
578                 from lb-element.C:29:
579../../../../../../../../include/givaro/givcaster.h:19:18: note:   'Givaro'
580 namespace Givaro {
581                  ^
582In file included from ./lb-domain-functor.h:30:0,
583                 from ./lb-domain-function.h:30,
584                 from ./lb-element-data.h:33,
585                 from lb-element.C:30:
586./lb-domain-type.h:48:64: error: wrong number of template arguments (1, should be 2)
587 typedef LinBoxTypelist < LinBox::Givaro::Modular<int64_t>         , DL4> DL5;
588                                                                ^
589In file included from ./lb-domain-abstract.h:28:0,
590                 from ./lb-domain-collection.h:31,
591                 from ./lb-element.h:30,
592                 from lb-element.C:29:
593./lb-utilities.h:94:8: error: provided for 'template<class T, class U> struct LinBoxTypelist'
594 struct LinBoxTypelist {
595        ^
596In file included from ./lb-domain-functor.h:30:0,
597                 from ./lb-domain-function.h:30,
598                 from ./lb-element-data.h:33,
599                 from lb-element.C:30:
600./lb-domain-type.h:48:69: error: invalid type in declaration before ';' token
601 typedef LinBoxTypelist < LinBox::Givaro::Modular<int64_t>         , DL4> DL5;
602                                                                     ^
603./lb-domain-type.h:71:26: error: 'Givaro' is not a member of 'LinBox'
604 typedef LinBoxTypelist < LinBox::Givaro::GFq, LinBoxDumbType> DG1;
605                          ^
606./lb-domain-type.h:71:26: note: suggested alternative:
607In file included from ../../../../../../../../include/gmp++/gmp++_int.h:41:0,
608                 from ../../../../../../../../include/gmp++/gmp++.h:56,
609                 from ../../linbox/integer.h:46,
610                 from ./lb-domain-collection.h:28,
611                 from ./lb-element.h:30,
612                 from lb-element.C:29:
613../../../../../../../../include/givaro/givcaster.h:19:18: note:   'Givaro'
614 namespace Givaro {
615                  ^
616In file included from ./lb-domain-functor.h:30:0,
617                 from ./lb-domain-function.h:30,
618                 from ./lb-element-data.h:33,
619                 from lb-element.C:30:
620./lb-domain-type.h:71:26: error: 'Givaro' is not a member of 'LinBox'
621 typedef LinBoxTypelist < LinBox::Givaro::GFq, LinBoxDumbType> DG1;
622                          ^
623./lb-domain-type.h:71:26: note: suggested alternative:
624In file included from ../../../../../../../../include/gmp++/gmp++_int.h:41:0,
625                 from ../../../../../../../../include/gmp++/gmp++.h:56,
626                 from ../../linbox/integer.h:46,
627                 from ./lb-domain-collection.h:28,
628                 from ./lb-element.h:30,
629                 from lb-element.C:29:
630../../../../../../../../include/givaro/givcaster.h:19:18: note:   'Givaro'
631 namespace Givaro {
632                  ^
633In file included from ./lb-domain-functor.h:30:0,
634                 from ./lb-domain-function.h:30,
635                 from ./lb-element-data.h:33,
636                 from lb-element.C:30:
637./lb-domain-type.h:71:61: error: wrong number of template arguments (1, should be 2)
638 typedef LinBoxTypelist < LinBox::Givaro::GFq, LinBoxDumbType> DG1;
639                                                             ^
640In file included from ./lb-domain-abstract.h:28:0,
641                 from ./lb-domain-collection.h:31,
642                 from ./lb-element.h:30,
643                 from lb-element.C:29:
644./lb-utilities.h:94:8: error: provided for 'template<class T, class U> struct LinBoxTypelist'
645 struct LinBoxTypelist {
646        ^
647In file included from ./lb-domain-functor.h:30:0,
648                 from ./lb-domain-function.h:30,
649                 from ./lb-element-data.h:33,
650                 from lb-element.C:30:
651./lb-domain-type.h:71:66: error: invalid type in declaration before ';' token
652 typedef LinBoxTypelist < LinBox::Givaro::GFq, LinBoxDumbType> DG1;
653                                                                  ^
654In file included from ./lb-domain-functor.h:30:0,
655                 from ./lb-domain-function.h:30,
656                 from ./lb-element-data.h:33,
657                 from lb-element.C:30:
658./lb-domain-type.h: In function 'void UpdateDomain()':
659./lb-domain-type.h:98:60: error: 'Givaro' is not a member of 'LinBox'
660  linbox_domain.add("linbox_ring_integer"   , constructDomain<LinBox::Givaro::ZRing<Integer> >);
661                                                            ^
662./lb-domain-type.h:98:60: note: suggested alternative:
663In file included from ../../../../../../../../include/gmp++/gmp++_int.h:41:0,
664                 from ../../../../../../../../include/gmp++/gmp++.h:56,
665                 from ../../linbox/integer.h:46,
666                 from ./lb-domain-collection.h:28,
667                 from ./lb-element.h:30,
668                 from lb-element.C:29:
669../../../../../../../../include/givaro/givcaster.h:19:18: note:   'Givaro'
670 namespace Givaro {
671                  ^
672In file included from ./lb-domain-functor.h:30:0,
673                 from ./lb-domain-function.h:30,
674                 from ./lb-element-data.h:33,
675                 from lb-element.C:30:
676./lb-domain-type.h:98:60: error: 'Givaro' is not a member of 'LinBox'
677  linbox_domain.add("linbox_ring_integer"   , constructDomain<LinBox::Givaro::ZRing<Integer> >);
678                                                            ^
679./lb-domain-type.h:98:60: note: suggested alternative:
680In file included from ../../../../../../../../include/gmp++/gmp++_int.h:41:0,
681                 from ../../../../../../../../include/gmp++/gmp++.h:56,
682                 from ../../linbox/integer.h:46,
683                 from ./lb-domain-collection.h:28,
684                 from ./lb-element.h:30,
685                 from lb-element.C:29:
686../../../../../../../../include/givaro/givcaster.h:19:18: note:   'Givaro'
687 namespace Givaro {
688                  ^
689In file included from ./lb-domain-functor.h:30:0,
690                 from ./lb-domain-function.h:30,
691                 from ./lb-element-data.h:33,
692                 from lb-element.C:30:
693./lb-domain-type.h:98:44: error: parse error in template argument list
694  linbox_domain.add("linbox_ring_integer"   , constructDomain<LinBox::Givaro::ZRing<Integer> >);
695                                            ^
696./lb-domain-type.h:98:92: error: no matching function for call to 'Domain_Factory::add(const char [20], <unresolved overloaded function type>)'
697  linbox_domain.add("linbox_ring_integer"   , constructDomain<LinBox::Givaro::ZRing<Integer> >);
698                                                                                            ^
699./lb-domain-type.h:98:92: note: candidate is:
700In file included from ./lb-element-data.h:29:0,
701                 from lb-element.C:30:
702./lb-domain-data.h:56:7: note: bool Domain_Factory::add(const char*, Domain_Factory::createDomainCallBack)
703  bool add(const char *name, createDomainCallBack createD){
704       ^
705./lb-domain-data.h:56:7: note:   no known conversion for argument 2 from '<unresolved overloaded function type>' to 'Domain_Factory::createDomainCallBack {aka DomainAbstract* (*)(const Givaro::Integer&)}'
706In file included from ./lb-domain-functor.h:30:0,
707                 from ./lb-domain-function.h:30,
708                 from ./lb-element-data.h:33,
709                 from lb-element.C:30:
710./lb-domain-type.h:112:57: error: 'Givaro' is not a member of 'LinBox'
711  linbox_domain.add("givaro_field_gfq"    , constructDomain<LinBox::Givaro::GFq>);
712                                                         ^
713./lb-domain-type.h:112:57: note: suggested alternative:
714In file included from ../../../../../../../../include/gmp++/gmp++_int.h:41:0,
715                 from ../../../../../../../../include/gmp++/gmp++.h:56,
716                 from ../../linbox/integer.h:46,
717                 from ./lb-domain-collection.h:28,
718                 from ./lb-element.h:30,
719                 from lb-element.C:29:
720../../../../../../../../include/givaro/givcaster.h:19:18: note:   'Givaro'
721 namespace Givaro {
722                  ^
723In file included from ./lb-domain-functor.h:30:0,
724                 from ./lb-domain-function.h:30,
725                 from ./lb-element-data.h:33,
726                 from lb-element.C:30:
727./lb-domain-type.h:112:57: error: 'Givaro' is not a member of 'LinBox'
728  linbox_domain.add("givaro_field_gfq"    , constructDomain<LinBox::Givaro::GFq>);
729                                                         ^
730./lb-domain-type.h:112:57: note: suggested alternative:
731In file included from ../../../../../../../../include/gmp++/gmp++_int.h:41:0,
732                 from ../../../../../../../../include/gmp++/gmp++.h:56,
733                 from ../../linbox/integer.h:46,
734                 from ./lb-domain-collection.h:28,
735                 from ./lb-element.h:30,
736                 from lb-element.C:29:
737../../../../../../../../include/givaro/givcaster.h:19:18: note:   'Givaro'
738 namespace Givaro {
739                  ^
740In file included from ./lb-domain-functor.h:30:0,
741                 from ./lb-domain-function.h:30,
742                 from ./lb-element-data.h:33,
743                 from lb-element.C:30:
744./lb-domain-type.h:112:41: error: parse error in template argument list
745  linbox_domain.add("givaro_field_gfq"    , constructDomain<LinBox::Givaro::GFq>);
746                                         ^
747./lb-domain-type.h:112:77: error: no matching function for call to 'Domain_Factory::add(const char [17], <unresolved overloaded function type>)'
748  linbox_domain.add("givaro_field_gfq"    , constructDomain<LinBox::Givaro::GFq>);
749                                                                             ^
750./lb-domain-type.h:112:77: note: candidate is:
751In file included from ./lb-element-data.h:29:0,
752                 from lb-element.C:30:
753./lb-domain-data.h:56:7: note: bool Domain_Factory::add(const char*, Domain_Factory::createDomainCallBack)
754  bool add(const char *name, createDomainCallBack createD){
755       ^
756./lb-domain-data.h:56:7: note:   no known conversion for argument 2 from '<unresolved overloaded function type>' to 'Domain_Factory::createDomainCallBack {aka DomainAbstract* (*)(const Givaro::Integer&)}'
757In file included from ./lb-domain-function.h:30:0,
758                 from ./lb-element-data.h:33,
759                 from lb-element.C:30:
760./lb-domain-functor.h: In instantiation of 'class LinBoxDomainVisitor<LinBoxTypelist<LinBox::GMPRationalField, int>, CreateEltFunctor, EltAbstract*>':
761./lb-domain-functor.h:88:7:   required from 'class ApplyDomainFunctor<CreateEltFunctor, EltAbstract*>'
762./lb-domain-function.h:44:39:   required from 'static void DomainFunction::call(Result&, const std::pair<const DomainKey, DomainAbstract*>&, const Functor&) [with Functor = CreateEltFunctor; Result = EltAbstract*]'
763./lb-domain-function.h:60:42:   required from 'static void DomainFunction::call(Result&, const DomainKey&, const Functor&) [with Functor = CreateEltFunctor; Result = EltAbstract*]'
764./lb-element-data.h:76:34:   required from here
765./lb-domain-functor.h:75:7: error: invalid use of incomplete type 'class LinBoxDomainVisitor<int, CreateEltFunctor, EltAbstract*>'
766 class LinBoxDomainVisitor<LinBoxTypelist<Head, Tail>, Functor, Result >
767       ^
768./lb-domain-functor.h:62:59: error: declaration of 'class LinBoxDomainVisitor<int, CreateEltFunctor, EltAbstract*>'
769 template <class DList, class Functor, class Result> class LinBoxDomainVisitor;
770                                                           ^
771./lb-domain-functor.h: In instantiation of 'class LinBoxDomainVisitor<LinBoxTypelist<LinBox::GMPRationalField, int>, SerializeElementFunctor, SerialElement>':
772./lb-domain-functor.h:88:7:   required from 'class ApplyDomainFunctor<SerializeElementFunctor, SerialElement>'
773./lb-domain-function.h:44:39:   required from 'static void DomainFunction::call(Result&, const std::pair<const DomainKey, DomainAbstract*>&, const Functor&) [with Functor = SerializeElementFunctor; Result = SerialElement]'
774./lb-domain-function.h:60:42:   required from 'static void DomainFunction::call(Result&, const DomainKey&, const Functor&) [with Functor = SerializeElementFunctor; Result = SerialElement]'
775lb-element.C:127:57:   required from here
776./lb-domain-functor.h:75:7: error: invalid use of incomplete type 'class LinBoxDomainVisitor<int, SerializeElementFunctor, SerialElement>'
777 class LinBoxDomainVisitor<LinBoxTypelist<Head, Tail>, Functor, Result >
778       ^
779./lb-domain-functor.h:62:59: error: declaration of 'class LinBoxDomainVisitor<int, SerializeElementFunctor, SerialElement>'
780 template <class DList, class Functor, class Result> class LinBoxDomainVisitor;
781                                                           ^
782./lb-domain-functor.h: In instantiation of 'class LinBoxDomainVisitor<LinBoxTypelist<LinBox::GMPRationalField, int>, WriteElementFunctor, void*>':
783./lb-domain-functor.h:88:7:   required from 'class ApplyDomainFunctor<WriteElementFunctor, void*>'
784./lb-domain-function.h:44:39:   required from 'static void DomainFunction::call(Result&, const std::pair<const DomainKey, DomainAbstract*>&, const Functor&) [with Functor = WriteElementFunctor; Result = void*]'
785./lb-domain-function.h:60:42:   required from 'static void DomainFunction::call(Result&, const DomainKey&, const Functor&) [with Functor = WriteElementFunctor; Result = void*]'
786./lb-domain-function.h:69:24:   required from 'static void DomainFunction::call(const DomainKey&, const Functor&) [with Functor = WriteElementFunctor]'
787lb-element.C:80:54:   required from here
788./lb-domain-functor.h:75:7: error: invalid use of incomplete type 'class LinBoxDomainVisitor<int, WriteElementFunctor, void*>'
789 class LinBoxDomainVisitor<LinBoxTypelist<Head, Tail>, Functor, Result >
790       ^
791./lb-domain-functor.h:62:59: error: declaration of 'class LinBoxDomainVisitor<int, WriteElementFunctor, void*>'
792 template <class DList, class Functor, class Result> class LinBoxDomainVisitor;
793                                                           ^
794./lb-domain-functor.h: In instantiation of 'void LinBoxDomainVisitor<LinBoxTypelist<T, U>, Functor, Result>::visit(const DomainEnvelope<Domain>&) [with Head = LinBox::GMPRationalField; Tail = int; Functor = WriteElementFunctor; Result = void*]':
795lb-element.C:128:1:   required from here
796./lb-domain-functor.h:79:44: error: 'class LinBoxDomainVisitor<LinBoxTypelist<LinBox::GMPRationalField, int>, WriteElementFunctor, void*>' has no member named 'apply'
797  LB_DOMAIN_VISIT(Head);
798                                            ^
799./lb-domain-functor.h: In instantiation of 'void LinBoxDomainVisitor<LinBoxTypelist<T, U>, Functor, Result>::visit(const DomainEnvelope<Domain>&) [with Head = LinBox::GMPRationalField; Tail = int; Functor = SerializeElementFunctor; Result = SerialElement]':
800lb-element.C:128:1:   required from here
801./lb-domain-functor.h:79:44: error: 'class LinBoxDomainVisitor<LinBoxTypelist<LinBox::GMPRationalField, int>, SerializeElementFunctor, SerialElement>' has no member named 'apply'
802./lb-domain-functor.h: In instantiation of 'void LinBoxDomainVisitor<LinBoxTypelist<T, U>, Functor, Result>::visit(const DomainEnvelope<Domain>&) [with Head = LinBox::GMPRationalField; Tail = int; Functor = CreateEltFunctor; Result = EltAbstract*]':
803lb-element.C:128:1:   required from here
804./lb-domain-functor.h:79:44: error: 'class LinBoxDomainVisitor<LinBoxTypelist<LinBox::GMPRationalField, int>, CreateEltFunctor, EltAbstract*>' has no member named 'apply'
805make[6]: *** [lb-element.lo] Error 1
806make[6]: Leaving directory `/home/u1/chapoton/sage/local/var/tmp/sage/build/linbox-1.4.2/src/interfaces/driver'
807make[5]: *** [all-recursive] Error 1
808make[5]: Leaving directory `/home/u1/chapoton/sage/local/var/tmp/sage/build/linbox-1.4.2/src/interfaces'
809make[4]: *** [all-recursive] Error 1
810make[4]: Leaving directory `/home/u1/chapoton/sage/local/var/tmp/sage/build/linbox-1.4.2/src'
811make[3]: *** [all] Error 2
812make[3]: Leaving directory `/home/u1/chapoton/sage/local/var/tmp/sage/build/linbox-1.4.2/src'
813Error building LinBox.
814
815real    0m19.337s
816user    0m7.869s
817sys     0m9.609s
818************************************************************************
819Error installing package linbox-1.4.2
820************************************************************************
821Please email sage-devel (http://groups.google.com/group/sage-devel)
822explaining the problem and including the relevant part of the log file
823  /home/u1/chapoton/sage/logs/pkgs/linbox-1.4.2.log
824Describe your computer, operating system, etc.
825If you want to try to fix the problem yourself, *don't* just cd to
826/home/u1/chapoton/sage/local/var/tmp/sage/build/linbox-1.4.2 and type 'make' or whatever is appropriate.
827Instead, the following commands setup all environment variables
828correctly and load a subshell for you to debug the error:
829  (cd '/home/u1/chapoton/sage/local/var/tmp/sage/build/linbox-1.4.2' && '/home/u1/chapoton/sage/sage' --sh)
830When you are done debugging, you can type "exit" to leave the subshell.
831************************************************************************