Ticket #17635: linbox-1.4.2.log

File linbox-1.4.2.log, 39.9 KB (added by dcoudert, 3 years ago)

linbox log when trying the trick of comment https://trac.sagemath.org/ticket/17635#comment:221

Line 
1Found local metadata for linbox-1.4.2
2Using cached file /home/dcoudert/sage-dev/sage/upstream/linbox-1.4.2.tar.gz
3linbox-1.4.2
4====================================================
5Setting up build directory for linbox-1.4.2
6Finished extraction
7****************************************************
8Host system:
9Linux musclotte 4.1.5-100.fc21.x86_64 #1 SMP Tue Aug 11 00:24:23 UTC 2015 x86_64 x86_64 x86_64 GNU/Linux
10****************************************************
11C compiler: gcc
12C compiler version:
13Using built-in specs.
14COLLECT_GCC=/usr/bin/gcc
15COLLECT_LTO_WRAPPER=/usr/libexec/gcc/x86_64-redhat-linux/4.9.2/lto-wrapper
16Target: x86_64-redhat-linux
17Configured with: ../configure --prefix=/usr --mandir=/usr/share/man --infodir=/usr/share/info --with-bugurl=http://bugzilla.redhat.com/bugzilla --enable-bootstrap --enable-shared --enable-threads=posix --enable-checking=release --enable-multilib --with-system-zlib --enable-__cxa_atexit --disable-libunwind-exceptions --enable-gnu-unique-object --enable-linker-build-id --with-linker-hash-style=gnu --enable-languages=c,c++,objc,obj-c++,fortran,ada,go,lto --enable-plugin --enable-initfini-array --disable-libgcj --with-isl=/builddir/build/BUILD/gcc-4.9.2-20150212/obj-x86_64-redhat-linux/isl-install --with-cloog=/builddir/build/BUILD/gcc-4.9.2-20150212/obj-x86_64-redhat-linux/cloog-install --enable-gnu-indirect-function --with-tune=generic --with-arch_32=i686 --build=x86_64-redhat-linux
18Thread model: posix
19gcc version 4.9.2 20150212 (Red Hat 4.9.2-6) (GCC)
20****************************************************
21checking for a BSD-compatible install... /usr/bin/install -c
22checking whether build environment is sane... yes
23checking for a thread-safe mkdir -p... /usr/bin/mkdir -p
24checking for gawk... gawk
25checking whether make sets $(MAKE)... yes
26checking whether make supports nested variables... yes
27checking for rm... /usr/bin/rm
28checking whether to enable maintainer-specific portions of Makefiles... no
29-----------------------------------------------
30checking whether to enable debugging options in the library... no
31checking whether to enable profiling everything in the library... no
32checking whether to enable warnings when compiling the library... no
33-----------------------------------------------
34checking whether the C++ compiler works... yes
35checking for C++ compiler default output file name... a.out
36checking for suffix of executables...
37checking whether we are cross compiling... no
38checking for suffix of object files... o
39checking whether we are using the GNU C++ compiler... yes
40checking whether g++ accepts -g... yes
41checking for family name of compiler... gcc (GCC) 4.9.2 20150212 (Red Hat 4.9.2-6)
42checking whether g++ supports C++11 features by default... no
43checking whether g++ supports C++11 features with -std=gnu++11... yes
44checking how to run the C++ preprocessor... g++ -E
45checking for grep that handles long lines and -e... /usr/bin/grep
46checking for egrep... /usr/bin/grep -E
47checking for ANSI C header files... yes
48checking build system type... x86_64-unknown-linux-gnu
49checking host system type... x86_64-unknown-linux-gnu
50checking how to print strings... printf
51checking for gcc... gcc
52checking whether we are using the GNU C compiler... yes
53checking whether gcc accepts -g... yes
54checking for gcc option to accept ISO C89... none needed
55checking whether gcc understands -c and -o together... yes
56checking for a sed that does not truncate output... /usr/bin/sed
57checking for fgrep... /usr/bin/grep -F
58checking for ld used by gcc... ld
59checking if the linker (ld) is GNU ld... yes
60checking for BSD- or MS-compatible name lister (nm)... /usr/bin/nm -B
61checking the name lister (/usr/bin/nm -B) interface... BSD nm
62checking whether ln -s works... yes
63checking the maximum length of command line arguments... 1572864
64checking whether the shell understands some XSI constructs... yes
65checking whether the shell understands "+="... yes
66checking how to convert x86_64-unknown-linux-gnu file names to x86_64-unknown-linux-gnu format... func_convert_file_noop
67checking how to convert x86_64-unknown-linux-gnu file names to toolchain format... func_convert_file_noop
68checking for ld option to reload object files... -r
69checking for objdump... objdump
70checking how to recognize dependent libraries... pass_all
71checking for dlltool... no
72checking how to associate runtime and link libraries... printf %s\n
73checking for archiver @FILE support... @
74checking for strip... strip
75checking for ranlib... ranlib
76checking command to parse /usr/bin/nm -B output from gcc object... ok
77checking for sysroot... no
78checking for mt... no
79checking if : is a manifest tool... no
80checking for sys/types.h... yes
81checking for sys/stat.h... yes
82checking for stdlib.h... yes
83checking for string.h... yes
84checking for memory.h... yes
85checking for strings.h... yes
86checking for inttypes.h... yes
87checking for stdint.h... yes
88checking for unistd.h... yes
89checking for dlfcn.h... yes
90checking for objdir... .libs
91checking if gcc supports -fno-rtti -fno-exceptions... no
92checking for gcc option to produce PIC... -fPIC -DPIC
93checking if gcc PIC flag -fPIC -DPIC works... yes
94checking if gcc static flag -static works... no
95checking if gcc supports -c -o file.o... yes
96checking if gcc supports -c -o file.o... (cached) yes
97checking whether the gcc linker (ld -m elf_x86_64) supports shared libraries... yes
98checking whether -lc should be explicitly linked in... no
99checking dynamic linker characteristics... GNU/Linux ld.so
100checking how to hardcode library paths into programs... immediate
101checking whether stripping libraries is possible... yes
102checking if libtool supports shared libraries... yes
103checking whether to build shared libraries... yes
104checking whether to build static libraries... no
105checking how to run the C++ preprocessor... g++ -E
106checking for ld used by g++... ld -m elf_x86_64
107checking if the linker (ld -m elf_x86_64) is GNU ld... yes
108checking whether the g++ linker (ld -m elf_x86_64) supports shared libraries... yes
109checking for g++ option to produce PIC... -fPIC -DPIC
110checking if g++ PIC flag -fPIC -DPIC works... yes
111checking if g++ static flag -static works... no
112checking if g++ supports -c -o file.o... yes
113checking if g++ supports -c -o file.o... (cached) yes
114checking whether the g++ linker (ld -m elf_x86_64) supports shared libraries... yes
115checking dynamic linker characteristics... (cached) GNU/Linux ld.so
116checking how to hardcode library paths into programs... immediate
117-----------------------------------------------
118       START  LINBOX CONFIG                   
119-----------------------------------------------
120-----------------------------------------------
121checking enabling OpenMP... no
122-----------------------------------------------
123checking size of char... 1
124checking size of short... 2
125checking size of int... 4
126checking size of long... 8
127checking size of long long... 8
128checking size of __int64... 0
129checking for ANSI C header files... (cached) yes
130checking float.h usability... yes
131checking float.h presence... yes
132checking for float.h... yes
133checking limits.h usability... yes
134checking limits.h presence... yes
135checking for limits.h... yes
136checking stddef.h usability... yes
137checking stddef.h presence... yes
138checking for stddef.h... yes
139checking for stdlib.h... (cached) yes
140checking for string.h... (cached) yes
141checking sys/time.h usability... yes
142checking sys/time.h presence... yes
143checking for sys/time.h... yes
144checking for stdint.h... (cached) yes
145checking pthread.h usability... yes
146checking pthread.h presence... yes
147checking for pthread.h... yes
148checking whether byte ordering is bigendian... no
149-----------------------------------------------
150Default path = /usr /usr/local
151Checking all external packages in /home/dcoudert/sage-dev/sage/local /usr /usr/local
152checking whether to compile the drivers... no
153-----------------------------------------------
154checking for pkg-config... /home/dcoudert/sage-dev/sage/local/bin/pkg-config
155checking pkg-config is at least version 0.9.0... yes
156checking for FFLAS_FFPACK... yes
157checking for LAPACK in fflas-ffpack... no
158checking for IML... found
159checking for M4RI... found
160checking for M4RIE... not found
161checking for MPFR... found
162checking for FPLLL >= 4.0.1... found
163checking for FLINT... found
164checking for NTL >= 5.0... found
165checking for SACLIB >= 2.0... not found
166checking for MAPLE >= 9.0... ./configure: line 18187: /bin/maple.system.type: No such file or directory
167found
168checking whether to compile the SAGE interface... yes
169checking whether gnuplot works... yes
170checking whether ps2pdf works... yes
171checking if tinyxml2 is available... no
172configure: WARNING: tinyxml2 is not installed (no import/export of benchmarks).
173checking whether to build documentation... no
174checking whether dot works... yes
175checking for OpenCL >= 1.0... not found
176-----------------------------------------------
177CXXFLAGS       =  -std=gnu++11  -g -fPIC
178LIBS           =
179DEPS_CFLAGS    = -O2 -Wall -DNDEBUG -UFFLASFFPACK_DEBUG -D__FFLASFFPACK_HAVE_CBLAS -g -O2 -fPIC -fpermissive -std=gnu++11 -mmmx -mpopcnt -msse -msse2 -msse3 -msse4.1 -msse4.2 -fabi-version=6 -DFFLAS_COMPILED -DFFPACK_COMPILED -fPIC -std=gnu++11 -mmmx -mpopcnt -msse -msse2 -msse3 -msse4.1 -msse4.2 -mfpmath=sse -fabi-version=6 -I/home/dcoudert/sage-dev/sage/local/include -I/home/dcoudert/sage-dev/sage/local//include -I/home/dcoudert/sage-dev/sage/local/include  -I/home/dcoudert/sage-dev/sage/local/include -I/home/dcoudert/sage-dev/sage/local/include -I/home/dcoudert/sage-dev/sage/local/include -I/home/dcoudert/sage-dev/sage/local/include -I/home/dcoudert/sage-dev/sage/local/include
180DEPS_LIBS      =  -L/home/dcoudert/sage-dev/sage/local/lib -lntl -L/home/dcoudert/sage-dev/sage/local/lib -lmpfr -L/home/dcoudert/sage-dev/sage/local/lib -lfplll -L/home/dcoudert/sage-dev/sage/local/lib -liml -L/home/dcoudert/sage-dev/sage/local/lib -lflint  -L/home/dcoudert/sage-dev/sage/local/lib -L/home/dcoudert/sage-dev/sage/local//lib -lfflas -lffpack -lcblas -latlas -lgivaro -lgmpxx -lgmp 
181DEFAULT CFLAGS = -O2   -Wall -g -DNDEBUG -U_LB_DEBUG
182TESTS CFLAGS   = -O2 -Wall -g -DNDEBUG -U_LB_DEBUG
183-----------------------------------------------
184        END   LINBOX CONFIG                   
185-----------------------------------------------
186checking that generated files are newer than configure... done
187configure: creating ./config.status
188config.status: creating Makefile
189config.status: creating linbox-config
190config.status: creating examples/Makefile
191config.status: creating doc/Makefile
192config.status: creating linbox/Makefile
193config.status: creating linbox/algorithms/Makefile
194config.status: creating linbox/algorithms/gauss/Makefile
195config.status: creating linbox/algorithms/matrix-blas3/Makefile
196config.status: creating linbox/algorithms/opencl-kernels/Makefile
197config.status: creating linbox/algorithms/polynomial-matrix/Makefile
198config.status: creating linbox/blackbox/Makefile
199config.status: creating linbox/element/Makefile
200config.status: creating linbox/field/Makefile
201config.status: creating linbox/matrix/Makefile
202config.status: creating linbox/matrix/sparsematrix/Makefile
203config.status: creating linbox/matrix/densematrix/Makefile
204config.status: creating linbox/matrix/matrixdomain/Makefile
205config.status: creating linbox/matrix/sliced3/Makefile
206config.status: creating linbox/randiter/Makefile
207config.status: creating linbox/ring/Makefile
208config.status: creating linbox/ring/ntl/Makefile
209config.status: creating linbox/ring/modular/Makefile
210config.status: creating linbox/solutions/Makefile
211config.status: creating linbox/util/Makefile
212config.status: creating linbox/util/formats/Makefile
213config.status: creating linbox/vector/Makefile
214config.status: creating tests/Makefile
215config.status: creating tests/data/Makefile
216config.status: creating tests/matrix/Makefile
217config.status: creating interfaces/Makefile
218config.status: creating interfaces/driver/Makefile
219config.status: creating interfaces/maple/Makefile
220config.status: creating interfaces/kaapi/Makefile
221config.status: creating interfaces/sage/Makefile
222config.status: creating macros/Makefile
223config.status: creating benchmarks/Makefile
224config.status: creating benchmarks/data/Makefile
225config.status: creating benchmarks/matrix/Makefile
226config.status: creating linbox.pc
227config.status: creating config.h
228config.status: executing linbox/config.h commands
229config.status: creating linbox/config.h - prefix __LINBOX for config.h defines
230config.status: executing depfiles commands
231config.status: executing libtool commands
232-----------------------------------------------
233make[3]: Entering directory '/home/dcoudert/sage-dev/sage/local/var/tmp/sage/build/linbox-1.4.2/src'
234make  all-recursive
235make[4]: Entering directory '/home/dcoudert/sage-dev/sage/local/var/tmp/sage/build/linbox-1.4.2/src'
236Making all in linbox
237make[5]: Entering directory '/home/dcoudert/sage-dev/sage/local/var/tmp/sage/build/linbox-1.4.2/src/linbox'
238Making all in util
239make[6]: Entering directory '/home/dcoudert/sage-dev/sage/local/var/tmp/sage/build/linbox-1.4.2/src/linbox/util'
240Making all in formats
241make[7]: Entering directory '/home/dcoudert/sage-dev/sage/local/var/tmp/sage/build/linbox-1.4.2/src/linbox/util/formats'
242make[7]: Nothing to be done for 'all'.
243make[7]: Leaving directory '/home/dcoudert/sage-dev/sage/local/var/tmp/sage/build/linbox-1.4.2/src/linbox/util/formats'
244make[7]: Entering directory '/home/dcoudert/sage-dev/sage/local/var/tmp/sage/build/linbox-1.4.2/src/linbox/util'
245/bin/sh ../../libtool  --tag=CXX   --mode=compile g++ -DHAVE_CONFIG_H -I. -I../..  -I../../linbox -O2 -Wall -DNDEBUG -UFFLASFFPACK_DEBUG -D__FFLASFFPACK_HAVE_CBLAS -g -O2 -fPIC -fpermissive -std=gnu++11 -mmmx -mpopcnt -msse -msse2 -msse3 -msse4.1 -msse4.2 -fabi-version=6 -DFFLAS_COMPILED -DFFPACK_COMPILED -fPIC -std=gnu++11 -mmmx -mpopcnt -msse -msse2 -msse3 -msse4.1 -msse4.2 -mfpmath=sse -fabi-version=6 -I/home/dcoudert/sage-dev/sage/local/include -I/home/dcoudert/sage-dev/sage/local//include -I/home/dcoudert/sage-dev/sage/local/include  -I/home/dcoudert/sage-dev/sage/local/include -I/home/dcoudert/sage-dev/sage/local/include -I/home/dcoudert/sage-dev/sage/local/include -I/home/dcoudert/sage-dev/sage/local/include -I/home/dcoudert/sage-dev/sage/local/include -O2   -Wall -g -DNDEBUG -U_LB_DEBUG -DDISABLE_COMMENTATOR  -std=gnu++11  -g -fPIC -c -o error.lo error.C
246libtool: compile:  g++ -DHAVE_CONFIG_H -I. -I../.. -I../../linbox -O2 -Wall -DNDEBUG -UFFLASFFPACK_DEBUG -D__FFLASFFPACK_HAVE_CBLAS -g -O2 -fPIC -fpermissive -std=gnu++11 -mmmx -mpopcnt -msse -msse2 -msse3 -msse4.1 -msse4.2 -fabi-version=6 -DFFLAS_COMPILED -DFFPACK_COMPILED -fPIC -std=gnu++11 -mmmx -mpopcnt -msse -msse2 -msse3 -msse4.1 -msse4.2 -mfpmath=sse -fabi-version=6 -I/home/dcoudert/sage-dev/sage/local/include -I/home/dcoudert/sage-dev/sage/local//include -I/home/dcoudert/sage-dev/sage/local/include -I/home/dcoudert/sage-dev/sage/local/include -I/home/dcoudert/sage-dev/sage/local/include -I/home/dcoudert/sage-dev/sage/local/include -I/home/dcoudert/sage-dev/sage/local/include -I/home/dcoudert/sage-dev/sage/local/include -O2 -Wall -g -DNDEBUG -U_LB_DEBUG -DDISABLE_COMMENTATOR -std=gnu++11 -g -fPIC -c error.C  -fPIC -DPIC -o .libs/error.o
247/bin/sh ../../libtool  --tag=CXX   --mode=compile g++ -DHAVE_CONFIG_H -I. -I../..  -I../../linbox -O2 -Wall -DNDEBUG -UFFLASFFPACK_DEBUG -D__FFLASFFPACK_HAVE_CBLAS -g -O2 -fPIC -fpermissive -std=gnu++11 -mmmx -mpopcnt -msse -msse2 -msse3 -msse4.1 -msse4.2 -fabi-version=6 -DFFLAS_COMPILED -DFFPACK_COMPILED -fPIC -std=gnu++11 -mmmx -mpopcnt -msse -msse2 -msse3 -msse4.1 -msse4.2 -mfpmath=sse -fabi-version=6 -I/home/dcoudert/sage-dev/sage/local/include -I/home/dcoudert/sage-dev/sage/local//include -I/home/dcoudert/sage-dev/sage/local/include  -I/home/dcoudert/sage-dev/sage/local/include -I/home/dcoudert/sage-dev/sage/local/include -I/home/dcoudert/sage-dev/sage/local/include -I/home/dcoudert/sage-dev/sage/local/include -I/home/dcoudert/sage-dev/sage/local/include -O2   -Wall -g -DNDEBUG -U_LB_DEBUG -DDISABLE_COMMENTATOR  -std=gnu++11  -g -fPIC -c -o debug.lo debug.C
248libtool: compile:  g++ -DHAVE_CONFIG_H -I. -I../.. -I../../linbox -O2 -Wall -DNDEBUG -UFFLASFFPACK_DEBUG -D__FFLASFFPACK_HAVE_CBLAS -g -O2 -fPIC -fpermissive -std=gnu++11 -mmmx -mpopcnt -msse -msse2 -msse3 -msse4.1 -msse4.2 -fabi-version=6 -DFFLAS_COMPILED -DFFPACK_COMPILED -fPIC -std=gnu++11 -mmmx -mpopcnt -msse -msse2 -msse3 -msse4.1 -msse4.2 -mfpmath=sse -fabi-version=6 -I/home/dcoudert/sage-dev/sage/local/include -I/home/dcoudert/sage-dev/sage/local//include -I/home/dcoudert/sage-dev/sage/local/include -I/home/dcoudert/sage-dev/sage/local/include -I/home/dcoudert/sage-dev/sage/local/include -I/home/dcoudert/sage-dev/sage/local/include -I/home/dcoudert/sage-dev/sage/local/include -I/home/dcoudert/sage-dev/sage/local/include -O2 -Wall -g -DNDEBUG -U_LB_DEBUG -DDISABLE_COMMENTATOR -std=gnu++11 -g -fPIC -c debug.C  -fPIC -DPIC -o .libs/debug.o
249/bin/sh ../../libtool  --tag=CXX   --mode=link g++  -std=gnu++11  -g -fPIC -L/home/dcoudert/sage-dev/sage/local/lib -Wl,-rpath,/home/dcoudert/sage-dev/sage/local/lib  -L/home/dcoudert/sage-dev/sage/local/lib -Wl,-rpath,/home/dcoudert/sage-dev/sage/local/lib  -o libutil.la  error.lo debug.lo 
250libtool: link: ar cru .libs/libutil.a .libs/error.o .libs/debug.o
251libtool: link: ranlib .libs/libutil.a
252libtool: link: ( cd ".libs" && rm -f "libutil.la" && ln -s "../libutil.la" "libutil.la" )
253make[7]: Leaving directory '/home/dcoudert/sage-dev/sage/local/var/tmp/sage/build/linbox-1.4.2/src/linbox/util'
254make[6]: Leaving directory '/home/dcoudert/sage-dev/sage/local/var/tmp/sage/build/linbox-1.4.2/src/linbox/util'
255Making all in element
256make[6]: Entering directory '/home/dcoudert/sage-dev/sage/local/var/tmp/sage/build/linbox-1.4.2/src/linbox/element'
257make[6]: Nothing to be done for 'all'.
258make[6]: Leaving directory '/home/dcoudert/sage-dev/sage/local/var/tmp/sage/build/linbox-1.4.2/src/linbox/element'
259Making all in field
260make[6]: Entering directory '/home/dcoudert/sage-dev/sage/local/var/tmp/sage/build/linbox-1.4.2/src/linbox/field'
261make[6]: Nothing to be done for 'all'.
262make[6]: Leaving directory '/home/dcoudert/sage-dev/sage/local/var/tmp/sage/build/linbox-1.4.2/src/linbox/field'
263Making all in randiter
264make[6]: Entering directory '/home/dcoudert/sage-dev/sage/local/var/tmp/sage/build/linbox-1.4.2/src/linbox/randiter'
265/bin/sh ../../libtool  --tag=CXX   --mode=compile g++ -DHAVE_CONFIG_H -I. -I../..  -I../../linbox -O2 -Wall -DNDEBUG -UFFLASFFPACK_DEBUG -D__FFLASFFPACK_HAVE_CBLAS -g -O2 -fPIC -fpermissive -std=gnu++11 -mmmx -mpopcnt -msse -msse2 -msse3 -msse4.1 -msse4.2 -fabi-version=6 -DFFLAS_COMPILED -DFFPACK_COMPILED -fPIC -std=gnu++11 -mmmx -mpopcnt -msse -msse2 -msse3 -msse4.1 -msse4.2 -mfpmath=sse -fabi-version=6 -I/home/dcoudert/sage-dev/sage/local/include -I/home/dcoudert/sage-dev/sage/local//include -I/home/dcoudert/sage-dev/sage/local/include  -I/home/dcoudert/sage-dev/sage/local/include -I/home/dcoudert/sage-dev/sage/local/include -I/home/dcoudert/sage-dev/sage/local/include -I/home/dcoudert/sage-dev/sage/local/include -I/home/dcoudert/sage-dev/sage/local/include -DDISABLE_COMMENTATOR  -std=gnu++11  -g -fPIC -c -o mersenne-twister.lo mersenne-twister.C
266libtool: compile:  g++ -DHAVE_CONFIG_H -I. -I../.. -I../../linbox -O2 -Wall -DNDEBUG -UFFLASFFPACK_DEBUG -D__FFLASFFPACK_HAVE_CBLAS -g -O2 -fPIC -fpermissive -std=gnu++11 -mmmx -mpopcnt -msse -msse2 -msse3 -msse4.1 -msse4.2 -fabi-version=6 -DFFLAS_COMPILED -DFFPACK_COMPILED -fPIC -std=gnu++11 -mmmx -mpopcnt -msse -msse2 -msse3 -msse4.1 -msse4.2 -mfpmath=sse -fabi-version=6 -I/home/dcoudert/sage-dev/sage/local/include -I/home/dcoudert/sage-dev/sage/local//include -I/home/dcoudert/sage-dev/sage/local/include -I/home/dcoudert/sage-dev/sage/local/include -I/home/dcoudert/sage-dev/sage/local/include -I/home/dcoudert/sage-dev/sage/local/include -I/home/dcoudert/sage-dev/sage/local/include -I/home/dcoudert/sage-dev/sage/local/include -DDISABLE_COMMENTATOR -std=gnu++11 -g -fPIC -c mersenne-twister.C  -fPIC -DPIC -o .libs/mersenne-twister.o
267/bin/sh ../../libtool  --tag=CXX   --mode=link g++  -std=gnu++11  -g -fPIC  -L/home/dcoudert/sage-dev/sage/local/lib -Wl,-rpath,/home/dcoudert/sage-dev/sage/local/lib  -o libranditer.la mersenne-twister.lo 
268libtool: link: ar cru .libs/libranditer.a .libs/mersenne-twister.o
269libtool: link: ranlib .libs/libranditer.a
270libtool: link: ( cd ".libs" && rm -f "libranditer.la" && ln -s "../libranditer.la" "libranditer.la" )
271make[6]: Leaving directory '/home/dcoudert/sage-dev/sage/local/var/tmp/sage/build/linbox-1.4.2/src/linbox/randiter'
272Making all in vector
273make[6]: Entering directory '/home/dcoudert/sage-dev/sage/local/var/tmp/sage/build/linbox-1.4.2/src/linbox/vector'
274make[6]: Nothing to be done for 'all'.
275make[6]: Leaving directory '/home/dcoudert/sage-dev/sage/local/var/tmp/sage/build/linbox-1.4.2/src/linbox/vector'
276Making all in matrix
277make[6]: Entering directory '/home/dcoudert/sage-dev/sage/local/var/tmp/sage/build/linbox-1.4.2/src/linbox/matrix'
278Making all in sparsematrix
279make[7]: Entering directory '/home/dcoudert/sage-dev/sage/local/var/tmp/sage/build/linbox-1.4.2/src/linbox/matrix/sparsematrix'
280make[7]: Nothing to be done for 'all'.
281make[7]: Leaving directory '/home/dcoudert/sage-dev/sage/local/var/tmp/sage/build/linbox-1.4.2/src/linbox/matrix/sparsematrix'
282Making all in densematrix
283make[7]: Entering directory '/home/dcoudert/sage-dev/sage/local/var/tmp/sage/build/linbox-1.4.2/src/linbox/matrix/densematrix'
284make[7]: Nothing to be done for 'all'.
285make[7]: Leaving directory '/home/dcoudert/sage-dev/sage/local/var/tmp/sage/build/linbox-1.4.2/src/linbox/matrix/densematrix'
286Making all in matrixdomain
287make[7]: Entering directory '/home/dcoudert/sage-dev/sage/local/var/tmp/sage/build/linbox-1.4.2/src/linbox/matrix/matrixdomain'
288make[7]: Nothing to be done for 'all'.
289make[7]: Leaving directory '/home/dcoudert/sage-dev/sage/local/var/tmp/sage/build/linbox-1.4.2/src/linbox/matrix/matrixdomain'
290Making all in sliced3
291make[7]: Entering directory '/home/dcoudert/sage-dev/sage/local/var/tmp/sage/build/linbox-1.4.2/src/linbox/matrix/sliced3'
292make[7]: Nothing to be done for 'all'.
293make[7]: Leaving directory '/home/dcoudert/sage-dev/sage/local/var/tmp/sage/build/linbox-1.4.2/src/linbox/matrix/sliced3'
294make[7]: Entering directory '/home/dcoudert/sage-dev/sage/local/var/tmp/sage/build/linbox-1.4.2/src/linbox/matrix'
295make[7]: Nothing to be done for 'all-am'.
296make[7]: Leaving directory '/home/dcoudert/sage-dev/sage/local/var/tmp/sage/build/linbox-1.4.2/src/linbox/matrix'
297make[6]: Leaving directory '/home/dcoudert/sage-dev/sage/local/var/tmp/sage/build/linbox-1.4.2/src/linbox/matrix'
298Making all in blackbox
299make[6]: Entering directory '/home/dcoudert/sage-dev/sage/local/var/tmp/sage/build/linbox-1.4.2/src/linbox/blackbox'
300make[6]: Nothing to be done for 'all'.
301make[6]: Leaving directory '/home/dcoudert/sage-dev/sage/local/var/tmp/sage/build/linbox-1.4.2/src/linbox/blackbox'
302Making all in algorithms
303make[6]: Entering directory '/home/dcoudert/sage-dev/sage/local/var/tmp/sage/build/linbox-1.4.2/src/linbox/algorithms'
304Making all in gauss
305make[7]: Entering directory '/home/dcoudert/sage-dev/sage/local/var/tmp/sage/build/linbox-1.4.2/src/linbox/algorithms/gauss'
306make[7]: Nothing to be done for 'all'.
307make[7]: Leaving directory '/home/dcoudert/sage-dev/sage/local/var/tmp/sage/build/linbox-1.4.2/src/linbox/algorithms/gauss'
308Making all in opencl-kernels
309make[7]: Entering directory '/home/dcoudert/sage-dev/sage/local/var/tmp/sage/build/linbox-1.4.2/src/linbox/algorithms/opencl-kernels'
310make[7]: Nothing to be done for 'all'.
311make[7]: Leaving directory '/home/dcoudert/sage-dev/sage/local/var/tmp/sage/build/linbox-1.4.2/src/linbox/algorithms/opencl-kernels'
312Making all in matrix-blas3
313make[7]: Entering directory '/home/dcoudert/sage-dev/sage/local/var/tmp/sage/build/linbox-1.4.2/src/linbox/algorithms/matrix-blas3'
314make[7]: Nothing to be done for 'all'.
315make[7]: Leaving directory '/home/dcoudert/sage-dev/sage/local/var/tmp/sage/build/linbox-1.4.2/src/linbox/algorithms/matrix-blas3'
316Making all in polynomial-matrix
317make[7]: Entering directory '/home/dcoudert/sage-dev/sage/local/var/tmp/sage/build/linbox-1.4.2/src/linbox/algorithms/polynomial-matrix'
318make[7]: Nothing to be done for 'all'.
319make[7]: Leaving directory '/home/dcoudert/sage-dev/sage/local/var/tmp/sage/build/linbox-1.4.2/src/linbox/algorithms/polynomial-matrix'
320make[7]: Entering directory '/home/dcoudert/sage-dev/sage/local/var/tmp/sage/build/linbox-1.4.2/src/linbox/algorithms'
321/bin/sh ../../libtool  --tag=CXX   --mode=compile g++ -DHAVE_CONFIG_H -I. -I../..  -I../../linbox -O2 -Wall -DNDEBUG -UFFLASFFPACK_DEBUG -D__FFLASFFPACK_HAVE_CBLAS -g -O2 -fPIC -fpermissive -std=gnu++11 -mmmx -mpopcnt -msse -msse2 -msse3 -msse4.1 -msse4.2 -fabi-version=6 -DFFLAS_COMPILED -DFFPACK_COMPILED -fPIC -std=gnu++11 -mmmx -mpopcnt -msse -msse2 -msse3 -msse4.1 -msse4.2 -mfpmath=sse -fabi-version=6 -I/home/dcoudert/sage-dev/sage/local/include -I/home/dcoudert/sage-dev/sage/local//include -I/home/dcoudert/sage-dev/sage/local/include  -I/home/dcoudert/sage-dev/sage/local/include -I/home/dcoudert/sage-dev/sage/local/include -I/home/dcoudert/sage-dev/sage/local/include -I/home/dcoudert/sage-dev/sage/local/include -I/home/dcoudert/sage-dev/sage/local/include -O2   -Wall -g -DNDEBUG -U_LB_DEBUG -DDISABLE_COMMENTATOR  -std=gnu++11  -g -fPIC -c -o diophantine-solver.lo diophantine-solver.C
322libtool: compile:  g++ -DHAVE_CONFIG_H -I. -I../.. -I../../linbox -O2 -Wall -DNDEBUG -UFFLASFFPACK_DEBUG -D__FFLASFFPACK_HAVE_CBLAS -g -O2 -fPIC -fpermissive -std=gnu++11 -mmmx -mpopcnt -msse -msse2 -msse3 -msse4.1 -msse4.2 -fabi-version=6 -DFFLAS_COMPILED -DFFPACK_COMPILED -fPIC -std=gnu++11 -mmmx -mpopcnt -msse -msse2 -msse3 -msse4.1 -msse4.2 -mfpmath=sse -fabi-version=6 -I/home/dcoudert/sage-dev/sage/local/include -I/home/dcoudert/sage-dev/sage/local//include -I/home/dcoudert/sage-dev/sage/local/include -I/home/dcoudert/sage-dev/sage/local/include -I/home/dcoudert/sage-dev/sage/local/include -I/home/dcoudert/sage-dev/sage/local/include -I/home/dcoudert/sage-dev/sage/local/include -I/home/dcoudert/sage-dev/sage/local/include -O2 -Wall -g -DNDEBUG -U_LB_DEBUG -DDISABLE_COMMENTATOR -std=gnu++11 -g -fPIC -c diophantine-solver.C  -fPIC -DPIC -o .libs/diophantine-solver.o
323/bin/sh ../../libtool  --tag=CXX   --mode=link g++  -std=gnu++11  -g -fPIC  -L/home/dcoudert/sage-dev/sage/local/lib -Wl,-rpath,/home/dcoudert/sage-dev/sage/local/lib  -o libalgorithms.la diophantine-solver.lo 
324libtool: link: ar cru .libs/libalgorithms.a .libs/diophantine-solver.o
325libtool: link: ranlib .libs/libalgorithms.a
326libtool: link: ( cd ".libs" && rm -f "libalgorithms.la" && ln -s "../libalgorithms.la" "libalgorithms.la" )
327make[7]: Leaving directory '/home/dcoudert/sage-dev/sage/local/var/tmp/sage/build/linbox-1.4.2/src/linbox/algorithms'
328make[6]: Leaving directory '/home/dcoudert/sage-dev/sage/local/var/tmp/sage/build/linbox-1.4.2/src/linbox/algorithms'
329Making all in solutions
330make[6]: Entering directory '/home/dcoudert/sage-dev/sage/local/var/tmp/sage/build/linbox-1.4.2/src/linbox/solutions'
331make[6]: Nothing to be done for 'all'.
332make[6]: Leaving directory '/home/dcoudert/sage-dev/sage/local/var/tmp/sage/build/linbox-1.4.2/src/linbox/solutions'
333Making all in ring
334make[6]: Entering directory '/home/dcoudert/sage-dev/sage/local/var/tmp/sage/build/linbox-1.4.2/src/linbox/ring'
335Making all in ntl
336make[7]: Entering directory '/home/dcoudert/sage-dev/sage/local/var/tmp/sage/build/linbox-1.4.2/src/linbox/ring/ntl'
337make[7]: Nothing to be done for 'all'.
338make[7]: Leaving directory '/home/dcoudert/sage-dev/sage/local/var/tmp/sage/build/linbox-1.4.2/src/linbox/ring/ntl'
339Making all in modular
340make[7]: Entering directory '/home/dcoudert/sage-dev/sage/local/var/tmp/sage/build/linbox-1.4.2/src/linbox/ring/modular'
341make[7]: Nothing to be done for 'all'.
342make[7]: Leaving directory '/home/dcoudert/sage-dev/sage/local/var/tmp/sage/build/linbox-1.4.2/src/linbox/ring/modular'
343make[7]: Entering directory '/home/dcoudert/sage-dev/sage/local/var/tmp/sage/build/linbox-1.4.2/src/linbox/ring'
344make[7]: Nothing to be done for 'all-am'.
345make[7]: Leaving directory '/home/dcoudert/sage-dev/sage/local/var/tmp/sage/build/linbox-1.4.2/src/linbox/ring'
346make[6]: Leaving directory '/home/dcoudert/sage-dev/sage/local/var/tmp/sage/build/linbox-1.4.2/src/linbox/ring'
347make[6]: Entering directory '/home/dcoudert/sage-dev/sage/local/var/tmp/sage/build/linbox-1.4.2/src/linbox'
348/bin/sh ../libtool  --tag=CXX   --mode=compile g++ -DHAVE_CONFIG_H -I. -I..  -I../linbox -O2 -Wall -DNDEBUG -UFFLASFFPACK_DEBUG -D__FFLASFFPACK_HAVE_CBLAS -g -O2 -fPIC -fpermissive -std=gnu++11 -mmmx -mpopcnt -msse -msse2 -msse3 -msse4.1 -msse4.2 -fabi-version=6 -DFFLAS_COMPILED -DFFPACK_COMPILED -fPIC -std=gnu++11 -mmmx -mpopcnt -msse -msse2 -msse3 -msse4.1 -msse4.2 -mfpmath=sse -fabi-version=6 -I/home/dcoudert/sage-dev/sage/local/include -I/home/dcoudert/sage-dev/sage/local//include -I/home/dcoudert/sage-dev/sage/local/include  -I/home/dcoudert/sage-dev/sage/local/include -I/home/dcoudert/sage-dev/sage/local/include -I/home/dcoudert/sage-dev/sage/local/include -I/home/dcoudert/sage-dev/sage/local/include -I/home/dcoudert/sage-dev/sage/local/include -O2   -Wall -g -DNDEBUG -U_LB_DEBUG -DDISABLE_COMMENTATOR  -std=gnu++11  -g -fPIC -c -o dummy.lo dummy.C
349libtool: compile:  g++ -DHAVE_CONFIG_H -I. -I.. -I../linbox -O2 -Wall -DNDEBUG -UFFLASFFPACK_DEBUG -D__FFLASFFPACK_HAVE_CBLAS -g -O2 -fPIC -fpermissive -std=gnu++11 -mmmx -mpopcnt -msse -msse2 -msse3 -msse4.1 -msse4.2 -fabi-version=6 -DFFLAS_COMPILED -DFFPACK_COMPILED -fPIC -std=gnu++11 -mmmx -mpopcnt -msse -msse2 -msse3 -msse4.1 -msse4.2 -mfpmath=sse -fabi-version=6 -I/home/dcoudert/sage-dev/sage/local/include -I/home/dcoudert/sage-dev/sage/local//include -I/home/dcoudert/sage-dev/sage/local/include -I/home/dcoudert/sage-dev/sage/local/include -I/home/dcoudert/sage-dev/sage/local/include -I/home/dcoudert/sage-dev/sage/local/include -I/home/dcoudert/sage-dev/sage/local/include -I/home/dcoudert/sage-dev/sage/local/include -O2 -Wall -g -DNDEBUG -U_LB_DEBUG -DDISABLE_COMMENTATOR -std=gnu++11 -g -fPIC -c dummy.C  -fPIC -DPIC -o .libs/dummy.o
350dummy.C:35:12: warning: 'dummy' defined but not used [-Wunused-variable]
351static int dummy;
352           ^
353/bin/sh ../libtool  --tag=CXX   --mode=link g++  -std=gnu++11  -g -fPIC -L/home/dcoudert/sage-dev/sage/local/lib -lntl -L/home/dcoudert/sage-dev/sage/local/lib -lmpfr -L/home/dcoudert/sage-dev/sage/local/lib -lfplll -L/home/dcoudert/sage-dev/sage/local/lib -liml -L/home/dcoudert/sage-dev/sage/local/lib -lflint  -L/home/dcoudert/sage-dev/sage/local/lib -L/home/dcoudert/sage-dev/sage/local//lib -lfflas -lffpack -lcblas -latlas -lgivaro -lgmpxx -lgmp   -L/home/dcoudert/sage-dev/sage/local/lib -Wl,-rpath,/home/dcoudert/sage-dev/sage/local/lib -no-undefined -L/home/dcoudert/sage-dev/sage/local/lib -Wl,-rpath,/home/dcoudert/sage-dev/sage/local/lib  -o liblinbox.la -rpath /home/dcoudert/sage-dev/sage/local/lib dummy.lo util/libutil.la randiter/libranditer.la algorithms/libalgorithms.la -L/home/dcoudert/sage-dev/sage/local/lib -lmpfr -L/home/dcoudert/sage-dev/sage/local/lib -liml 
354libtool: link: g++  -fPIC -DPIC -shared -nostdlib /usr/lib/gcc/x86_64-redhat-linux/4.9.2/../../../../lib64/crti.o /usr/lib/gcc/x86_64-redhat-linux/4.9.2/crtbeginS.o  .libs/dummy.o  -Wl,--whole-archive util/.libs/libutil.a randiter/.libs/libranditer.a algorithms/.libs/libalgorithms.a -Wl,--no-whole-archive  -L/home/dcoudert/sage-dev/sage/local/lib -lntl -lfplll -lflint -L/home/dcoudert/sage-dev/sage/local//lib -lfflas -lffpack -lcblas -latlas -lgivaro -lgmpxx -lgmp -lmpfr -liml -L/home/dcoudert/sage-dev/sage/local/lib/../lib64 -L/usr/lib/gcc/x86_64-redhat-linux/4.9.2 -L/usr/lib/gcc/x86_64-redhat-linux/4.9.2/../../../../lib64 -L/lib/../lib64 -L/usr/lib/../lib64 -L/usr/lib/gcc/x86_64-redhat-linux/4.9.2/../../.. -lstdc++ -lm -lc -lgcc_s /usr/lib/gcc/x86_64-redhat-linux/4.9.2/crtendS.o /usr/lib/gcc/x86_64-redhat-linux/4.9.2/../../../../lib64/crtn.o  -Wl,-rpath -Wl,/home/dcoudert/sage-dev/sage/local/lib -Wl,-rpath -Wl,/home/dcoudert/sage-dev/sage/local/lib   -Wl,-soname -Wl,liblinbox.so.0 -o .libs/liblinbox.so.0.0.0
355libtool: link: (cd ".libs" && rm -f "liblinbox.so.0" && ln -s "liblinbox.so.0.0.0" "liblinbox.so.0")
356libtool: link: (cd ".libs" && rm -f "liblinbox.so" && ln -s "liblinbox.so.0.0.0" "liblinbox.so")
357libtool: link: ( cd ".libs" && rm -f "liblinbox.la" && ln -s "../liblinbox.la" "liblinbox.la" )
358make[6]: Leaving directory '/home/dcoudert/sage-dev/sage/local/var/tmp/sage/build/linbox-1.4.2/src/linbox'
359make[5]: Leaving directory '/home/dcoudert/sage-dev/sage/local/var/tmp/sage/build/linbox-1.4.2/src/linbox'
360Making all in benchmarks
361make[5]: Entering directory '/home/dcoudert/sage-dev/sage/local/var/tmp/sage/build/linbox-1.4.2/src/benchmarks'
362Making all in data
363make[6]: Entering directory '/home/dcoudert/sage-dev/sage/local/var/tmp/sage/build/linbox-1.4.2/src/benchmarks/data'
364make[6]: Nothing to be done for 'all'.
365make[6]: Leaving directory '/home/dcoudert/sage-dev/sage/local/var/tmp/sage/build/linbox-1.4.2/src/benchmarks/data'
366Making all in matrix
367make[6]: Entering directory '/home/dcoudert/sage-dev/sage/local/var/tmp/sage/build/linbox-1.4.2/src/benchmarks/matrix'
368make[6]: Nothing to be done for 'all'.
369make[6]: Leaving directory '/home/dcoudert/sage-dev/sage/local/var/tmp/sage/build/linbox-1.4.2/src/benchmarks/matrix'
370make[6]: Entering directory '/home/dcoudert/sage-dev/sage/local/var/tmp/sage/build/linbox-1.4.2/src/benchmarks'
371/bin/sh ../libtool  --tag=CXX   --mode=compile g++ -DHAVE_CONFIG_H -I. -I..  -I.. -I../linbox -O2   -Wall -g -DNDEBUG -U_LB_DEBUG   -DDISABLE_COMMENTATOR -DLinBoxSrcOnly -O2 -Wall -DNDEBUG -UFFLASFFPACK_DEBUG -D__FFLASFFPACK_HAVE_CBLAS -g -O2 -fPIC -fpermissive -std=gnu++11 -mmmx -mpopcnt -msse -msse2 -msse3 -msse4.1 -msse4.2 -fabi-version=6 -DFFLAS_COMPILED -DFFPACK_COMPILED -fPIC -std=gnu++11 -mmmx -mpopcnt -msse -msse2 -msse3 -msse4.1 -msse4.2 -mfpmath=sse -fabi-version=6 -I/home/dcoudert/sage-dev/sage/local/include -I/home/dcoudert/sage-dev/sage/local//include -I/home/dcoudert/sage-dev/sage/local/include  -I/home/dcoudert/sage-dev/sage/local/include -I/home/dcoudert/sage-dev/sage/local/include -I/home/dcoudert/sage-dev/sage/local/include -I/home/dcoudert/sage-dev/sage/local/include -I/home/dcoudert/sage-dev/sage/local/include -DDISABLE_COMMENTATOR  -std=gnu++11  -g -fPIC -c -o benchmark.lo benchmark.C
372libtool: compile:  g++ -DHAVE_CONFIG_H -I. -I.. -I.. -I../linbox -O2 -Wall -g -DNDEBUG -U_LB_DEBUG -DDISABLE_COMMENTATOR -DLinBoxSrcOnly -O2 -Wall -DNDEBUG -UFFLASFFPACK_DEBUG -D__FFLASFFPACK_HAVE_CBLAS -g -O2 -fPIC -fpermissive -std=gnu++11 -mmmx -mpopcnt -msse -msse2 -msse3 -msse4.1 -msse4.2 -fabi-version=6 -DFFLAS_COMPILED -DFFPACK_COMPILED -fPIC -std=gnu++11 -mmmx -mpopcnt -msse -msse2 -msse3 -msse4.1 -msse4.2 -mfpmath=sse -fabi-version=6 -I/home/dcoudert/sage-dev/sage/local/include -I/home/dcoudert/sage-dev/sage/local//include -I/home/dcoudert/sage-dev/sage/local/include -I/home/dcoudert/sage-dev/sage/local/include -I/home/dcoudert/sage-dev/sage/local/include -I/home/dcoudert/sage-dev/sage/local/include -I/home/dcoudert/sage-dev/sage/local/include -I/home/dcoudert/sage-dev/sage/local/include -DDISABLE_COMMENTATOR -std=gnu++11 -g -fPIC -c benchmark.C  -fPIC -DPIC -o .libs/benchmark.o
373/bin/sh ../libtool  --tag=CXX   --mode=link g++  -std=gnu++11  -g -fPIC -L/home/dcoudert/sage-dev/sage/local/lib -Wl,-rpath,/home/dcoudert/sage-dev/sage/local/lib  -L/home/dcoudert/sage-dev/sage/local/lib -lntl -L/home/dcoudert/sage-dev/sage/local/lib -lmpfr -L/home/dcoudert/sage-dev/sage/local/lib -lfplll -L/home/dcoudert/sage-dev/sage/local/lib -liml -L/home/dcoudert/sage-dev/sage/local/lib -lflint  -L/home/dcoudert/sage-dev/sage/local/lib -L/home/dcoudert/sage-dev/sage/local//lib -lfflas -lffpack -lcblas -latlas -lgivaro -lgmpxx -lgmp   -L/home/dcoudert/sage-dev/sage/local/lib -Wl,-rpath,/home/dcoudert/sage-dev/sage/local/lib  -o libbenchmarks.la  benchmark.lo ../linbox/liblinbox.la
374libtool: link: ar cru .libs/libbenchmarks.a .libs/benchmark.o
375libtool: link: ranlib .libs/libbenchmarks.a
376libtool: link: ( cd ".libs" && rm -f "libbenchmarks.la" && ln -s "../libbenchmarks.la" "libbenchmarks.la" )
377make[6]: Leaving directory '/home/dcoudert/sage-dev/sage/local/var/tmp/sage/build/linbox-1.4.2/src/benchmarks'
378make[5]: Leaving directory '/home/dcoudert/sage-dev/sage/local/var/tmp/sage/build/linbox-1.4.2/src/benchmarks'
379Making all in macros
380make[5]: Entering directory '/home/dcoudert/sage-dev/sage/local/var/tmp/sage/build/linbox-1.4.2/src/macros'
381make[5]: Nothing to be done for 'all'.
382make[5]: Leaving directory '/home/dcoudert/sage-dev/sage/local/var/tmp/sage/build/linbox-1.4.2/src/macros'
383Making all in tests
384make[5]: Entering directory '/home/dcoudert/sage-dev/sage/local/var/tmp/sage/build/linbox-1.4.2/src/tests'
385Making all in data
386make[6]: Entering directory '/home/dcoudert/sage-dev/sage/local/var/tmp/sage/build/linbox-1.4.2/src/tests/data'
387make[6]: Nothing to be done for 'all'.
388make[6]: Leaving directory '/home/dcoudert/sage-dev/sage/local/var/tmp/sage/build/linbox-1.4.2/src/tests/data'
389Making all in matrix
390make[6]: Entering directory '/home/dcoudert/sage-dev/sage/local/var/tmp/sage/build/linbox-1.4.2/src/tests/matrix'
391make[6]: Nothing to be done for 'all'.
392make[6]: Leaving directory '/home/dcoudert/sage-dev/sage/local/var/tmp/sage/build/linbox-1.4.2/src/tests/matrix'
393make[6]: Entering directory '/home/dcoudert/sage-dev/sage/local/var/tmp/sage/build/linbox-1.4.2/src/tests'
394make[6]: Nothing to be done for 'all-am'.
395make[6]: Leaving directory '/home/dcoudert/sage-dev/sage/local/var/tmp/sage/build/linbox-1.4.2/src/tests'
396make[5]: Leaving directory '/home/dcoudert/sage-dev/sage/local/var/tmp/sage/build/linbox-1.4.2/src/tests'
397Making all in interfaces
398make[5]: Entering directory '/home/dcoudert/sage-dev/sage/local/var/tmp/sage/build/linbox-1.4.2/src/interfaces'
399Making all in driver
400make[6]: Entering directory '/home/dcoudert/sage-dev/sage/local/var/tmp/sage/build/linbox-1.4.2/src/interfaces/driver'
401/bin/sh ../../libtool  --tag=CXX   --mode=compile g++ -DHAVE_CONFIG_H -I. -I../..  -I../.. -I. -I../../linbox -DDISABLE_COMMENTATOR -O2   -Wall -g -DNDEBUG -U_LB_DEBUG -DDISABLE_COMMENTATOR -I/home/dcoudert/sage-dev/sage/local/include -std=gnu++11  -g -fPIC -c -o lb-element.lo lb-element.C
402libtool: compile:  g++ -DHAVE_CONFIG_H -I. -I../.. -I../.. -I. -I../../linbox -DDISABLE_COMMENTATOR -O2 -Wall -g -DNDEBUG -U_LB_DEBUG -DDISABLE_COMMENTATOR -I/home/dcoudert/sage-dev/sage/local/include -std=gnu++11 -g -fPIC -c lb-element.C  -fPIC -DPIC -o .libs/lb-element.o
403In file included from ./lb-domain-functor.h:30:0,
404                from ./lb-domain-function.h:30,
405                from ./lb-element-data.h:33,
406                from lb-element.C:30:
407./lb-domain-type.h:31:33: fatal error: linbox/field/givaro.h: No such file or directory
408#include "linbox/field/givaro.h"
409                                ^
410compilation terminated.
411Makefile:571: recipe for target 'lb-element.lo' failed
412make[6]: *** [lb-element.lo] Error 1
413make[6]: Leaving directory '/home/dcoudert/sage-dev/sage/local/var/tmp/sage/build/linbox-1.4.2/src/interfaces/driver'
414Makefile:428: recipe for target 'all-recursive' failed
415make[5]: *** [all-recursive] Error 1
416make[5]: Leaving directory '/home/dcoudert/sage-dev/sage/local/var/tmp/sage/build/linbox-1.4.2/src/interfaces'
417Makefile:582: recipe for target 'all-recursive' failed
418make[4]: *** [all-recursive] Error 1
419make[4]: Leaving directory '/home/dcoudert/sage-dev/sage/local/var/tmp/sage/build/linbox-1.4.2/src'
420Makefile:453: recipe for target 'all' failed
421make[3]: *** [all] Error 2
422make[3]: Leaving directory '/home/dcoudert/sage-dev/sage/local/var/tmp/sage/build/linbox-1.4.2/src'
423Error building LinBox.
424
425real    0m12.704s
426user    0m5.164s
427sys     0m4.419s
428************************************************************************
429Error installing package linbox-1.4.2
430************************************************************************
431Please email sage-devel (http://groups.google.com/group/sage-devel)
432explaining the problem and including the relevant part of the log file
433 /home/dcoudert/sage-dev/sage/logs/pkgs/linbox-1.4.2.log
434Describe your computer, operating system, etc.
435If you want to try to fix the problem yourself, *don't* just cd to
436/home/dcoudert/sage-dev/sage/local/var/tmp/sage/build/linbox-1.4.2 and type 'make' or whatever is appropriate.
437Instead, the following commands setup all environment variables
438correctly and load a subshell for you to debug the error:
439 (cd '/home/dcoudert/sage-dev/sage/local/var/tmp/sage/build/linbox-1.4.2' && '/home/dcoudert/sage-dev/sage/sage' --sh)
440When you are done debugging, you can type "exit" to leave the subshell.
441************************************************************************