Ticket #17635: fflas_ffpack-2.2.0.log

File fflas_ffpack-2.2.0.log, 46.6 KB (added by jdemeyer, 5 years ago)

fflas_ffpack build failure on x86_64 GNU/linux GCC 4.8.4

Line 
1Found local metadata for fflas_ffpack-2.2.0
2Using cached file /usr/local/src/sage-config/upstream/fflas_ffpack-2.2.0.tar.bz2
3fflas_ffpack-2.2.0
4====================================================
5Setting up build directory for fflas_ffpack-2.2.0
6Finished set up
7****************************************************
8Host system:
9Linux tamiyo 3.17.7-gentoo #1 SMP PREEMPT Wed Dec 31 20:06:39 CET 2014 x86_64 Intel(R) Core(TM) i7-2640M CPU @ 2.80GHz GenuineIntel GNU/Linux
10****************************************************
11C compiler: gcc
12C compiler version:
13Using built-in specs.
14COLLECT_GCC=/usr/x86_64-pc-linux-gnu/gcc-bin/4.8.4/gcc
15COLLECT_LTO_WRAPPER=/usr/libexec/gcc/x86_64-pc-linux-gnu/4.8.4/lto-wrapper
16Target: x86_64-pc-linux-gnu
17Configured with: /var/tmp/portage/sys-devel/gcc-4.8.4/work/gcc-4.8.4/configure --host=x86_64-pc-linux-gnu --build=x86_64-pc-linux-gnu --prefix=/usr --bindir=/usr/x86_64-pc-linux-gnu/gcc-bin/4.8.4 --includedir=/usr/lib/gcc/x86_64-pc-linux-gnu/4.8.4/include --datadir=/usr/share/gcc-data/x86_64-pc-linux-gnu/4.8.4 --mandir=/usr/share/gcc-data/x86_64-pc-linux-gnu/4.8.4/man --infodir=/usr/share/gcc-data/x86_64-pc-linux-gnu/4.8.4/info --with-gxx-include-dir=/usr/lib/gcc/x86_64-pc-linux-gnu/4.8.4/include/g++-v4 --with-python-dir=/share/gcc-data/x86_64-pc-linux-gnu/4.8.4/python --enable-languages=c,c++,fortran --enable-obsolete --enable-secureplt --disable-werror --with-system-zlib --enable-nls --without-included-gettext --enable-checking=release --with-bugurl=https://bugs.gentoo.org/ --with-pkgversion='Gentoo 4.8.4 p1.3, pie-0.6.1' --enable-libstdcxx-time --enable-shared --enable-threads=posix --enable-__cxa_atexit --enable-clocale=gnu --enable-multilib --with-multilib-list=m32,m64 --disable-altivec --disable-fixed-point --enable-targets=all --disable-libgcj --enable-libgomp --disable-libmudflap --disable-libssp --enable-lto --without-cloog --enable-libsanitizer
18Thread model: posix
19gcc version 4.8.4 (Gentoo 4.8.4 p1.3, pie-0.6.1)
20****************************************************
21ATLAS
22*************************************************
23 Using --with-blas=-lcblas -latlas
24*************************************************
25checking for a BSD-compatible install... /usr/bin/install -c
26checking whether build environment is sane... yes
27checking for a thread-safe mkdir -p... /bin/mkdir -p
28checking for gawk... gawk
29checking whether make sets $(MAKE)... yes
30checking whether make supports nested variables... yes
31checking for rm... /bin/rm
32checking whether to enable maintainer-specific portions of Makefiles... no
33-----------------------------------------------
34checking whether to enable debugging options in the library... no
35checking whether to enable profiling everything in the library... no
36checking whether to enable warnings when compiling the library... no
37-----------------------------------------------
38checking whether the C++ compiler works... yes
39checking for C++ compiler default output file name... a.out
40checking for suffix of executables...
41checking whether we are cross compiling... no
42checking for suffix of object files... o
43checking whether we are using the GNU C++ compiler... yes
44checking whether g++ accepts -g... yes
45checking for family name of compiler... gcc (Gentoo 4.8.4 p1.3, pie-0.6.1) 4.8.4
46checking whether g++ supports C++11 features by default... no
47checking whether g++ supports C++11 features with -std=gnu++11... yes
48checking how to run the C++ preprocessor... g++ -E
49checking for grep that handles long lines and -e... /bin/grep
50checking for egrep... /bin/grep -E
51checking for ANSI C header files... yes
52checking build system type... x86_64-unknown-linux-gnu
53checking host system type... x86_64-unknown-linux-gnu
54checking how to print strings... printf
55checking for gcc... gcc
56checking whether we are using the GNU C compiler... yes
57checking whether gcc accepts -g... yes
58checking for gcc option to accept ISO C89... none needed
59checking whether gcc understands -c and -o together... yes
60checking for a sed that does not truncate output... /bin/sed
61checking for fgrep... /bin/grep -F
62checking for ld used by gcc... ld
63checking if the linker (ld) is GNU ld... yes
64checking for BSD- or MS-compatible name lister (nm)... /usr/bin/nm -B
65checking the name lister (/usr/bin/nm -B) interface... BSD nm
66checking whether ln -s works... yes
67checking the maximum length of command line arguments... 1572864
68checking whether the shell understands some XSI constructs... yes
69checking whether the shell understands "+="... yes
70checking how to convert x86_64-unknown-linux-gnu file names to x86_64-unknown-linux-gnu format... func_convert_file_noop
71checking how to convert x86_64-unknown-linux-gnu file names to toolchain format... func_convert_file_noop
72checking for ld option to reload object files... -r
73checking for objdump... objdump
74checking how to recognize dependent libraries... pass_all
75checking for dlltool... no
76checking how to associate runtime and link libraries... printf %s\n
77checking for archiver @FILE support... @
78checking for strip... strip
79checking for ranlib... ranlib
80checking command to parse /usr/bin/nm -B output from gcc object... ok
81checking for sysroot... no
82checking for mt... no
83checking if : is a manifest tool... no
84checking for sys/types.h... yes
85checking for sys/stat.h... yes
86checking for stdlib.h... yes
87checking for string.h... yes
88checking for memory.h... yes
89checking for strings.h... yes
90checking for inttypes.h... yes
91checking for stdint.h... yes
92checking for unistd.h... yes
93checking for dlfcn.h... yes
94checking for objdir... .libs
95checking if gcc supports -fno-rtti -fno-exceptions... no
96checking for gcc option to produce PIC... -fPIC -DPIC
97checking if gcc PIC flag -fPIC -DPIC works... yes
98checking if gcc static flag -static works... yes
99checking if gcc supports -c -o file.o... yes
100checking if gcc supports -c -o file.o... (cached) yes
101checking whether the gcc linker (ld -m elf_x86_64) supports shared libraries... yes
102checking whether -lc should be explicitly linked in... no
103checking dynamic linker characteristics... GNU/Linux ld.so
104checking how to hardcode library paths into programs... immediate
105checking whether stripping libraries is possible... yes
106checking if libtool supports shared libraries... yes
107checking whether to build shared libraries... yes
108checking whether to build static libraries... no
109checking how to run the C++ preprocessor... g++ -E
110checking for ld used by g++... ld -m elf_x86_64
111checking if the linker (ld -m elf_x86_64) is GNU ld... yes
112checking whether the g++ linker (ld -m elf_x86_64) supports shared libraries... yes
113checking for g++ option to produce PIC... -fPIC -DPIC
114checking if g++ PIC flag -fPIC -DPIC works... yes
115checking if g++ static flag -static works... yes
116checking if g++ supports -c -o file.o... yes
117checking if g++ supports -c -o file.o... (cached) yes
118checking whether the g++ linker (ld -m elf_x86_64) supports shared libraries... yes
119checking dynamic linker characteristics... (cached) GNU/Linux ld.so
120checking how to hardcode library paths into programs... immediate
121-----------------------------------------------
122     START  FFLAS-FFPACK CONFIG               
123-----------------------------------------------
124-----------------------------------------------
125checking for OpenMP... yes
126checking for SSE 4.1... yes (SSE)
127checking for AVX... yes
128checking for AVX2... no
129-----------------------------------------------
130checking size of char... 1
131checking size of short... 2
132checking size of int... 4
133checking size of long... 8
134checking size of long long... 8
135checking size of __int64... 0
136checking for ANSI C header files... (cached) yes
137checking float.h usability... yes
138checking float.h presence... yes
139checking for float.h... yes
140checking limits.h usability... yes
141checking limits.h presence... yes
142checking for limits.h... yes
143checking stddef.h usability... yes
144checking stddef.h presence... yes
145checking for stddef.h... yes
146checking for stdlib.h... (cached) yes
147checking for string.h... (cached) yes
148checking sys/time.h usability... yes
149checking sys/time.h presence... yes
150checking for sys/time.h... yes
151checking for stdint.h... (cached) yes
152checking pthread.h usability... yes
153checking pthread.h presence... yes
154checking for pthread.h... yes
155checking whether byte ordering is bigendian... no
156-----------------------------------------------
157Default path = /usr/local/src/sage-config/local /usr /usr/local
158-----------------------------------------------
159checking for GIVARO >= 40001 and < 40002... found
160checking for use of MKL... no
161checking for USER BLAS... found (cblas)
162checking for USER LAPACK... no
163checking whether to build documentation... no
164checking whether to compile the standard specializations... yes
165-----------------------------------------------
166          END FFLAS-FFPACK CONFIG             
167-----------------------------------------------
168checking that generated files are newer than configure... done
169configure: creating ./config.status
170config.status: creating Makefile
171config.status: creating macros/Makefile
172config.status: creating macros/CodeChunk/Makefile
173config.status: creating fflas-ffpack-config
174config.status: creating fflas-ffpack/Makefile
175config.status: creating fflas-ffpack/fflas/Makefile
176config.status: creating fflas-ffpack/fflas/fflas_fgemm/Makefile
177config.status: creating fflas-ffpack/fflas/fflas_sparse/Makefile
178config.status: creating fflas-ffpack/fflas/fflas_sparse/coo/Makefile
179config.status: creating fflas-ffpack/fflas/fflas_sparse/csr/Makefile
180config.status: creating fflas-ffpack/fflas/fflas_sparse/ell/Makefile
181config.status: creating fflas-ffpack/fflas/fflas_sparse/ell_simd/Makefile
182config.status: creating fflas-ffpack/fflas/fflas_sparse/csr_hyb/Makefile
183config.status: creating fflas-ffpack/fflas/fflas_sparse/sell/Makefile
184config.status: creating fflas-ffpack/fflas/fflas_sparse/hyb_zo/Makefile
185config.status: creating fflas-ffpack/fflas/fflas_igemm/Makefile
186config.status: creating fflas-ffpack/fflas/fflas_simd/Makefile
187config.status: creating fflas-ffpack/ffpack/Makefile
188config.status: creating fflas-ffpack/field/Makefile
189config.status: creating fflas-ffpack/utils/Makefile
190config.status: creating fflas-ffpack/paladin/Makefile
191config.status: creating fflas-ffpack/interfaces/Makefile
192config.status: creating fflas-ffpack/interfaces/libs/Makefile
193config.status: creating doc/Makefile
194config.status: creating tests/Makefile
195config.status: creating tests/data/Makefile
196config.status: creating benchmarks/Makefile
197config.status: creating examples/Makefile
198config.status: creating optimiser/Makefile
199config.status: creating fflas-ffpack.pc
200config.status: creating config.h
201config.status: executing fflas-ffpack/config.h commands
202config.status: creating fflas-ffpack/config.h - prefix __FFLASFFPACK for config.h defines
203config.status: executing depfiles commands
204config.status: executing libtool commands
205-----------------------------------------------
206checking whether to use run time optimization... yes
207  *** OPTIMIZATION *** 
208checking best threshold for Strassen-Winograd matrix multiplication... see below
209  == Wino/BLAS threshold for Givaro::Modular<double> ==
210
211fgemm 768x768: 0.0981599 s, 9.22953 Gffops
2121Wino 768x768: 0.084905 s, 10.6704 Gffops
213
214fgemm 768x768: 0.0867526 s, 10.4431 Gffops
2151Wino 768x768: 0.083464 s, 10.8546 Gffops
216
217fgemm 512x512: 0.0273735 s, 9.80638 Gffops
2181Wino 512x512: 0.0259825 s, 10.3314 Gffops
219
220fgemm 384x384: 0.0156835 s, 7.22074 Gffops
2211Wino 384x384: 0.0152374 s, 7.43211 Gffops
222done (384)
223  == Wino/BLAS threshold for Givaro::Modular<float> ==
224
225fgemm 768x768: 0.0452199 s, 20.0348 Gffops
2261Wino 768x768: 0.0415095 s, 21.8256 Gffops
227
228fgemm 768x768: 0.0443687 s, 20.4191 Gffops
2291Wino 768x768: 0.0421876 s, 21.4748 Gffops
230
231fgemm 512x512: 0.0124267 s, 21.6015 Gffops
2321Wino 512x512: 0.0146467 s, 18.3274 Gffops
233
234fgemm 640x640: 0.0278885 s, 18.7994 Gffops
2351Wino 640x640: 0.0287527 s, 18.2344 Gffops
236done (768)
237  == Wino/BLAS threshold for Givaro::ModularBalanced<double> ==
238
239fgemm 768x768: 0.113187 s, 8.00417 Gffops
2401Wino 768x768: 0.127112 s, 7.12736 Gffops
241
242fgemm 1280x1280: 0.618808 s, 6.77803 Gffops
2431Wino 1280x1280: 0.420904 s, 9.96498 Gffops
244
245fgemm 1280x1280: 0.448227 s, 9.35754 Gffops
2461Wino 1280x1280: 0.357404 s, 11.7355 Gffops
247
248fgemm 1024x1024: 0.202623 s, 10.5984 Gffops
2491Wino 1024x1024: 0.185206 s, 11.5951 Gffops
250
251fgemm 896x896: 0.153499 s, 9.37238 Gffops
2521Wino 896x896: 0.147116 s, 9.779 Gffops
253done (896)
254  == Wino/BLAS threshold for Givaro::ModularBalanced<float> ==
255
256fgemm 768x768: 0.0612237 s, 14.7977 Gffops
2571Wino 768x768: 0.0408748 s, 22.1645 Gffops
258
259fgemm 768x768: 0.0471329 s, 19.2216 Gffops
2601Wino 768x768: 0.0585783 s, 15.466 Gffops
261
262fgemm 1280x1280: 0.206589 s, 20.3027 Gffops
2631Wino 1280x1280: 0.181573 s, 23.0998 Gffops
264
265fgemm 1280x1280: 0.196122 s, 21.3862 Gffops
2661Wino 1280x1280: 0.203334 s, 20.6276 Gffops
267
268fgemm 1792x1792: 0.575981 s, 19.9819 Gffops
2691Wino 1792x1792: 0.567802 s, 20.2697 Gffops
270
271fgemm 1792x1792: 0.7196 s, 15.9938 Gffops
2721Wino 1792x1792: 0.777787 s, 14.7973 Gffops
273
274fgemm 2304x2304: 1.19773 s, 20.423 Gffops
2751Wino 2304x2304: 1.18179 s, 20.6983 Gffops
276
277fgemm 2304x2304: 1.13029 s, 21.6416 Gffops
2781Wino 2304x2304: 0.95169 s, 25.7029 Gffops
279
280fgemm 2048x2048: 0.778329 s, 22.0728 Gffops
2811Wino 2048x2048: 0.68392 s, 25.1197 Gffops
282
283fgemm 1920x1920: 0.618916 s, 22.8719 Gffops
2841Wino 1920x1920: 0.578071 s, 24.488 Gffops
285done (1920)
286make[3]: Entering directory '/usr/local/src/sage-config/local/var/tmp/sage/build/fflas_ffpack-2.2.0/src'
287make  all-recursive
288make[4]: Entering directory '/usr/local/src/sage-config/local/var/tmp/sage/build/fflas_ffpack-2.2.0/src'
289Making all in fflas-ffpack
290make[5]: Entering directory '/usr/local/src/sage-config/local/var/tmp/sage/build/fflas_ffpack-2.2.0/src/fflas-ffpack'
291Making all in fflas
292make[6]: Entering directory '/usr/local/src/sage-config/local/var/tmp/sage/build/fflas_ffpack-2.2.0/src/fflas-ffpack/fflas'
293Making all in fflas_fgemm
294make[7]: Entering directory '/usr/local/src/sage-config/local/var/tmp/sage/build/fflas_ffpack-2.2.0/src/fflas-ffpack/fflas/fflas_fgemm'
295make[7]: Nothing to be done for 'all'.
296make[7]: Leaving directory '/usr/local/src/sage-config/local/var/tmp/sage/build/fflas_ffpack-2.2.0/src/fflas-ffpack/fflas/fflas_fgemm'
297Making all in fflas_igemm
298make[7]: Entering directory '/usr/local/src/sage-config/local/var/tmp/sage/build/fflas_ffpack-2.2.0/src/fflas-ffpack/fflas/fflas_igemm'
299make[7]: Nothing to be done for 'all'.
300make[7]: Leaving directory '/usr/local/src/sage-config/local/var/tmp/sage/build/fflas_ffpack-2.2.0/src/fflas-ffpack/fflas/fflas_igemm'
301Making all in fflas_simd
302make[7]: Entering directory '/usr/local/src/sage-config/local/var/tmp/sage/build/fflas_ffpack-2.2.0/src/fflas-ffpack/fflas/fflas_simd'
303make[7]: Nothing to be done for 'all'.
304make[7]: Leaving directory '/usr/local/src/sage-config/local/var/tmp/sage/build/fflas_ffpack-2.2.0/src/fflas-ffpack/fflas/fflas_simd'
305Making all in fflas_sparse
306make[7]: Entering directory '/usr/local/src/sage-config/local/var/tmp/sage/build/fflas_ffpack-2.2.0/src/fflas-ffpack/fflas/fflas_sparse'
307Making all in coo
308make[8]: Entering directory '/usr/local/src/sage-config/local/var/tmp/sage/build/fflas_ffpack-2.2.0/src/fflas-ffpack/fflas/fflas_sparse/coo'
309make[8]: Nothing to be done for 'all'.
310make[8]: Leaving directory '/usr/local/src/sage-config/local/var/tmp/sage/build/fflas_ffpack-2.2.0/src/fflas-ffpack/fflas/fflas_sparse/coo'
311Making all in csr
312make[8]: Entering directory '/usr/local/src/sage-config/local/var/tmp/sage/build/fflas_ffpack-2.2.0/src/fflas-ffpack/fflas/fflas_sparse/csr'
313make[8]: Nothing to be done for 'all'.
314make[8]: Leaving directory '/usr/local/src/sage-config/local/var/tmp/sage/build/fflas_ffpack-2.2.0/src/fflas-ffpack/fflas/fflas_sparse/csr'
315Making all in csr_hyb
316make[8]: Entering directory '/usr/local/src/sage-config/local/var/tmp/sage/build/fflas_ffpack-2.2.0/src/fflas-ffpack/fflas/fflas_sparse/csr_hyb'
317make[8]: Nothing to be done for 'all'.
318make[8]: Leaving directory '/usr/local/src/sage-config/local/var/tmp/sage/build/fflas_ffpack-2.2.0/src/fflas-ffpack/fflas/fflas_sparse/csr_hyb'
319Making all in ell
320make[8]: Entering directory '/usr/local/src/sage-config/local/var/tmp/sage/build/fflas_ffpack-2.2.0/src/fflas-ffpack/fflas/fflas_sparse/ell'
321make[8]: Nothing to be done for 'all'.
322make[8]: Leaving directory '/usr/local/src/sage-config/local/var/tmp/sage/build/fflas_ffpack-2.2.0/src/fflas-ffpack/fflas/fflas_sparse/ell'
323Making all in ell_simd
324make[8]: Entering directory '/usr/local/src/sage-config/local/var/tmp/sage/build/fflas_ffpack-2.2.0/src/fflas-ffpack/fflas/fflas_sparse/ell_simd'
325make[8]: Nothing to be done for 'all'.
326make[8]: Leaving directory '/usr/local/src/sage-config/local/var/tmp/sage/build/fflas_ffpack-2.2.0/src/fflas-ffpack/fflas/fflas_sparse/ell_simd'
327Making all in hyb_zo
328make[8]: Entering directory '/usr/local/src/sage-config/local/var/tmp/sage/build/fflas_ffpack-2.2.0/src/fflas-ffpack/fflas/fflas_sparse/hyb_zo'
329make[8]: Nothing to be done for 'all'.
330make[8]: Leaving directory '/usr/local/src/sage-config/local/var/tmp/sage/build/fflas_ffpack-2.2.0/src/fflas-ffpack/fflas/fflas_sparse/hyb_zo'
331Making all in sell
332make[8]: Entering directory '/usr/local/src/sage-config/local/var/tmp/sage/build/fflas_ffpack-2.2.0/src/fflas-ffpack/fflas/fflas_sparse/sell'
333make[8]: Nothing to be done for 'all'.
334make[8]: Leaving directory '/usr/local/src/sage-config/local/var/tmp/sage/build/fflas_ffpack-2.2.0/src/fflas-ffpack/fflas/fflas_sparse/sell'
335make[8]: Entering directory '/usr/local/src/sage-config/local/var/tmp/sage/build/fflas_ffpack-2.2.0/src/fflas-ffpack/fflas/fflas_sparse'
336make[8]: Nothing to be done for 'all-am'.
337make[8]: Leaving directory '/usr/local/src/sage-config/local/var/tmp/sage/build/fflas_ffpack-2.2.0/src/fflas-ffpack/fflas/fflas_sparse'
338make[7]: Leaving directory '/usr/local/src/sage-config/local/var/tmp/sage/build/fflas_ffpack-2.2.0/src/fflas-ffpack/fflas/fflas_sparse'
339make[7]: Entering directory '/usr/local/src/sage-config/local/var/tmp/sage/build/fflas_ffpack-2.2.0/src/fflas-ffpack/fflas'
340make[7]: Nothing to be done for 'all-am'.
341make[7]: Leaving directory '/usr/local/src/sage-config/local/var/tmp/sage/build/fflas_ffpack-2.2.0/src/fflas-ffpack/fflas'
342make[6]: Leaving directory '/usr/local/src/sage-config/local/var/tmp/sage/build/fflas_ffpack-2.2.0/src/fflas-ffpack/fflas'
343Making all in ffpack
344make[6]: Entering directory '/usr/local/src/sage-config/local/var/tmp/sage/build/fflas_ffpack-2.2.0/src/fflas-ffpack/ffpack'
345make[6]: Nothing to be done for 'all'.
346make[6]: Leaving directory '/usr/local/src/sage-config/local/var/tmp/sage/build/fflas_ffpack-2.2.0/src/fflas-ffpack/ffpack'
347Making all in field
348make[6]: Entering directory '/usr/local/src/sage-config/local/var/tmp/sage/build/fflas_ffpack-2.2.0/src/fflas-ffpack/field'
349make[6]: Nothing to be done for 'all'.
350make[6]: Leaving directory '/usr/local/src/sage-config/local/var/tmp/sage/build/fflas_ffpack-2.2.0/src/fflas-ffpack/field'
351Making all in utils
352make[6]: Entering directory '/usr/local/src/sage-config/local/var/tmp/sage/build/fflas_ffpack-2.2.0/src/fflas-ffpack/utils'
353make[6]: Nothing to be done for 'all'.
354make[6]: Leaving directory '/usr/local/src/sage-config/local/var/tmp/sage/build/fflas_ffpack-2.2.0/src/fflas-ffpack/utils'
355Making all in paladin
356make[6]: Entering directory '/usr/local/src/sage-config/local/var/tmp/sage/build/fflas_ffpack-2.2.0/src/fflas-ffpack/paladin'
357make[6]: Nothing to be done for 'all'.
358make[6]: Leaving directory '/usr/local/src/sage-config/local/var/tmp/sage/build/fflas_ffpack-2.2.0/src/fflas-ffpack/paladin'
359Making all in interfaces
360make[6]: Entering directory '/usr/local/src/sage-config/local/var/tmp/sage/build/fflas_ffpack-2.2.0/src/fflas-ffpack/interfaces'
361Making all in libs
362make[7]: Entering directory '/usr/local/src/sage-config/local/var/tmp/sage/build/fflas_ffpack-2.2.0/src/fflas-ffpack/interfaces/libs'
363/bin/bash ../../../libtool  --tag=CXX   --mode=compile g++ -DHAVE_CONFIG_H -I. -I../../..  -I../../..  -I../../../fflas-ffpack/utils/ -I../../../fflas-ffpack/fflas/ -I../../../fflas-ffpack/ffpack -I../../../fflas-ffpack/field -I/usr/local/src/sage-config/local/include -I/usr/local/src/sage-config/local//include -D__FFLASFFPACK_HAVE_CBLAS  -msse4.1 -mavx -fabi-version=6 -fopenmp  -O2  -Wall -DNDEBUG -UFFLASFFPACK_DEBUG -g -O2 -fPIC  -std=gnu++11 -c -o fflas_L1_inst.lo fflas_L1_inst.C
364/bin/bash ../../../libtool  --tag=CXX   --mode=compile g++ -DHAVE_CONFIG_H -I. -I../../..  -I../../..  -I../../../fflas-ffpack/utils/ -I../../../fflas-ffpack/fflas/ -I../../../fflas-ffpack/ffpack -I../../../fflas-ffpack/field -I/usr/local/src/sage-config/local/include -I/usr/local/src/sage-config/local//include -D__FFLASFFPACK_HAVE_CBLAS  -msse4.1 -mavx -fabi-version=6 -fopenmp  -O2  -Wall -DNDEBUG -UFFLASFFPACK_DEBUG -g -O2 -fPIC  -std=gnu++11 -c -o fflas_L2_inst.lo fflas_L2_inst.C
365libtool: compile:  g++ -DHAVE_CONFIG_H -I. -I../../.. -I../../.. -I../../../fflas-ffpack/utils/ -I../../../fflas-ffpack/fflas/ -I../../../fflas-ffpack/ffpack -I../../../fflas-ffpack/field -I/usr/local/src/sage-config/local/include -I/usr/local/src/sage-config/local//include -D__FFLASFFPACK_HAVE_CBLAS -msse4.1 -mavx -fabi-version=6 -fopenmp -O2 -Wall -DNDEBUG -UFFLASFFPACK_DEBUG -g -O2 -fPIC -std=gnu++11 -c fflas_L2_inst.C  -fPIC -DPIC -o .libs/fflas_L2_inst.o
366libtool: compile:  g++ -DHAVE_CONFIG_H -I. -I../../.. -I../../.. -I../../../fflas-ffpack/utils/ -I../../../fflas-ffpack/fflas/ -I../../../fflas-ffpack/ffpack -I../../../fflas-ffpack/field -I/usr/local/src/sage-config/local/include -I/usr/local/src/sage-config/local//include -D__FFLASFFPACK_HAVE_CBLAS -msse4.1 -mavx -fabi-version=6 -fopenmp -O2 -Wall -DNDEBUG -UFFLASFFPACK_DEBUG -g -O2 -fPIC -std=gnu++11 -c fflas_L1_inst.C  -fPIC -DPIC -o .libs/fflas_L1_inst.o
367In file included from ../../../fflas-ffpack/fflas/fflas_fger_mp.inl:40:0,
368                 from ../../../fflas-ffpack/fflas/fflas.h:126,
369                 from fflas_L1_inst.C:34:
370../../../fflas-ffpack/fflas/fflas_fgemm/fgemm_classical_mp.inl:204:2: error: stray '#' in program
371   WAIT;
372  ^
373../../../fflas-ffpack/fflas/fflas_fgemm/fgemm_classical_mp.inl: In function 'typename FFPACK::RNSInteger<T>::Element_ptr FFLAS::fgemm(const FFPACK::RNSInteger<T>&, FFLAS::FFLAS_TRANSPOSE, FFLAS::FFLAS_TRANSPOSE, size_t, size_t, size_t, typename FFPACK::RNSInteger<T>::Element, typename FFPACK::RNSInteger<T>::ConstElement_ptr, size_t, typename FFPACK::RNSInteger<T>::ConstElement_ptr, size_t, typename FFPACK::RNSInteger<T>::Element, typename FFPACK::RNSInteger<T>::Element_ptr, size_t, FFLAS::MMHelper<FFPACK::RNSInteger<T>, FFLAS::MMHelperAlgo::Classic, FFLAS::ModeCategories::DefaultTag, FFLAS::ParSeqHelper::Parallel<Cut, Param> >&)':
374../../../fflas-ffpack/fflas/fflas_fgemm/fgemm_classical_mp.inl:204:8: error: expected ';' before string constant
375   WAIT;
376        ^
377In file included from ../../../fflas-ffpack/fflas/fflas_fger_mp.inl:40:0,
378                 from ../../../fflas-ffpack/fflas/fflas.h:126,
379                 from fflas_L2_inst.C:34:
380../../../fflas-ffpack/fflas/fflas_fgemm/fgemm_classical_mp.inl:204:2: error: stray '#' in program
381   WAIT;
382  ^
383../../../fflas-ffpack/fflas/fflas_fgemm/fgemm_classical_mp.inl: In function 'typename FFPACK::RNSInteger<T>::Element_ptr FFLAS::fgemm(const FFPACK::RNSInteger<T>&, FFLAS::FFLAS_TRANSPOSE, FFLAS::FFLAS_TRANSPOSE, size_t, size_t, size_t, typename FFPACK::RNSInteger<T>::Element, typename FFPACK::RNSInteger<T>::ConstElement_ptr, size_t, typename FFPACK::RNSInteger<T>::ConstElement_ptr, size_t, typename FFPACK::RNSInteger<T>::Element, typename FFPACK::RNSInteger<T>::Element_ptr, size_t, FFLAS::MMHelper<FFPACK::RNSInteger<T>, FFLAS::MMHelperAlgo::Classic, FFLAS::ModeCategories::DefaultTag, FFLAS::ParSeqHelper::Parallel<Cut, Param> >&)':
384../../../fflas-ffpack/fflas/fflas_fgemm/fgemm_classical_mp.inl:204:8: error: expected ';' before string constant
385   WAIT;
386        ^
387Makefile:576: recipe for target 'fflas_L1_inst.lo' failed
388make[7]: *** [fflas_L1_inst.lo] Error 1
389make[7]: *** Waiting for unfinished jobs....
390Makefile:576: recipe for target 'fflas_L2_inst.lo' failed
391make[7]: *** [fflas_L2_inst.lo] Error 1
392make[7]: Leaving directory '/usr/local/src/sage-config/local/var/tmp/sage/build/fflas_ffpack-2.2.0/src/fflas-ffpack/interfaces/libs'
393Makefile:400: recipe for target 'all-recursive' failed
394make[6]: *** [all-recursive] Error 1
395make[6]: Leaving directory '/usr/local/src/sage-config/local/var/tmp/sage/build/fflas_ffpack-2.2.0/src/fflas-ffpack/interfaces'
396Makefile:460: recipe for target 'all-recursive' failed
397make[5]: *** [all-recursive] Error 1
398make[5]: Leaving directory '/usr/local/src/sage-config/local/var/tmp/sage/build/fflas_ffpack-2.2.0/src/fflas-ffpack'
399Makefile:552: recipe for target 'all-recursive' failed
400make[4]: *** [all-recursive] Error 1
401make[4]: Leaving directory '/usr/local/src/sage-config/local/var/tmp/sage/build/fflas_ffpack-2.2.0/src'
402Makefile:423: recipe for target 'all' failed
403make[3]: *** [all] Error 2
404make[3]: Leaving directory '/usr/local/src/sage-config/local/var/tmp/sage/build/fflas_ffpack-2.2.0/src'
405Error building fflas-ffpack
406make[3]: Entering directory '/usr/local/src/sage-config/local/var/tmp/sage/build/fflas_ffpack-2.2.0/src'
407Making install in fflas-ffpack
408make[4]: Entering directory '/usr/local/src/sage-config/local/var/tmp/sage/build/fflas_ffpack-2.2.0/src/fflas-ffpack'
409Making install in fflas
410make[5]: Entering directory '/usr/local/src/sage-config/local/var/tmp/sage/build/fflas_ffpack-2.2.0/src/fflas-ffpack/fflas'
411Making install in fflas_fgemm
412make[6]: Entering directory '/usr/local/src/sage-config/local/var/tmp/sage/build/fflas_ffpack-2.2.0/src/fflas-ffpack/fflas/fflas_fgemm'
413make[7]: Entering directory '/usr/local/src/sage-config/local/var/tmp/sage/build/fflas_ffpack-2.2.0/src/fflas-ffpack/fflas/fflas_fgemm'
414make[7]: Nothing to be done for 'install-exec-am'.
415 /bin/mkdir -p '/usr/local/src/sage-config/local/include/fflas-ffpack/fflas/fflas_fgemm'
416 /usr/bin/install -c -m 644 fgemm_classical.inl fgemm_winograd.inl schedule_winograd.inl schedule_winograd_acc.inl schedule_bini.inl schedule_winograd_acc_ip.inl schedule_winograd_ip.inl fgemm_classical_mp.inl '/usr/local/src/sage-config/local/include/fflas-ffpack/fflas/fflas_fgemm'
417make[7]: Leaving directory '/usr/local/src/sage-config/local/var/tmp/sage/build/fflas_ffpack-2.2.0/src/fflas-ffpack/fflas/fflas_fgemm'
418make[6]: Leaving directory '/usr/local/src/sage-config/local/var/tmp/sage/build/fflas_ffpack-2.2.0/src/fflas-ffpack/fflas/fflas_fgemm'
419Making install in fflas_igemm
420make[6]: Entering directory '/usr/local/src/sage-config/local/var/tmp/sage/build/fflas_ffpack-2.2.0/src/fflas-ffpack/fflas/fflas_igemm'
421make[7]: Entering directory '/usr/local/src/sage-config/local/var/tmp/sage/build/fflas_ffpack-2.2.0/src/fflas-ffpack/fflas/fflas_igemm'
422make[7]: Nothing to be done for 'install-exec-am'.
423 /bin/mkdir -p '/usr/local/src/sage-config/local/include/fflas-ffpack/fflas/fflas_igemm'
424 /usr/bin/install -c -m 644 igemm_kernels.h igemm_kernels.inl igemm_tools.h igemm_tools.inl igemm.h igemm.inl '/usr/local/src/sage-config/local/include/fflas-ffpack/fflas/fflas_igemm'
425make[7]: Leaving directory '/usr/local/src/sage-config/local/var/tmp/sage/build/fflas_ffpack-2.2.0/src/fflas-ffpack/fflas/fflas_igemm'
426make[6]: Leaving directory '/usr/local/src/sage-config/local/var/tmp/sage/build/fflas_ffpack-2.2.0/src/fflas-ffpack/fflas/fflas_igemm'
427Making install in fflas_simd
428make[6]: Entering directory '/usr/local/src/sage-config/local/var/tmp/sage/build/fflas_ffpack-2.2.0/src/fflas-ffpack/fflas/fflas_simd'
429make[7]: Entering directory '/usr/local/src/sage-config/local/var/tmp/sage/build/fflas_ffpack-2.2.0/src/fflas-ffpack/fflas/fflas_simd'
430make[7]: Nothing to be done for 'install-exec-am'.
431 /bin/mkdir -p '/usr/local/src/sage-config/local/include/fflas-ffpack/fflas/fflas_simd'
432 /usr/bin/install -c -m 644 simd128.inl simd128_double.inl simd128_float.inl simd128_int16.inl simd128_int32.inl simd128_int64.inl simd256.inl simd256_double.inl simd256_float.inl simd256_int16.inl simd256_int32.inl simd256_int64.inl simd_modular.inl '/usr/local/src/sage-config/local/include/fflas-ffpack/fflas/fflas_simd'
433make[7]: Leaving directory '/usr/local/src/sage-config/local/var/tmp/sage/build/fflas_ffpack-2.2.0/src/fflas-ffpack/fflas/fflas_simd'
434make[6]: Leaving directory '/usr/local/src/sage-config/local/var/tmp/sage/build/fflas_ffpack-2.2.0/src/fflas-ffpack/fflas/fflas_simd'
435Making install in fflas_sparse
436make[6]: Entering directory '/usr/local/src/sage-config/local/var/tmp/sage/build/fflas_ffpack-2.2.0/src/fflas-ffpack/fflas/fflas_sparse'
437Making install in coo
438make[7]: Entering directory '/usr/local/src/sage-config/local/var/tmp/sage/build/fflas_ffpack-2.2.0/src/fflas-ffpack/fflas/fflas_sparse/coo'
439make[8]: Entering directory '/usr/local/src/sage-config/local/var/tmp/sage/build/fflas_ffpack-2.2.0/src/fflas-ffpack/fflas/fflas_sparse/coo'
440make[8]: Nothing to be done for 'install-exec-am'.
441 /bin/mkdir -p '/usr/local/src/sage-config/local/include/fflas-ffpack/fflas/fflas_sparse/coo'
442 /usr/bin/install -c -m 644 coo_spmv.inl coo_spmm.inl coo_utils.inl '/usr/local/src/sage-config/local/include/fflas-ffpack/fflas/fflas_sparse/coo'
443make[8]: Leaving directory '/usr/local/src/sage-config/local/var/tmp/sage/build/fflas_ffpack-2.2.0/src/fflas-ffpack/fflas/fflas_sparse/coo'
444make[7]: Leaving directory '/usr/local/src/sage-config/local/var/tmp/sage/build/fflas_ffpack-2.2.0/src/fflas-ffpack/fflas/fflas_sparse/coo'
445Making install in csr
446make[7]: Entering directory '/usr/local/src/sage-config/local/var/tmp/sage/build/fflas_ffpack-2.2.0/src/fflas-ffpack/fflas/fflas_sparse/csr'
447make[8]: Entering directory '/usr/local/src/sage-config/local/var/tmp/sage/build/fflas_ffpack-2.2.0/src/fflas-ffpack/fflas/fflas_sparse/csr'
448make[8]: Nothing to be done for 'install-exec-am'.
449 /bin/mkdir -p '/usr/local/src/sage-config/local/include/fflas-ffpack/fflas/fflas_sparse/csr'
450 /usr/bin/install -c -m 644 csr_spmv.inl csr_spmm.inl csr_pspmv.inl csr_pspmm.inl csr_utils.inl '/usr/local/src/sage-config/local/include/fflas-ffpack/fflas/fflas_sparse/csr'
451make[8]: Leaving directory '/usr/local/src/sage-config/local/var/tmp/sage/build/fflas_ffpack-2.2.0/src/fflas-ffpack/fflas/fflas_sparse/csr'
452make[7]: Leaving directory '/usr/local/src/sage-config/local/var/tmp/sage/build/fflas_ffpack-2.2.0/src/fflas-ffpack/fflas/fflas_sparse/csr'
453Making install in csr_hyb
454make[7]: Entering directory '/usr/local/src/sage-config/local/var/tmp/sage/build/fflas_ffpack-2.2.0/src/fflas-ffpack/fflas/fflas_sparse/csr_hyb'
455make[8]: Entering directory '/usr/local/src/sage-config/local/var/tmp/sage/build/fflas_ffpack-2.2.0/src/fflas-ffpack/fflas/fflas_sparse/csr_hyb'
456make[8]: Nothing to be done for 'install-exec-am'.
457 /bin/mkdir -p '/usr/local/src/sage-config/local/include/fflas-ffpack/fflas/fflas_sparse/csr_hyb'
458 /usr/bin/install -c -m 644 csr_hyb_spmv.inl csr_hyb_spmm.inl csr_hyb_pspmv.inl csr_hyb_pspmm.inl csr_hyb_utils.inl '/usr/local/src/sage-config/local/include/fflas-ffpack/fflas/fflas_sparse/csr_hyb'
459make[8]: Leaving directory '/usr/local/src/sage-config/local/var/tmp/sage/build/fflas_ffpack-2.2.0/src/fflas-ffpack/fflas/fflas_sparse/csr_hyb'
460make[7]: Leaving directory '/usr/local/src/sage-config/local/var/tmp/sage/build/fflas_ffpack-2.2.0/src/fflas-ffpack/fflas/fflas_sparse/csr_hyb'
461Making install in ell
462make[7]: Entering directory '/usr/local/src/sage-config/local/var/tmp/sage/build/fflas_ffpack-2.2.0/src/fflas-ffpack/fflas/fflas_sparse/ell'
463make[8]: Entering directory '/usr/local/src/sage-config/local/var/tmp/sage/build/fflas_ffpack-2.2.0/src/fflas-ffpack/fflas/fflas_sparse/ell'
464make[8]: Nothing to be done for 'install-exec-am'.
465 /bin/mkdir -p '/usr/local/src/sage-config/local/include/fflas-ffpack/fflas/fflas_sparse/ell'
466 /usr/bin/install -c -m 644 ell_spmv.inl ell_spmm.inl ell_pspmv.inl ell_pspmm.inl ell_utils.inl '/usr/local/src/sage-config/local/include/fflas-ffpack/fflas/fflas_sparse/ell'
467make[8]: Leaving directory '/usr/local/src/sage-config/local/var/tmp/sage/build/fflas_ffpack-2.2.0/src/fflas-ffpack/fflas/fflas_sparse/ell'
468make[7]: Leaving directory '/usr/local/src/sage-config/local/var/tmp/sage/build/fflas_ffpack-2.2.0/src/fflas-ffpack/fflas/fflas_sparse/ell'
469Making install in ell_simd
470make[7]: Entering directory '/usr/local/src/sage-config/local/var/tmp/sage/build/fflas_ffpack-2.2.0/src/fflas-ffpack/fflas/fflas_sparse/ell_simd'
471make[8]: Entering directory '/usr/local/src/sage-config/local/var/tmp/sage/build/fflas_ffpack-2.2.0/src/fflas-ffpack/fflas/fflas_sparse/ell_simd'
472make[8]: Nothing to be done for 'install-exec-am'.
473 /bin/mkdir -p '/usr/local/src/sage-config/local/include/fflas-ffpack/fflas/fflas_sparse/ell_simd'
474 /usr/bin/install -c -m 644 ell_simd_spmv.inl ell_simd_pspmv.inl ell_simd_utils.inl '/usr/local/src/sage-config/local/include/fflas-ffpack/fflas/fflas_sparse/ell_simd'
475make[8]: Leaving directory '/usr/local/src/sage-config/local/var/tmp/sage/build/fflas_ffpack-2.2.0/src/fflas-ffpack/fflas/fflas_sparse/ell_simd'
476make[7]: Leaving directory '/usr/local/src/sage-config/local/var/tmp/sage/build/fflas_ffpack-2.2.0/src/fflas-ffpack/fflas/fflas_sparse/ell_simd'
477Making install in hyb_zo
478make[7]: Entering directory '/usr/local/src/sage-config/local/var/tmp/sage/build/fflas_ffpack-2.2.0/src/fflas-ffpack/fflas/fflas_sparse/hyb_zo'
479make[8]: Entering directory '/usr/local/src/sage-config/local/var/tmp/sage/build/fflas_ffpack-2.2.0/src/fflas-ffpack/fflas/fflas_sparse/hyb_zo'
480make[8]: Nothing to be done for 'install-exec-am'.
481 /bin/mkdir -p '/usr/local/src/sage-config/local/include/fflas-ffpack/fflas/fflas_sparse/hyb_zo'
482 /usr/bin/install -c -m 644 hyb_zo_spmv.inl hyb_zo_spmm.inl hyb_zo_pspmm.inl hyb_zo_pspmv.inl hyb_zo_utils.inl '/usr/local/src/sage-config/local/include/fflas-ffpack/fflas/fflas_sparse/hyb_zo'
483make[8]: Leaving directory '/usr/local/src/sage-config/local/var/tmp/sage/build/fflas_ffpack-2.2.0/src/fflas-ffpack/fflas/fflas_sparse/hyb_zo'
484make[7]: Leaving directory '/usr/local/src/sage-config/local/var/tmp/sage/build/fflas_ffpack-2.2.0/src/fflas-ffpack/fflas/fflas_sparse/hyb_zo'
485Making install in sell
486make[7]: Entering directory '/usr/local/src/sage-config/local/var/tmp/sage/build/fflas_ffpack-2.2.0/src/fflas-ffpack/fflas/fflas_sparse/sell'
487make[8]: Entering directory '/usr/local/src/sage-config/local/var/tmp/sage/build/fflas_ffpack-2.2.0/src/fflas-ffpack/fflas/fflas_sparse/sell'
488make[8]: Nothing to be done for 'install-exec-am'.
489 /bin/mkdir -p '/usr/local/src/sage-config/local/include/fflas-ffpack/fflas/fflas_sparse/sell'
490 /usr/bin/install -c -m 644 sell_spmv.inl sell_utils.inl sell_pspmv.inl '/usr/local/src/sage-config/local/include/fflas-ffpack/fflas/fflas_sparse/sell'
491make[8]: Leaving directory '/usr/local/src/sage-config/local/var/tmp/sage/build/fflas_ffpack-2.2.0/src/fflas-ffpack/fflas/fflas_sparse/sell'
492make[7]: Leaving directory '/usr/local/src/sage-config/local/var/tmp/sage/build/fflas_ffpack-2.2.0/src/fflas-ffpack/fflas/fflas_sparse/sell'
493make[7]: Entering directory '/usr/local/src/sage-config/local/var/tmp/sage/build/fflas_ffpack-2.2.0/src/fflas-ffpack/fflas/fflas_sparse'
494make[8]: Entering directory '/usr/local/src/sage-config/local/var/tmp/sage/build/fflas_ffpack-2.2.0/src/fflas-ffpack/fflas/fflas_sparse'
495make[8]: Nothing to be done for 'install-exec-am'.
496 /bin/mkdir -p '/usr/local/src/sage-config/local/include/fflas-ffpack/fflas/fflas_sparse'
497 /usr/bin/install -c -m 644 sparse_matrix_traits.h read_sparse.h utils.h coo.h csr.h ell.h ell_simd.h sell.h csr_hyb.h hyb_zo.h '/usr/local/src/sage-config/local/include/fflas-ffpack/fflas/fflas_sparse'
498make[8]: Leaving directory '/usr/local/src/sage-config/local/var/tmp/sage/build/fflas_ffpack-2.2.0/src/fflas-ffpack/fflas/fflas_sparse'
499make[7]: Leaving directory '/usr/local/src/sage-config/local/var/tmp/sage/build/fflas_ffpack-2.2.0/src/fflas-ffpack/fflas/fflas_sparse'
500make[6]: Leaving directory '/usr/local/src/sage-config/local/var/tmp/sage/build/fflas_ffpack-2.2.0/src/fflas-ffpack/fflas/fflas_sparse'
501make[6]: Entering directory '/usr/local/src/sage-config/local/var/tmp/sage/build/fflas_ffpack-2.2.0/src/fflas-ffpack/fflas'
502make[7]: Entering directory '/usr/local/src/sage-config/local/var/tmp/sage/build/fflas_ffpack-2.2.0/src/fflas-ffpack/fflas'
503make[7]: Nothing to be done for 'install-exec-am'.
504 /bin/mkdir -p '/usr/local/src/sage-config/local/include/fflas-ffpack/fflas'
505 /usr/bin/install -c -m 644 fflas_bounds.inl fflas_fassign.h fflas_fassign.inl fflas_ftrmm.inl fflas.h fflas_level1.inl fflas_level2.inl fflas_level3.inl fflas_fadd.h fflas_fadd.inl fflas_fdot.inl fflas_ftrmm_src.inl fflas_fgemm.inl fflas_pfgemm.inl fflas_pftrsm.inl fflas_ftrsm.inl fflas_fgemv.inl fflas_freivalds.inl fflas_fscal.h fflas_fscal.inl fflas_ftrsm_src.inl fflas_faxpy.inl fflas_fger.inl fflas_ftrsv.inl fflas_freduce.h fflas_freduce.inl fflas_helpers.inl fflas_simd.h fflas_enum.h fflas_sparse.h fflas_sparse.inl fflas_ftrsm_mp.inl fflas_fscal_mp.inl fflas_freduce_mp.inl fflas_fger_mp.inl fflas_fgemv_mp.inl '/usr/local/src/sage-config/local/include/fflas-ffpack/fflas'
506make[7]: Leaving directory '/usr/local/src/sage-config/local/var/tmp/sage/build/fflas_ffpack-2.2.0/src/fflas-ffpack/fflas'
507make[6]: Leaving directory '/usr/local/src/sage-config/local/var/tmp/sage/build/fflas_ffpack-2.2.0/src/fflas-ffpack/fflas'
508make[5]: Leaving directory '/usr/local/src/sage-config/local/var/tmp/sage/build/fflas_ffpack-2.2.0/src/fflas-ffpack/fflas'
509Making install in ffpack
510make[5]: Entering directory '/usr/local/src/sage-config/local/var/tmp/sage/build/fflas_ffpack-2.2.0/src/fflas-ffpack/ffpack'
511make[6]: Entering directory '/usr/local/src/sage-config/local/var/tmp/sage/build/fflas_ffpack-2.2.0/src/fflas-ffpack/ffpack'
512make[6]: Nothing to be done for 'install-exec-am'.
513 /bin/mkdir -p '/usr/local/src/sage-config/local/include/fflas-ffpack/ffpack'
514 /usr/bin/install -c -m 644 ffpack_charpoly_danilevski.inl ffpack_charpoly.inl ffpack_charpoly_kgfastgeneralized.inl ffpack.h ffpack_charpoly_kgfast.inl ffpack_krylovelim.inl ffpack_charpoly_kglu.inl ffpack_echelonforms.inl ffpack_ludivine.inl ffpack_pluq.inl ffpack_ppluq.inl ffpack_frobenius.inl ffpack_minpoly_construct.inl ffpack_minpoly.inl ffpack.inl ffpack_invert.inl ffpack_fgesv.inl ffpack_fgetrs.inl ffpack_permutation.inl ffpack_ftrtr.inl ffpack_rankprofiles.inl ffpack_ludivine_mp.inl ffpack_pluq_mp.inl '/usr/local/src/sage-config/local/include/fflas-ffpack/ffpack'
515make[6]: Leaving directory '/usr/local/src/sage-config/local/var/tmp/sage/build/fflas_ffpack-2.2.0/src/fflas-ffpack/ffpack'
516make[5]: Leaving directory '/usr/local/src/sage-config/local/var/tmp/sage/build/fflas_ffpack-2.2.0/src/fflas-ffpack/ffpack'
517Making install in field
518make[5]: Entering directory '/usr/local/src/sage-config/local/var/tmp/sage/build/fflas_ffpack-2.2.0/src/fflas-ffpack/field'
519make[6]: Entering directory '/usr/local/src/sage-config/local/var/tmp/sage/build/fflas_ffpack-2.2.0/src/fflas-ffpack/field'
520make[6]: Nothing to be done for 'install-exec-am'.
521 /bin/mkdir -p '/usr/local/src/sage-config/local/include/fflas-ffpack/field'
522 /usr/bin/install -c -m 644 field-traits.h rns.h rns.inl rns-double.h rns-double-elt.h rns-double.inl rns-integer.h rns-integer-mod.h modular-extended.h '/usr/local/src/sage-config/local/include/fflas-ffpack/field'
523make[6]: Leaving directory '/usr/local/src/sage-config/local/var/tmp/sage/build/fflas_ffpack-2.2.0/src/fflas-ffpack/field'
524make[5]: Leaving directory '/usr/local/src/sage-config/local/var/tmp/sage/build/fflas_ffpack-2.2.0/src/fflas-ffpack/field'
525Making install in utils
526make[5]: Entering directory '/usr/local/src/sage-config/local/var/tmp/sage/build/fflas_ffpack-2.2.0/src/fflas-ffpack/utils'
527make[6]: Entering directory '/usr/local/src/sage-config/local/var/tmp/sage/build/fflas_ffpack-2.2.0/src/fflas-ffpack/utils'
528make[6]: Nothing to be done for 'install-exec-am'.
529 /bin/mkdir -p '/usr/local/src/sage-config/local/include/fflas-ffpack/utils'
530 /usr/bin/install -c -m 644 align-allocator.h args-parser.h debug.h fflas_memory.h fflas_randommatrix.h flimits.h Matio.h bit_manipulation.h print-utils.h timer.h cast.h fflas_intrinsic.h '/usr/local/src/sage-config/local/include/fflas-ffpack/utils'
531make[6]: Leaving directory '/usr/local/src/sage-config/local/var/tmp/sage/build/fflas_ffpack-2.2.0/src/fflas-ffpack/utils'
532make[5]: Leaving directory '/usr/local/src/sage-config/local/var/tmp/sage/build/fflas_ffpack-2.2.0/src/fflas-ffpack/utils'
533Making install in paladin
534make[5]: Entering directory '/usr/local/src/sage-config/local/var/tmp/sage/build/fflas_ffpack-2.2.0/src/fflas-ffpack/paladin'
535make[6]: Entering directory '/usr/local/src/sage-config/local/var/tmp/sage/build/fflas_ffpack-2.2.0/src/fflas-ffpack/paladin'
536make[6]: Nothing to be done for 'install-exec-am'.
537 /bin/mkdir -p '/usr/local/src/sage-config/local/include/fflas-ffpack/paladin'
538 /usr/bin/install -c -m 644 fflas_pfinit.h blockcuts.inl pfgemm_variants.inl parallel.h kaapi_routines.inl '/usr/local/src/sage-config/local/include/fflas-ffpack/paladin'
539make[6]: Leaving directory '/usr/local/src/sage-config/local/var/tmp/sage/build/fflas_ffpack-2.2.0/src/fflas-ffpack/paladin'
540make[5]: Leaving directory '/usr/local/src/sage-config/local/var/tmp/sage/build/fflas_ffpack-2.2.0/src/fflas-ffpack/paladin'
541Making install in interfaces
542make[5]: Entering directory '/usr/local/src/sage-config/local/var/tmp/sage/build/fflas_ffpack-2.2.0/src/fflas-ffpack/interfaces'
543Making install in libs
544make[6]: Entering directory '/usr/local/src/sage-config/local/var/tmp/sage/build/fflas_ffpack-2.2.0/src/fflas-ffpack/interfaces/libs'
545/bin/bash ../../../libtool  --tag=CXX   --mode=compile g++ -DHAVE_CONFIG_H -I. -I../../..  -I../../..  -I../../../fflas-ffpack/utils/ -I../../../fflas-ffpack/fflas/ -I../../../fflas-ffpack/ffpack -I../../../fflas-ffpack/field -I/usr/local/src/sage-config/local/include -I/usr/local/src/sage-config/local//include -D__FFLASFFPACK_HAVE_CBLAS  -msse4.1 -mavx -fabi-version=6 -fopenmp  -O2  -Wall -DNDEBUG -UFFLASFFPACK_DEBUG -g -O2 -fPIC  -std=gnu++11 -c -o fflas_L1_inst.lo fflas_L1_inst.C
546/bin/bash ../../../libtool  --tag=CXX   --mode=compile g++ -DHAVE_CONFIG_H -I. -I../../..  -I../../..  -I../../../fflas-ffpack/utils/ -I../../../fflas-ffpack/fflas/ -I../../../fflas-ffpack/ffpack -I../../../fflas-ffpack/field -I/usr/local/src/sage-config/local/include -I/usr/local/src/sage-config/local//include -D__FFLASFFPACK_HAVE_CBLAS  -msse4.1 -mavx -fabi-version=6 -fopenmp  -O2  -Wall -DNDEBUG -UFFLASFFPACK_DEBUG -g -O2 -fPIC  -std=gnu++11 -c -o fflas_L2_inst.lo fflas_L2_inst.C
547libtool: compile:  g++ -DHAVE_CONFIG_H -I. -I../../.. -I../../.. -I../../../fflas-ffpack/utils/ -I../../../fflas-ffpack/fflas/ -I../../../fflas-ffpack/ffpack -I../../../fflas-ffpack/field -I/usr/local/src/sage-config/local/include -I/usr/local/src/sage-config/local//include -D__FFLASFFPACK_HAVE_CBLAS -msse4.1 -mavx -fabi-version=6 -fopenmp -O2 -Wall -DNDEBUG -UFFLASFFPACK_DEBUG -g -O2 -fPIC -std=gnu++11 -c fflas_L1_inst.C  -fPIC -DPIC -o .libs/fflas_L1_inst.o
548libtool: compile:  g++ -DHAVE_CONFIG_H -I. -I../../.. -I../../.. -I../../../fflas-ffpack/utils/ -I../../../fflas-ffpack/fflas/ -I../../../fflas-ffpack/ffpack -I../../../fflas-ffpack/field -I/usr/local/src/sage-config/local/include -I/usr/local/src/sage-config/local//include -D__FFLASFFPACK_HAVE_CBLAS -msse4.1 -mavx -fabi-version=6 -fopenmp -O2 -Wall -DNDEBUG -UFFLASFFPACK_DEBUG -g -O2 -fPIC -std=gnu++11 -c fflas_L2_inst.C  -fPIC -DPIC -o .libs/fflas_L2_inst.o
549In file included from ../../../fflas-ffpack/fflas/fflas_fger_mp.inl:40:0,
550                 from ../../../fflas-ffpack/fflas/fflas.h:126,
551                 from fflas_L2_inst.C:34:
552../../../fflas-ffpack/fflas/fflas_fgemm/fgemm_classical_mp.inl:204:2: error: stray '#' in program
553   WAIT;
554  ^
555../../../fflas-ffpack/fflas/fflas_fgemm/fgemm_classical_mp.inl: In function 'typename FFPACK::RNSInteger<T>::Element_ptr FFLAS::fgemm(const FFPACK::RNSInteger<T>&, FFLAS::FFLAS_TRANSPOSE, FFLAS::FFLAS_TRANSPOSE, size_t, size_t, size_t, typename FFPACK::RNSInteger<T>::Element, typename FFPACK::RNSInteger<T>::ConstElement_ptr, size_t, typename FFPACK::RNSInteger<T>::ConstElement_ptr, size_t, typename FFPACK::RNSInteger<T>::Element, typename FFPACK::RNSInteger<T>::Element_ptr, size_t, FFLAS::MMHelper<FFPACK::RNSInteger<T>, FFLAS::MMHelperAlgo::Classic, FFLAS::ModeCategories::DefaultTag, FFLAS::ParSeqHelper::Parallel<Cut, Param> >&)':
556../../../fflas-ffpack/fflas/fflas_fgemm/fgemm_classical_mp.inl:204:8: error: expected ';' before string constant
557   WAIT;
558        ^
559Makefile:576: recipe for target 'fflas_L2_inst.lo' failed
560make[6]: *** [fflas_L2_inst.lo] Error 1
561make[6]: *** Waiting for unfinished jobs....
562In file included from ../../../fflas-ffpack/fflas/fflas_fger_mp.inl:40:0,
563                 from ../../../fflas-ffpack/fflas/fflas.h:126,
564                 from fflas_L1_inst.C:34:
565../../../fflas-ffpack/fflas/fflas_fgemm/fgemm_classical_mp.inl:204:2: error: stray '#' in program
566   WAIT;
567  ^
568../../../fflas-ffpack/fflas/fflas_fgemm/fgemm_classical_mp.inl: In function 'typename FFPACK::RNSInteger<T>::Element_ptr FFLAS::fgemm(const FFPACK::RNSInteger<T>&, FFLAS::FFLAS_TRANSPOSE, FFLAS::FFLAS_TRANSPOSE, size_t, size_t, size_t, typename FFPACK::RNSInteger<T>::Element, typename FFPACK::RNSInteger<T>::ConstElement_ptr, size_t, typename FFPACK::RNSInteger<T>::ConstElement_ptr, size_t, typename FFPACK::RNSInteger<T>::Element, typename FFPACK::RNSInteger<T>::Element_ptr, size_t, FFLAS::MMHelper<FFPACK::RNSInteger<T>, FFLAS::MMHelperAlgo::Classic, FFLAS::ModeCategories::DefaultTag, FFLAS::ParSeqHelper::Parallel<Cut, Param> >&)':
569../../../fflas-ffpack/fflas/fflas_fgemm/fgemm_classical_mp.inl:204:8: error: expected ';' before string constant
570   WAIT;
571        ^
572Makefile:576: recipe for target 'fflas_L1_inst.lo' failed
573make[6]: *** [fflas_L1_inst.lo] Error 1
574make[6]: Leaving directory '/usr/local/src/sage-config/local/var/tmp/sage/build/fflas_ffpack-2.2.0/src/fflas-ffpack/interfaces/libs'
575Makefile:400: recipe for target 'install-recursive' failed
576make[5]: *** [install-recursive] Error 1
577make[5]: Leaving directory '/usr/local/src/sage-config/local/var/tmp/sage/build/fflas_ffpack-2.2.0/src/fflas-ffpack/interfaces'
578Makefile:460: recipe for target 'install-recursive' failed
579make[4]: *** [install-recursive] Error 1
580make[4]: Leaving directory '/usr/local/src/sage-config/local/var/tmp/sage/build/fflas_ffpack-2.2.0/src/fflas-ffpack'
581Makefile:552: recipe for target 'install-recursive' failed
582make[3]: *** [install-recursive] Error 1
583make[3]: Leaving directory '/usr/local/src/sage-config/local/var/tmp/sage/build/fflas_ffpack-2.2.0/src'
584Error installing fflas-ffpack
585
586real    2m10.634s
587user    1m32.574s
588sys     0m3.014s
589************************************************************************
590Error installing package fflas_ffpack-2.2.0
591************************************************************************
592Please email sage-devel (http://groups.google.com/group/sage-devel)
593explaining the problem and including the relevant part of the log file
594  /usr/local/src/sage-config/logs/pkgs/fflas_ffpack-2.2.0.log
595Describe your computer, operating system, etc.
596If you want to try to fix the problem yourself, *don't* just cd to
597/usr/local/src/sage-config/local/var/tmp/sage/build/fflas_ffpack-2.2.0 and type 'make' or whatever is appropriate.
598Instead, the following commands setup all environment variables
599correctly and load a subshell for you to debug the error:
600  (cd '/usr/local/src/sage-config/local/var/tmp/sage/build/fflas_ffpack-2.2.0' && '/usr/local/src/sage-config/sage' --sh)
601When you are done debugging, you can type "exit" to leave the subshell.
602************************************************************************