Ticket #15317: scrimshaw_cygwin.log

File scrimshaw_cygwin.log, 52.1 KB (added by tscrim, 6 years ago)
Line 
1cd build && \
2"../build/pipestatus" \
3        "env SAGE_PARALLEL_SPKG_BUILD='' ./install all 2>&1" \
4        "tee -a ../logs/install.log"
5*** ALL ENVIRONMENT VARIABLES BEFORE BUILD: ***
6!::=::\
7_=/usr/bin/env
8ALLUSERSPROFILE=C:\ProgramData
9ANDROID_NDK_PATH=C:\Users\Travis\Documents\Android\ndk\android-ndk-r8d
10APPDATA=C:\Users\Travis\AppData\Roaming
11CLASSPATH=.;C:\Program Files (x86)\Java\jre6\lib\ext\QTJava.zip
12CommonProgramFiles(x86)=C:\Program Files (x86)\Common Files
13COMMONPROGRAMFILES=C:\Program Files (x86)\Common Files
14CommonProgramW6432=C:\Program Files\Common Files
15COMPUTERNAME=TRAVIS-NOTEBOOK
16COMSPEC=C:\Windows\system32\cmd.exe
17DFSTRACINGON=FALSE
18FP_NO_HOST_CHECK=NO
19GTK_BASEPATH=C:\Program Files (x86)\GtkSharp\2.12\
20HOME=/home/Travis
21HOMEDRIVE=C:
22HOMEPATH=\Users\Travis
23HOSTNAME=Travis-Notebook
24INFOPATH=/usr/local/info:/usr/share/info:/usr/info:
25LANG=en_US.UTF-8
26LOCALAPPDATA=C:\Users\Travis\AppData\Local
27LOGONSERVER=\\TRAVIS-NOTEBOOK
28MAKE=make
29MAKEFLAGS=
30MAKELEVEL=1
31MANPATH=/usr/local/man:/usr/share/man:/usr/man::/usr/ssl/man
32MFLAGS=
33NUMBER_OF_PROCESSORS=2
34OS=Windows_NT
35PATH=/home/Travis/sage/src/bin:/home/Travis/sage/local/bin:/usr/local/bin:/usr/bin:/cygdrive/c/Program Files/MiKTeX 2.9/miktex/bin/x64:/cygdrive/c/Qt/2010.04/mingw/bin:/cygdrive/c/Program Files (x86)/CMake 2.8/bin:/cygdrive/c/Program Files (x86)/LLNL/VisIt 2.1.0:/cygdrive/c/Windows/system32:/cygdrive/c/Windows:/cygdrive/c/Windows/System32/Wbem:/cygdrive/c/PROGRA~2/COMMON~1/ULEADS~1/MPEG:/cygdrive/c/Program Files/Intel/WiFi/bin:/cygdrive/c/Program Files (x86)/Common Files/DivX Shared:/cygdrive/c/altera/91/quartus/bin:/cygdrive/c/Program Files (x86)/Autodesk/Backburner:/cygdrive/c/Program Files/Common Files/Autodesk Shared:/cygdrive/c/Program Files (x86)/TortoiseSVN/bin:/cygdrive/c/Program Files/TortoiseHg:/cygdrive/c/Program Files (x86)/QuickTime/QTSystem:/cygdrive/c/Program Files/TortoiseGit/bin:/cygdrive/c/Program Files (x86)/GtkSharp/2.12/bin:/usr/lib/lapack
36PATHEXT=.COM;.EXE;.BAT;.CMD;.VBS;.VBE;.JS;.JSE;.WSF;.WSH;.MSC
37PRINTER=Adobe PDF
38PROCESSOR_ARCHITECTURE=x86
39PROCESSOR_ARCHITEW6432=AMD64
40PROCESSOR_IDENTIFIER=Intel64 Family 6 Model 23 Stepping 10, GenuineIntel
41PROCESSOR_LEVEL=6
42PROCESSOR_REVISION=170a
43ProgramData=C:\ProgramData
44ProgramFiles(x86)=C:\Program Files (x86)
45PROGRAMFILES=C:\Program Files (x86)
46ProgramW6432=C:\Program Files
47PUBLIC=C:\Users\Public
48PWD=/home/Travis/sage/build
49PYTHONPATH=/home/Travis/sage/local
50QTJAVA=C:\Program Files (x86)\Java\jre6\lib\ext\QTJava.zip
51QUARTUS_ROOTDIR=c:\altera\91\quartus
52SAGE_EXTCODE=/home/Travis/sage/local/share/sage/ext
53SAGE_LOCAL=/home/Travis/sage/local
54SAGE_LOGS=/home/Travis/sage/logs/pkgs
55SAGE_PARALLEL_SPKG_BUILD=
56SAGE_ROOT=/home/Travis/sage
57SAGE_SPKG_INST=/home/Travis/sage/local/var/lib/sage/installed
58SAGE_SRC=/home/Travis/sage/src
59SAGE_VERSION=6.1.beta4
60SESSIONNAME=Console
61SHELL=/bin/bash
62SHLVL=4
63SYSTEMDRIVE=C:
64SYSTEMROOT=C:\Windows
65TEMP=/tmp
66temp=C:\Users\Travis\AppData\Local\Temp
67TERM=xterm
68TEXMFCACHE=C:\ProgramData\MiKTeX\2.9
69TMP=/tmp
70tmp=C:\Users\Travis\AppData\Local\Temp
71TRACE_FORMAT_SEARCH_PATH=\\NTREL202.ntdev.corp.microsoft.com\34FB5F65-FFEB-4B61-BF0E-A6A76C450FAA\TraceFormat
72TZ=America/Los_Angeles
73USER=Travis
74USERDOMAIN=Travis-Notebook
75USERNAME=Travis
76USERPROFILE=C:\Users\Travis
77VBOX_INSTALL_PATH=C:\Program Files\Oracle\VirtualBox\
78WINDIR=C:\Windows
79***********************************************
80make[1]: Entering directory '/home/Travis/sage/build'
81make base
82make[2]: Entering directory '/home/Travis/sage/build'
83make[2]: Nothing to be done for 'base'.
84make[2]: Leaving directory '/home/Travis/sage/build'
85env SAGE_BUILD_TOOLCHAIN=yes make toolchain
86make[2]: Entering directory '/home/Travis/sage/build'
87make[2]: Nothing to be done for 'toolchain'.
88make[2]: Leaving directory '/home/Travis/sage/build'
89make toolchain-deps
90make[2]: Entering directory '/home/Travis/sage/build'
91make /home/Travis/sage/local/var/lib/sage/installed/zlib-1.2.8.p0
92make[3]: Entering directory '/home/Travis/sage/build'
93make[3]: '/home/Travis/sage/local/var/lib/sage/installed/zlib-1.2.8.p0' is up to date.
94make[3]: Leaving directory '/home/Travis/sage/build'
95make /home/Travis/sage/local/var/lib/sage/installed/mpir-2.6.0.p3
96make[3]: Entering directory '/home/Travis/sage/build'
97make[3]: '/home/Travis/sage/local/var/lib/sage/installed/mpir-2.6.0.p3' is up to date.
98make[3]: Leaving directory '/home/Travis/sage/build'
99make /home/Travis/sage/local/var/lib/sage/installed/mpfr-3.1.2.p0
100make[3]: Entering directory '/home/Travis/sage/build'
101make[3]: '/home/Travis/sage/local/var/lib/sage/installed/mpfr-3.1.2.p0' is up to date.
102make[3]: Leaving directory '/home/Travis/sage/build'
103make /home/Travis/sage/local/var/lib/sage/installed/mpc-1.0.p0
104make[3]: Entering directory '/home/Travis/sage/build'
105make[3]: '/home/Travis/sage/local/var/lib/sage/installed/mpc-1.0.p0' is up to date.
106make[3]: Leaving directory '/home/Travis/sage/build'
107make /home/Travis/sage/local/var/lib/sage/installed/ppl-1.1pre9.p0
108make[3]: Entering directory '/home/Travis/sage/build'
109make[3]: '/home/Travis/sage/local/var/lib/sage/installed/ppl-1.1pre9.p0' is up to date.
110make[3]: Leaving directory '/home/Travis/sage/build'
111make[2]: Leaving directory '/home/Travis/sage/build'
112make all-sage
113make[2]: Entering directory '/home/Travis/sage/build'
114/home/Travis/sage/build/pipestatus "sage-spkg ${SAGE_SPKG_OPTS} pillow-2.2.2 2>&1" "tee -a /home/Travis/sage/logs/pkgs/pillow-2.2.2.log"
115Found local metadata for pillow-2.2.2
116Found local sources at /home/Travis/sage/upstream/Pillow-2.2.2.tar.gz
117Checksum: 053337a612dd16ec6f1f6fc544374ca5fe65ae2c vs 053337a612dd16ec6f1f6fc544374ca5fe65ae2c
118pillow-2.2.2
119====================================================
120Setting up build directory for pillow-2.2.2
121Finished set up
122****************************************************
123Host system:
124CYGWIN_NT-6.0-WOW64 Travis-Notebook 1.7.27(0.271/5/3) 2013-12-09 11:57 i686 Cygwin
125****************************************************
126C compiler: gcc
127C compiler version:
128Using built-in specs.
129COLLECT_GCC=gcc
130COLLECT_LTO_WRAPPER=/usr/lib/gcc/i686-pc-cygwin/4.8.2/lto-wrapper.exe
131Target: i686-pc-cygwin
132Configured with: /cygdrive/i/szsz/tmpp/gcc4/gcc-4.8.2-2/src/gcc-4.8.2/configure --srcdir=/cygdrive/i/szsz/tmpp/gcc4/gcc-4.8.2-2/src/gcc-4.8.2 --prefix=/usr --exec-prefix=/usr --bindir=/usr/bin --sbindir=/usr/sbin --libexecdir=/usr/libexec --datadir=/usr/share --localstatedir=/var --sysconfdir=/etc --libdir=/usr/lib --datarootdir=/usr/share --docdir=/usr/share/doc/gcc --htmldir=/usr/share/doc/gcc/html -C --build=i686-pc-cygwin --host=i686-pc-cygwin --target=i686-pc-cygwin --without-libiconv-prefix --without-libintl-prefix --enable-shared --enable-shared-libgcc --enable-static --enable-version-specific-runtime-libs --enable-bootstrap --disable-__cxa_atexit --with-dwarf2 --with-arch=i686 --with-tune=generic --disable-sjlj-exceptions --enable-languages=ada,c,c++,fortran,java,lto,objc,obj-c++ --enable-graphite --enable-threads=posix --enable-libatomic --enable-libgomp --disable-libitm --enable-libquadmath --enable-libquadmath-support --enable-libssp --enable-libada --enable-libjava --enable-libgcj-sublibs --disable-java-awt --disable-symvers --with-ecj-jar=/usr/share/java/ecj.jar --with-gnu-ld --with-gnu-as --with-cloog-include=/usr/include/cloog-isl --without-libiconv-prefix --without-libintl-prefix --with-system-zlib --libexecdir=/usr/lib
133Thread model: posix
134gcc version 4.8.2 (GCC)
135****************************************************
136patching file setup.py
137running install
138running bdist_egg
139running egg_info
140creating Pillow.egg-info
141writing Pillow.egg-info/PKG-INFO
142writing top-level names to Pillow.egg-info/top_level.txt
143writing dependency_links to Pillow.egg-info/dependency_links.txt
144writing manifest file 'Pillow.egg-info/SOURCES.txt'
145reading manifest file 'Pillow.egg-info/SOURCES.txt'
146reading manifest template 'MANIFEST.in'
147writing manifest file 'Pillow.egg-info/SOURCES.txt'
148installing library code to build/bdist.cygwin-1.7.27-i686/egg
149running install_lib
150running build_py
151creating build
152creating build/lib.cygwin-1.7.27-i686-2.7
153creating build/lib.cygwin-1.7.27-i686-2.7/PIL
154copying PIL/ArgImagePlugin.py -> build/lib.cygwin-1.7.27-i686-2.7/PIL
155copying PIL/BdfFontFile.py -> build/lib.cygwin-1.7.27-i686-2.7/PIL
156copying PIL/BmpImagePlugin.py -> build/lib.cygwin-1.7.27-i686-2.7/PIL
157copying PIL/BufrStubImagePlugin.py -> build/lib.cygwin-1.7.27-i686-2.7/PIL
158copying PIL/ContainerIO.py -> build/lib.cygwin-1.7.27-i686-2.7/PIL
159copying PIL/CurImagePlugin.py -> build/lib.cygwin-1.7.27-i686-2.7/PIL
160copying PIL/DcxImagePlugin.py -> build/lib.cygwin-1.7.27-i686-2.7/PIL
161copying PIL/EpsImagePlugin.py -> build/lib.cygwin-1.7.27-i686-2.7/PIL
162copying PIL/ExifTags.py -> build/lib.cygwin-1.7.27-i686-2.7/PIL
163copying PIL/FitsStubImagePlugin.py -> build/lib.cygwin-1.7.27-i686-2.7/PIL
164copying PIL/FliImagePlugin.py -> build/lib.cygwin-1.7.27-i686-2.7/PIL
165copying PIL/FontFile.py -> build/lib.cygwin-1.7.27-i686-2.7/PIL
166copying PIL/FpxImagePlugin.py -> build/lib.cygwin-1.7.27-i686-2.7/PIL
167copying PIL/GbrImagePlugin.py -> build/lib.cygwin-1.7.27-i686-2.7/PIL
168copying PIL/GdImageFile.py -> build/lib.cygwin-1.7.27-i686-2.7/PIL
169copying PIL/GifImagePlugin.py -> build/lib.cygwin-1.7.27-i686-2.7/PIL
170copying PIL/GimpGradientFile.py -> build/lib.cygwin-1.7.27-i686-2.7/PIL
171copying PIL/GimpPaletteFile.py -> build/lib.cygwin-1.7.27-i686-2.7/PIL
172copying PIL/GribStubImagePlugin.py -> build/lib.cygwin-1.7.27-i686-2.7/PIL
173copying PIL/Hdf5StubImagePlugin.py -> build/lib.cygwin-1.7.27-i686-2.7/PIL
174copying PIL/IcnsImagePlugin.py -> build/lib.cygwin-1.7.27-i686-2.7/PIL
175copying PIL/IcoImagePlugin.py -> build/lib.cygwin-1.7.27-i686-2.7/PIL
176copying PIL/Image.py -> build/lib.cygwin-1.7.27-i686-2.7/PIL
177copying PIL/ImageChops.py -> build/lib.cygwin-1.7.27-i686-2.7/PIL
178copying PIL/ImageCms.py -> build/lib.cygwin-1.7.27-i686-2.7/PIL
179copying PIL/ImageColor.py -> build/lib.cygwin-1.7.27-i686-2.7/PIL
180copying PIL/ImageDraw.py -> build/lib.cygwin-1.7.27-i686-2.7/PIL
181copying PIL/ImageDraw2.py -> build/lib.cygwin-1.7.27-i686-2.7/PIL
182copying PIL/ImageEnhance.py -> build/lib.cygwin-1.7.27-i686-2.7/PIL
183copying PIL/ImageFile.py -> build/lib.cygwin-1.7.27-i686-2.7/PIL
184copying PIL/ImageFileIO.py -> build/lib.cygwin-1.7.27-i686-2.7/PIL
185copying PIL/ImageFilter.py -> build/lib.cygwin-1.7.27-i686-2.7/PIL
186copying PIL/ImageFont.py -> build/lib.cygwin-1.7.27-i686-2.7/PIL
187copying PIL/ImageGrab.py -> build/lib.cygwin-1.7.27-i686-2.7/PIL
188copying PIL/ImageMath.py -> build/lib.cygwin-1.7.27-i686-2.7/PIL
189copying PIL/ImageMode.py -> build/lib.cygwin-1.7.27-i686-2.7/PIL
190copying PIL/ImageOps.py -> build/lib.cygwin-1.7.27-i686-2.7/PIL
191copying PIL/ImagePalette.py -> build/lib.cygwin-1.7.27-i686-2.7/PIL
192copying PIL/ImagePath.py -> build/lib.cygwin-1.7.27-i686-2.7/PIL
193copying PIL/ImageQt.py -> build/lib.cygwin-1.7.27-i686-2.7/PIL
194copying PIL/ImageSequence.py -> build/lib.cygwin-1.7.27-i686-2.7/PIL
195copying PIL/ImageShow.py -> build/lib.cygwin-1.7.27-i686-2.7/PIL
196copying PIL/ImageStat.py -> build/lib.cygwin-1.7.27-i686-2.7/PIL
197copying PIL/ImageTk.py -> build/lib.cygwin-1.7.27-i686-2.7/PIL
198copying PIL/ImageTransform.py -> build/lib.cygwin-1.7.27-i686-2.7/PIL
199copying PIL/ImageWin.py -> build/lib.cygwin-1.7.27-i686-2.7/PIL
200copying PIL/ImImagePlugin.py -> build/lib.cygwin-1.7.27-i686-2.7/PIL
201copying PIL/ImtImagePlugin.py -> build/lib.cygwin-1.7.27-i686-2.7/PIL
202copying PIL/IptcImagePlugin.py -> build/lib.cygwin-1.7.27-i686-2.7/PIL
203copying PIL/JpegImagePlugin.py -> build/lib.cygwin-1.7.27-i686-2.7/PIL
204copying PIL/JpegPresets.py -> build/lib.cygwin-1.7.27-i686-2.7/PIL
205copying PIL/McIdasImagePlugin.py -> build/lib.cygwin-1.7.27-i686-2.7/PIL
206copying PIL/MicImagePlugin.py -> build/lib.cygwin-1.7.27-i686-2.7/PIL
207copying PIL/MpegImagePlugin.py -> build/lib.cygwin-1.7.27-i686-2.7/PIL
208copying PIL/MspImagePlugin.py -> build/lib.cygwin-1.7.27-i686-2.7/PIL
209copying PIL/OleFileIO.py -> build/lib.cygwin-1.7.27-i686-2.7/PIL
210copying PIL/PaletteFile.py -> build/lib.cygwin-1.7.27-i686-2.7/PIL
211copying PIL/PalmImagePlugin.py -> build/lib.cygwin-1.7.27-i686-2.7/PIL
212copying PIL/PcdImagePlugin.py -> build/lib.cygwin-1.7.27-i686-2.7/PIL
213copying PIL/PcfFontFile.py -> build/lib.cygwin-1.7.27-i686-2.7/PIL
214copying PIL/PcxImagePlugin.py -> build/lib.cygwin-1.7.27-i686-2.7/PIL
215copying PIL/PdfImagePlugin.py -> build/lib.cygwin-1.7.27-i686-2.7/PIL
216copying PIL/PixarImagePlugin.py -> build/lib.cygwin-1.7.27-i686-2.7/PIL
217copying PIL/PngImagePlugin.py -> build/lib.cygwin-1.7.27-i686-2.7/PIL
218copying PIL/PpmImagePlugin.py -> build/lib.cygwin-1.7.27-i686-2.7/PIL
219copying PIL/PsdImagePlugin.py -> build/lib.cygwin-1.7.27-i686-2.7/PIL
220copying PIL/PSDraw.py -> build/lib.cygwin-1.7.27-i686-2.7/PIL
221copying PIL/SgiImagePlugin.py -> build/lib.cygwin-1.7.27-i686-2.7/PIL
222copying PIL/SpiderImagePlugin.py -> build/lib.cygwin-1.7.27-i686-2.7/PIL
223copying PIL/SunImagePlugin.py -> build/lib.cygwin-1.7.27-i686-2.7/PIL
224copying PIL/TarIO.py -> build/lib.cygwin-1.7.27-i686-2.7/PIL
225copying PIL/tests.py -> build/lib.cygwin-1.7.27-i686-2.7/PIL
226copying PIL/TgaImagePlugin.py -> build/lib.cygwin-1.7.27-i686-2.7/PIL
227copying PIL/TiffImagePlugin.py -> build/lib.cygwin-1.7.27-i686-2.7/PIL
228copying PIL/TiffTags.py -> build/lib.cygwin-1.7.27-i686-2.7/PIL
229copying PIL/WalImageFile.py -> build/lib.cygwin-1.7.27-i686-2.7/PIL
230copying PIL/WebPImagePlugin.py -> build/lib.cygwin-1.7.27-i686-2.7/PIL
231copying PIL/WmfImagePlugin.py -> build/lib.cygwin-1.7.27-i686-2.7/PIL
232copying PIL/XbmImagePlugin.py -> build/lib.cygwin-1.7.27-i686-2.7/PIL
233copying PIL/XpmImagePlugin.py -> build/lib.cygwin-1.7.27-i686-2.7/PIL
234copying PIL/XVThumbImagePlugin.py -> build/lib.cygwin-1.7.27-i686-2.7/PIL
235copying PIL/_binary.py -> build/lib.cygwin-1.7.27-i686-2.7/PIL
236copying PIL/_util.py -> build/lib.cygwin-1.7.27-i686-2.7/PIL
237copying PIL/__init__.py -> build/lib.cygwin-1.7.27-i686-2.7/PIL
238running build_ext
239building 'PIL._imaging' extension
240creating build/temp.cygwin-1.7.27-i686-2.7
241creating build/temp.cygwin-1.7.27-i686-2.7/libImaging
242gcc -I/usr/include/ncurses -fno-strict-aliasing -g -O2 -DNDEBUG -g -fwrapv -O3 -Wall -DHAVE_LIBZ -I/home/Travis/sage/local/include/freetype2 -I/home/Travis/sage/local/var/tmp/sage/build/pillow-2.2.2/src/libImaging -I/home/Travis/sage/local/include -I/usr/include -I/home/Travis/sage/local/include/python2.7 -c _imaging.c -o build/temp.cygwin-1.7.27-i686-2.7/_imaging.o
243_imaging.c: In function ‘_filter’:
244_imaging.c:862:8: warning: ‘kernelsize’ may be used uninitialized in this function [-Wmaybe-uninitialized]
245     if (kernelsize != xsize * ysize) {
246        ^
247gcc -I/usr/include/ncurses -fno-strict-aliasing -g -O2 -DNDEBUG -g -fwrapv -O3 -Wall -DHAVE_LIBZ -I/home/Travis/sage/local/include/freetype2 -I/home/Travis/sage/local/var/tmp/sage/build/pillow-2.2.2/src/libImaging -I/home/Travis/sage/local/include -I/usr/include -I/home/Travis/sage/local/include/python2.7 -c decode.c -o build/temp.cygwin-1.7.27-i686-2.7/decode.o
248gcc -I/usr/include/ncurses -fno-strict-aliasing -g -O2 -DNDEBUG -g -fwrapv -O3 -Wall -DHAVE_LIBZ -I/home/Travis/sage/local/include/freetype2 -I/home/Travis/sage/local/var/tmp/sage/build/pillow-2.2.2/src/libImaging -I/home/Travis/sage/local/include -I/usr/include -I/home/Travis/sage/local/include/python2.7 -c encode.c -o build/temp.cygwin-1.7.27-i686-2.7/encode.o
249gcc -I/usr/include/ncurses -fno-strict-aliasing -g -O2 -DNDEBUG -g -fwrapv -O3 -Wall -DHAVE_LIBZ -I/home/Travis/sage/local/include/freetype2 -I/home/Travis/sage/local/var/tmp/sage/build/pillow-2.2.2/src/libImaging -I/home/Travis/sage/local/include -I/usr/include -I/home/Travis/sage/local/include/python2.7 -c map.c -o build/temp.cygwin-1.7.27-i686-2.7/map.o
250gcc -I/usr/include/ncurses -fno-strict-aliasing -g -O2 -DNDEBUG -g -fwrapv -O3 -Wall -DHAVE_LIBZ -I/home/Travis/sage/local/include/freetype2 -I/home/Travis/sage/local/var/tmp/sage/build/pillow-2.2.2/src/libImaging -I/home/Travis/sage/local/include -I/usr/include -I/home/Travis/sage/local/include/python2.7 -c display.c -o build/temp.cygwin-1.7.27-i686-2.7/display.o
251gcc -I/usr/include/ncurses -fno-strict-aliasing -g -O2 -DNDEBUG -g -fwrapv -O3 -Wall -DHAVE_LIBZ -I/home/Travis/sage/local/include/freetype2 -I/home/Travis/sage/local/var/tmp/sage/build/pillow-2.2.2/src/libImaging -I/home/Travis/sage/local/include -I/usr/include -I/home/Travis/sage/local/include/python2.7 -c outline.c -o build/temp.cygwin-1.7.27-i686-2.7/outline.o
252gcc -I/usr/include/ncurses -fno-strict-aliasing -g -O2 -DNDEBUG -g -fwrapv -O3 -Wall -DHAVE_LIBZ -I/home/Travis/sage/local/include/freetype2 -I/home/Travis/sage/local/var/tmp/sage/build/pillow-2.2.2/src/libImaging -I/home/Travis/sage/local/include -I/usr/include -I/home/Travis/sage/local/include/python2.7 -c path.c -o build/temp.cygwin-1.7.27-i686-2.7/path.o
253gcc -I/usr/include/ncurses -fno-strict-aliasing -g -O2 -DNDEBUG -g -fwrapv -O3 -Wall -DHAVE_LIBZ -I/home/Travis/sage/local/include/freetype2 -I/home/Travis/sage/local/var/tmp/sage/build/pillow-2.2.2/src/libImaging -I/home/Travis/sage/local/include -I/usr/include -I/home/Travis/sage/local/include/python2.7 -c libImaging/Access.c -o build/temp.cygwin-1.7.27-i686-2.7/libImaging/Access.o
254gcc -I/usr/include/ncurses -fno-strict-aliasing -g -O2 -DNDEBUG -g -fwrapv -O3 -Wall -DHAVE_LIBZ -I/home/Travis/sage/local/include/freetype2 -I/home/Travis/sage/local/var/tmp/sage/build/pillow-2.2.2/src/libImaging -I/home/Travis/sage/local/include -I/usr/include -I/home/Travis/sage/local/include/python2.7 -c libImaging/AlphaComposite.c -o build/temp.cygwin-1.7.27-i686-2.7/libImaging/AlphaComposite.o
255gcc -I/usr/include/ncurses -fno-strict-aliasing -g -O2 -DNDEBUG -g -fwrapv -O3 -Wall -DHAVE_LIBZ -I/home/Travis/sage/local/include/freetype2 -I/home/Travis/sage/local/var/tmp/sage/build/pillow-2.2.2/src/libImaging -I/home/Travis/sage/local/include -I/usr/include -I/home/Travis/sage/local/include/python2.7 -c libImaging/Antialias.c -o build/temp.cygwin-1.7.27-i686-2.7/libImaging/Antialias.o
256gcc -I/usr/include/ncurses -fno-strict-aliasing -g -O2 -DNDEBUG -g -fwrapv -O3 -Wall -DHAVE_LIBZ -I/home/Travis/sage/local/include/freetype2 -I/home/Travis/sage/local/var/tmp/sage/build/pillow-2.2.2/src/libImaging -I/home/Travis/sage/local/include -I/usr/include -I/home/Travis/sage/local/include/python2.7 -c libImaging/Bands.c -o build/temp.cygwin-1.7.27-i686-2.7/libImaging/Bands.o
257gcc -I/usr/include/ncurses -fno-strict-aliasing -g -O2 -DNDEBUG -g -fwrapv -O3 -Wall -DHAVE_LIBZ -I/home/Travis/sage/local/include/freetype2 -I/home/Travis/sage/local/var/tmp/sage/build/pillow-2.2.2/src/libImaging -I/home/Travis/sage/local/include -I/usr/include -I/home/Travis/sage/local/include/python2.7 -c libImaging/BitDecode.c -o build/temp.cygwin-1.7.27-i686-2.7/libImaging/BitDecode.o
258gcc -I/usr/include/ncurses -fno-strict-aliasing -g -O2 -DNDEBUG -g -fwrapv -O3 -Wall -DHAVE_LIBZ -I/home/Travis/sage/local/include/freetype2 -I/home/Travis/sage/local/var/tmp/sage/build/pillow-2.2.2/src/libImaging -I/home/Travis/sage/local/include -I/usr/include -I/home/Travis/sage/local/include/python2.7 -c libImaging/Blend.c -o build/temp.cygwin-1.7.27-i686-2.7/libImaging/Blend.o
259gcc -I/usr/include/ncurses -fno-strict-aliasing -g -O2 -DNDEBUG -g -fwrapv -O3 -Wall -DHAVE_LIBZ -I/home/Travis/sage/local/include/freetype2 -I/home/Travis/sage/local/var/tmp/sage/build/pillow-2.2.2/src/libImaging -I/home/Travis/sage/local/include -I/usr/include -I/home/Travis/sage/local/include/python2.7 -c libImaging/Chops.c -o build/temp.cygwin-1.7.27-i686-2.7/libImaging/Chops.o
260gcc -I/usr/include/ncurses -fno-strict-aliasing -g -O2 -DNDEBUG -g -fwrapv -O3 -Wall -DHAVE_LIBZ -I/home/Travis/sage/local/include/freetype2 -I/home/Travis/sage/local/var/tmp/sage/build/pillow-2.2.2/src/libImaging -I/home/Travis/sage/local/include -I/usr/include -I/home/Travis/sage/local/include/python2.7 -c libImaging/Convert.c -o build/temp.cygwin-1.7.27-i686-2.7/libImaging/Convert.o
261gcc -I/usr/include/ncurses -fno-strict-aliasing -g -O2 -DNDEBUG -g -fwrapv -O3 -Wall -DHAVE_LIBZ -I/home/Travis/sage/local/include/freetype2 -I/home/Travis/sage/local/var/tmp/sage/build/pillow-2.2.2/src/libImaging -I/home/Travis/sage/local/include -I/usr/include -I/home/Travis/sage/local/include/python2.7 -c libImaging/ConvertYCbCr.c -o build/temp.cygwin-1.7.27-i686-2.7/libImaging/ConvertYCbCr.o
262gcc -I/usr/include/ncurses -fno-strict-aliasing -g -O2 -DNDEBUG -g -fwrapv -O3 -Wall -DHAVE_LIBZ -I/home/Travis/sage/local/include/freetype2 -I/home/Travis/sage/local/var/tmp/sage/build/pillow-2.2.2/src/libImaging -I/home/Travis/sage/local/include -I/usr/include -I/home/Travis/sage/local/include/python2.7 -c libImaging/Copy.c -o build/temp.cygwin-1.7.27-i686-2.7/libImaging/Copy.o
263gcc -I/usr/include/ncurses -fno-strict-aliasing -g -O2 -DNDEBUG -g -fwrapv -O3 -Wall -DHAVE_LIBZ -I/home/Travis/sage/local/include/freetype2 -I/home/Travis/sage/local/var/tmp/sage/build/pillow-2.2.2/src/libImaging -I/home/Travis/sage/local/include -I/usr/include -I/home/Travis/sage/local/include/python2.7 -c libImaging/Crc32.c -o build/temp.cygwin-1.7.27-i686-2.7/libImaging/Crc32.o
264gcc -I/usr/include/ncurses -fno-strict-aliasing -g -O2 -DNDEBUG -g -fwrapv -O3 -Wall -DHAVE_LIBZ -I/home/Travis/sage/local/include/freetype2 -I/home/Travis/sage/local/var/tmp/sage/build/pillow-2.2.2/src/libImaging -I/home/Travis/sage/local/include -I/usr/include -I/home/Travis/sage/local/include/python2.7 -c libImaging/Crop.c -o build/temp.cygwin-1.7.27-i686-2.7/libImaging/Crop.o
265gcc -I/usr/include/ncurses -fno-strict-aliasing -g -O2 -DNDEBUG -g -fwrapv -O3 -Wall -DHAVE_LIBZ -I/home/Travis/sage/local/include/freetype2 -I/home/Travis/sage/local/var/tmp/sage/build/pillow-2.2.2/src/libImaging -I/home/Travis/sage/local/include -I/usr/include -I/home/Travis/sage/local/include/python2.7 -c libImaging/Dib.c -o build/temp.cygwin-1.7.27-i686-2.7/libImaging/Dib.o
266gcc -I/usr/include/ncurses -fno-strict-aliasing -g -O2 -DNDEBUG -g -fwrapv -O3 -Wall -DHAVE_LIBZ -I/home/Travis/sage/local/include/freetype2 -I/home/Travis/sage/local/var/tmp/sage/build/pillow-2.2.2/src/libImaging -I/home/Travis/sage/local/include -I/usr/include -I/home/Travis/sage/local/include/python2.7 -c libImaging/Draw.c -o build/temp.cygwin-1.7.27-i686-2.7/libImaging/Draw.o
267gcc -I/usr/include/ncurses -fno-strict-aliasing -g -O2 -DNDEBUG -g -fwrapv -O3 -Wall -DHAVE_LIBZ -I/home/Travis/sage/local/include/freetype2 -I/home/Travis/sage/local/var/tmp/sage/build/pillow-2.2.2/src/libImaging -I/home/Travis/sage/local/include -I/usr/include -I/home/Travis/sage/local/include/python2.7 -c libImaging/Effects.c -o build/temp.cygwin-1.7.27-i686-2.7/libImaging/Effects.o
268gcc -I/usr/include/ncurses -fno-strict-aliasing -g -O2 -DNDEBUG -g -fwrapv -O3 -Wall -DHAVE_LIBZ -I/home/Travis/sage/local/include/freetype2 -I/home/Travis/sage/local/var/tmp/sage/build/pillow-2.2.2/src/libImaging -I/home/Travis/sage/local/include -I/usr/include -I/home/Travis/sage/local/include/python2.7 -c libImaging/EpsEncode.c -o build/temp.cygwin-1.7.27-i686-2.7/libImaging/EpsEncode.o
269gcc -I/usr/include/ncurses -fno-strict-aliasing -g -O2 -DNDEBUG -g -fwrapv -O3 -Wall -DHAVE_LIBZ -I/home/Travis/sage/local/include/freetype2 -I/home/Travis/sage/local/var/tmp/sage/build/pillow-2.2.2/src/libImaging -I/home/Travis/sage/local/include -I/usr/include -I/home/Travis/sage/local/include/python2.7 -c libImaging/File.c -o build/temp.cygwin-1.7.27-i686-2.7/libImaging/File.o
270gcc -I/usr/include/ncurses -fno-strict-aliasing -g -O2 -DNDEBUG -g -fwrapv -O3 -Wall -DHAVE_LIBZ -I/home/Travis/sage/local/include/freetype2 -I/home/Travis/sage/local/var/tmp/sage/build/pillow-2.2.2/src/libImaging -I/home/Travis/sage/local/include -I/usr/include -I/home/Travis/sage/local/include/python2.7 -c libImaging/Fill.c -o build/temp.cygwin-1.7.27-i686-2.7/libImaging/Fill.o
271gcc -I/usr/include/ncurses -fno-strict-aliasing -g -O2 -DNDEBUG -g -fwrapv -O3 -Wall -DHAVE_LIBZ -I/home/Travis/sage/local/include/freetype2 -I/home/Travis/sage/local/var/tmp/sage/build/pillow-2.2.2/src/libImaging -I/home/Travis/sage/local/include -I/usr/include -I/home/Travis/sage/local/include/python2.7 -c libImaging/Filter.c -o build/temp.cygwin-1.7.27-i686-2.7/libImaging/Filter.o
272gcc -I/usr/include/ncurses -fno-strict-aliasing -g -O2 -DNDEBUG -g -fwrapv -O3 -Wall -DHAVE_LIBZ -I/home/Travis/sage/local/include/freetype2 -I/home/Travis/sage/local/var/tmp/sage/build/pillow-2.2.2/src/libImaging -I/home/Travis/sage/local/include -I/usr/include -I/home/Travis/sage/local/include/python2.7 -c libImaging/FliDecode.c -o build/temp.cygwin-1.7.27-i686-2.7/libImaging/FliDecode.o
273gcc -I/usr/include/ncurses -fno-strict-aliasing -g -O2 -DNDEBUG -g -fwrapv -O3 -Wall -DHAVE_LIBZ -I/home/Travis/sage/local/include/freetype2 -I/home/Travis/sage/local/var/tmp/sage/build/pillow-2.2.2/src/libImaging -I/home/Travis/sage/local/include -I/usr/include -I/home/Travis/sage/local/include/python2.7 -c libImaging/Geometry.c -o build/temp.cygwin-1.7.27-i686-2.7/libImaging/Geometry.o
274gcc -I/usr/include/ncurses -fno-strict-aliasing -g -O2 -DNDEBUG -g -fwrapv -O3 -Wall -DHAVE_LIBZ -I/home/Travis/sage/local/include/freetype2 -I/home/Travis/sage/local/var/tmp/sage/build/pillow-2.2.2/src/libImaging -I/home/Travis/sage/local/include -I/usr/include -I/home/Travis/sage/local/include/python2.7 -c libImaging/GetBBox.c -o build/temp.cygwin-1.7.27-i686-2.7/libImaging/GetBBox.o
275gcc -I/usr/include/ncurses -fno-strict-aliasing -g -O2 -DNDEBUG -g -fwrapv -O3 -Wall -DHAVE_LIBZ -I/home/Travis/sage/local/include/freetype2 -I/home/Travis/sage/local/var/tmp/sage/build/pillow-2.2.2/src/libImaging -I/home/Travis/sage/local/include -I/usr/include -I/home/Travis/sage/local/include/python2.7 -c libImaging/GifDecode.c -o build/temp.cygwin-1.7.27-i686-2.7/libImaging/GifDecode.o
276gcc -I/usr/include/ncurses -fno-strict-aliasing -g -O2 -DNDEBUG -g -fwrapv -O3 -Wall -DHAVE_LIBZ -I/home/Travis/sage/local/include/freetype2 -I/home/Travis/sage/local/var/tmp/sage/build/pillow-2.2.2/src/libImaging -I/home/Travis/sage/local/include -I/usr/include -I/home/Travis/sage/local/include/python2.7 -c libImaging/GifEncode.c -o build/temp.cygwin-1.7.27-i686-2.7/libImaging/GifEncode.o
277gcc -I/usr/include/ncurses -fno-strict-aliasing -g -O2 -DNDEBUG -g -fwrapv -O3 -Wall -DHAVE_LIBZ -I/home/Travis/sage/local/include/freetype2 -I/home/Travis/sage/local/var/tmp/sage/build/pillow-2.2.2/src/libImaging -I/home/Travis/sage/local/include -I/usr/include -I/home/Travis/sage/local/include/python2.7 -c libImaging/HexDecode.c -o build/temp.cygwin-1.7.27-i686-2.7/libImaging/HexDecode.o
278gcc -I/usr/include/ncurses -fno-strict-aliasing -g -O2 -DNDEBUG -g -fwrapv -O3 -Wall -DHAVE_LIBZ -I/home/Travis/sage/local/include/freetype2 -I/home/Travis/sage/local/var/tmp/sage/build/pillow-2.2.2/src/libImaging -I/home/Travis/sage/local/include -I/usr/include -I/home/Travis/sage/local/include/python2.7 -c libImaging/Histo.c -o build/temp.cygwin-1.7.27-i686-2.7/libImaging/Histo.o
279gcc -I/usr/include/ncurses -fno-strict-aliasing -g -O2 -DNDEBUG -g -fwrapv -O3 -Wall -DHAVE_LIBZ -I/home/Travis/sage/local/include/freetype2 -I/home/Travis/sage/local/var/tmp/sage/build/pillow-2.2.2/src/libImaging -I/home/Travis/sage/local/include -I/usr/include -I/home/Travis/sage/local/include/python2.7 -c libImaging/JpegDecode.c -o build/temp.cygwin-1.7.27-i686-2.7/libImaging/JpegDecode.o
280gcc -I/usr/include/ncurses -fno-strict-aliasing -g -O2 -DNDEBUG -g -fwrapv -O3 -Wall -DHAVE_LIBZ -I/home/Travis/sage/local/include/freetype2 -I/home/Travis/sage/local/var/tmp/sage/build/pillow-2.2.2/src/libImaging -I/home/Travis/sage/local/include -I/usr/include -I/home/Travis/sage/local/include/python2.7 -c libImaging/JpegEncode.c -o build/temp.cygwin-1.7.27-i686-2.7/libImaging/JpegEncode.o
281gcc -I/usr/include/ncurses -fno-strict-aliasing -g -O2 -DNDEBUG -g -fwrapv -O3 -Wall -DHAVE_LIBZ -I/home/Travis/sage/local/include/freetype2 -I/home/Travis/sage/local/var/tmp/sage/build/pillow-2.2.2/src/libImaging -I/home/Travis/sage/local/include -I/usr/include -I/home/Travis/sage/local/include/python2.7 -c libImaging/LzwDecode.c -o build/temp.cygwin-1.7.27-i686-2.7/libImaging/LzwDecode.o
282gcc -I/usr/include/ncurses -fno-strict-aliasing -g -O2 -DNDEBUG -g -fwrapv -O3 -Wall -DHAVE_LIBZ -I/home/Travis/sage/local/include/freetype2 -I/home/Travis/sage/local/var/tmp/sage/build/pillow-2.2.2/src/libImaging -I/home/Travis/sage/local/include -I/usr/include -I/home/Travis/sage/local/include/python2.7 -c libImaging/Matrix.c -o build/temp.cygwin-1.7.27-i686-2.7/libImaging/Matrix.o
283gcc -I/usr/include/ncurses -fno-strict-aliasing -g -O2 -DNDEBUG -g -fwrapv -O3 -Wall -DHAVE_LIBZ -I/home/Travis/sage/local/include/freetype2 -I/home/Travis/sage/local/var/tmp/sage/build/pillow-2.2.2/src/libImaging -I/home/Travis/sage/local/include -I/usr/include -I/home/Travis/sage/local/include/python2.7 -c libImaging/ModeFilter.c -o build/temp.cygwin-1.7.27-i686-2.7/libImaging/ModeFilter.o
284gcc -I/usr/include/ncurses -fno-strict-aliasing -g -O2 -DNDEBUG -g -fwrapv -O3 -Wall -DHAVE_LIBZ -I/home/Travis/sage/local/include/freetype2 -I/home/Travis/sage/local/var/tmp/sage/build/pillow-2.2.2/src/libImaging -I/home/Travis/sage/local/include -I/usr/include -I/home/Travis/sage/local/include/python2.7 -c libImaging/MspDecode.c -o build/temp.cygwin-1.7.27-i686-2.7/libImaging/MspDecode.o
285gcc -I/usr/include/ncurses -fno-strict-aliasing -g -O2 -DNDEBUG -g -fwrapv -O3 -Wall -DHAVE_LIBZ -I/home/Travis/sage/local/include/freetype2 -I/home/Travis/sage/local/var/tmp/sage/build/pillow-2.2.2/src/libImaging -I/home/Travis/sage/local/include -I/usr/include -I/home/Travis/sage/local/include/python2.7 -c libImaging/Negative.c -o build/temp.cygwin-1.7.27-i686-2.7/libImaging/Negative.o
286gcc -I/usr/include/ncurses -fno-strict-aliasing -g -O2 -DNDEBUG -g -fwrapv -O3 -Wall -DHAVE_LIBZ -I/home/Travis/sage/local/include/freetype2 -I/home/Travis/sage/local/var/tmp/sage/build/pillow-2.2.2/src/libImaging -I/home/Travis/sage/local/include -I/usr/include -I/home/Travis/sage/local/include/python2.7 -c libImaging/Offset.c -o build/temp.cygwin-1.7.27-i686-2.7/libImaging/Offset.o
287gcc -I/usr/include/ncurses -fno-strict-aliasing -g -O2 -DNDEBUG -g -fwrapv -O3 -Wall -DHAVE_LIBZ -I/home/Travis/sage/local/include/freetype2 -I/home/Travis/sage/local/var/tmp/sage/build/pillow-2.2.2/src/libImaging -I/home/Travis/sage/local/include -I/usr/include -I/home/Travis/sage/local/include/python2.7 -c libImaging/Pack.c -o build/temp.cygwin-1.7.27-i686-2.7/libImaging/Pack.o
288gcc -I/usr/include/ncurses -fno-strict-aliasing -g -O2 -DNDEBUG -g -fwrapv -O3 -Wall -DHAVE_LIBZ -I/home/Travis/sage/local/include/freetype2 -I/home/Travis/sage/local/var/tmp/sage/build/pillow-2.2.2/src/libImaging -I/home/Travis/sage/local/include -I/usr/include -I/home/Travis/sage/local/include/python2.7 -c libImaging/PackDecode.c -o build/temp.cygwin-1.7.27-i686-2.7/libImaging/PackDecode.o
289gcc -I/usr/include/ncurses -fno-strict-aliasing -g -O2 -DNDEBUG -g -fwrapv -O3 -Wall -DHAVE_LIBZ -I/home/Travis/sage/local/include/freetype2 -I/home/Travis/sage/local/var/tmp/sage/build/pillow-2.2.2/src/libImaging -I/home/Travis/sage/local/include -I/usr/include -I/home/Travis/sage/local/include/python2.7 -c libImaging/Palette.c -o build/temp.cygwin-1.7.27-i686-2.7/libImaging/Palette.o
290gcc -I/usr/include/ncurses -fno-strict-aliasing -g -O2 -DNDEBUG -g -fwrapv -O3 -Wall -DHAVE_LIBZ -I/home/Travis/sage/local/include/freetype2 -I/home/Travis/sage/local/var/tmp/sage/build/pillow-2.2.2/src/libImaging -I/home/Travis/sage/local/include -I/usr/include -I/home/Travis/sage/local/include/python2.7 -c libImaging/Paste.c -o build/temp.cygwin-1.7.27-i686-2.7/libImaging/Paste.o
291gcc -I/usr/include/ncurses -fno-strict-aliasing -g -O2 -DNDEBUG -g -fwrapv -O3 -Wall -DHAVE_LIBZ -I/home/Travis/sage/local/include/freetype2 -I/home/Travis/sage/local/var/tmp/sage/build/pillow-2.2.2/src/libImaging -I/home/Travis/sage/local/include -I/usr/include -I/home/Travis/sage/local/include/python2.7 -c libImaging/Quant.c -o build/temp.cygwin-1.7.27-i686-2.7/libImaging/Quant.o
292gcc -I/usr/include/ncurses -fno-strict-aliasing -g -O2 -DNDEBUG -g -fwrapv -O3 -Wall -DHAVE_LIBZ -I/home/Travis/sage/local/include/freetype2 -I/home/Travis/sage/local/var/tmp/sage/build/pillow-2.2.2/src/libImaging -I/home/Travis/sage/local/include -I/usr/include -I/home/Travis/sage/local/include/python2.7 -c libImaging/QuantOctree.c -o build/temp.cygwin-1.7.27-i686-2.7/libImaging/QuantOctree.o
293gcc -I/usr/include/ncurses -fno-strict-aliasing -g -O2 -DNDEBUG -g -fwrapv -O3 -Wall -DHAVE_LIBZ -I/home/Travis/sage/local/include/freetype2 -I/home/Travis/sage/local/var/tmp/sage/build/pillow-2.2.2/src/libImaging -I/home/Travis/sage/local/include -I/usr/include -I/home/Travis/sage/local/include/python2.7 -c libImaging/QuantHash.c -o build/temp.cygwin-1.7.27-i686-2.7/libImaging/QuantHash.o
294gcc -I/usr/include/ncurses -fno-strict-aliasing -g -O2 -DNDEBUG -g -fwrapv -O3 -Wall -DHAVE_LIBZ -I/home/Travis/sage/local/include/freetype2 -I/home/Travis/sage/local/var/tmp/sage/build/pillow-2.2.2/src/libImaging -I/home/Travis/sage/local/include -I/usr/include -I/home/Travis/sage/local/include/python2.7 -c libImaging/QuantHeap.c -o build/temp.cygwin-1.7.27-i686-2.7/libImaging/QuantHeap.o
295gcc -I/usr/include/ncurses -fno-strict-aliasing -g -O2 -DNDEBUG -g -fwrapv -O3 -Wall -DHAVE_LIBZ -I/home/Travis/sage/local/include/freetype2 -I/home/Travis/sage/local/var/tmp/sage/build/pillow-2.2.2/src/libImaging -I/home/Travis/sage/local/include -I/usr/include -I/home/Travis/sage/local/include/python2.7 -c libImaging/PcdDecode.c -o build/temp.cygwin-1.7.27-i686-2.7/libImaging/PcdDecode.o
296gcc -I/usr/include/ncurses -fno-strict-aliasing -g -O2 -DNDEBUG -g -fwrapv -O3 -Wall -DHAVE_LIBZ -I/home/Travis/sage/local/include/freetype2 -I/home/Travis/sage/local/var/tmp/sage/build/pillow-2.2.2/src/libImaging -I/home/Travis/sage/local/include -I/usr/include -I/home/Travis/sage/local/include/python2.7 -c libImaging/PcxDecode.c -o build/temp.cygwin-1.7.27-i686-2.7/libImaging/PcxDecode.o
297gcc -I/usr/include/ncurses -fno-strict-aliasing -g -O2 -DNDEBUG -g -fwrapv -O3 -Wall -DHAVE_LIBZ -I/home/Travis/sage/local/include/freetype2 -I/home/Travis/sage/local/var/tmp/sage/build/pillow-2.2.2/src/libImaging -I/home/Travis/sage/local/include -I/usr/include -I/home/Travis/sage/local/include/python2.7 -c libImaging/PcxEncode.c -o build/temp.cygwin-1.7.27-i686-2.7/libImaging/PcxEncode.o
298gcc -I/usr/include/ncurses -fno-strict-aliasing -g -O2 -DNDEBUG -g -fwrapv -O3 -Wall -DHAVE_LIBZ -I/home/Travis/sage/local/include/freetype2 -I/home/Travis/sage/local/var/tmp/sage/build/pillow-2.2.2/src/libImaging -I/home/Travis/sage/local/include -I/usr/include -I/home/Travis/sage/local/include/python2.7 -c libImaging/Point.c -o build/temp.cygwin-1.7.27-i686-2.7/libImaging/Point.o
299gcc -I/usr/include/ncurses -fno-strict-aliasing -g -O2 -DNDEBUG -g -fwrapv -O3 -Wall -DHAVE_LIBZ -I/home/Travis/sage/local/include/freetype2 -I/home/Travis/sage/local/var/tmp/sage/build/pillow-2.2.2/src/libImaging -I/home/Travis/sage/local/include -I/usr/include -I/home/Travis/sage/local/include/python2.7 -c libImaging/RankFilter.c -o build/temp.cygwin-1.7.27-i686-2.7/libImaging/RankFilter.o
300gcc -I/usr/include/ncurses -fno-strict-aliasing -g -O2 -DNDEBUG -g -fwrapv -O3 -Wall -DHAVE_LIBZ -I/home/Travis/sage/local/include/freetype2 -I/home/Travis/sage/local/var/tmp/sage/build/pillow-2.2.2/src/libImaging -I/home/Travis/sage/local/include -I/usr/include -I/home/Travis/sage/local/include/python2.7 -c libImaging/RawDecode.c -o build/temp.cygwin-1.7.27-i686-2.7/libImaging/RawDecode.o
301gcc -I/usr/include/ncurses -fno-strict-aliasing -g -O2 -DNDEBUG -g -fwrapv -O3 -Wall -DHAVE_LIBZ -I/home/Travis/sage/local/include/freetype2 -I/home/Travis/sage/local/var/tmp/sage/build/pillow-2.2.2/src/libImaging -I/home/Travis/sage/local/include -I/usr/include -I/home/Travis/sage/local/include/python2.7 -c libImaging/RawEncode.c -o build/temp.cygwin-1.7.27-i686-2.7/libImaging/RawEncode.o
302gcc -I/usr/include/ncurses -fno-strict-aliasing -g -O2 -DNDEBUG -g -fwrapv -O3 -Wall -DHAVE_LIBZ -I/home/Travis/sage/local/include/freetype2 -I/home/Travis/sage/local/var/tmp/sage/build/pillow-2.2.2/src/libImaging -I/home/Travis/sage/local/include -I/usr/include -I/home/Travis/sage/local/include/python2.7 -c libImaging/Storage.c -o build/temp.cygwin-1.7.27-i686-2.7/libImaging/Storage.o
303gcc -I/usr/include/ncurses -fno-strict-aliasing -g -O2 -DNDEBUG -g -fwrapv -O3 -Wall -DHAVE_LIBZ -I/home/Travis/sage/local/include/freetype2 -I/home/Travis/sage/local/var/tmp/sage/build/pillow-2.2.2/src/libImaging -I/home/Travis/sage/local/include -I/usr/include -I/home/Travis/sage/local/include/python2.7 -c libImaging/SunRleDecode.c -o build/temp.cygwin-1.7.27-i686-2.7/libImaging/SunRleDecode.o
304gcc -I/usr/include/ncurses -fno-strict-aliasing -g -O2 -DNDEBUG -g -fwrapv -O3 -Wall -DHAVE_LIBZ -I/home/Travis/sage/local/include/freetype2 -I/home/Travis/sage/local/var/tmp/sage/build/pillow-2.2.2/src/libImaging -I/home/Travis/sage/local/include -I/usr/include -I/home/Travis/sage/local/include/python2.7 -c libImaging/TgaRleDecode.c -o build/temp.cygwin-1.7.27-i686-2.7/libImaging/TgaRleDecode.o
305gcc -I/usr/include/ncurses -fno-strict-aliasing -g -O2 -DNDEBUG -g -fwrapv -O3 -Wall -DHAVE_LIBZ -I/home/Travis/sage/local/include/freetype2 -I/home/Travis/sage/local/var/tmp/sage/build/pillow-2.2.2/src/libImaging -I/home/Travis/sage/local/include -I/usr/include -I/home/Travis/sage/local/include/python2.7 -c libImaging/Unpack.c -o build/temp.cygwin-1.7.27-i686-2.7/libImaging/Unpack.o
306gcc -I/usr/include/ncurses -fno-strict-aliasing -g -O2 -DNDEBUG -g -fwrapv -O3 -Wall -DHAVE_LIBZ -I/home/Travis/sage/local/include/freetype2 -I/home/Travis/sage/local/var/tmp/sage/build/pillow-2.2.2/src/libImaging -I/home/Travis/sage/local/include -I/usr/include -I/home/Travis/sage/local/include/python2.7 -c libImaging/UnpackYCC.c -o build/temp.cygwin-1.7.27-i686-2.7/libImaging/UnpackYCC.o
307gcc -I/usr/include/ncurses -fno-strict-aliasing -g -O2 -DNDEBUG -g -fwrapv -O3 -Wall -DHAVE_LIBZ -I/home/Travis/sage/local/include/freetype2 -I/home/Travis/sage/local/var/tmp/sage/build/pillow-2.2.2/src/libImaging -I/home/Travis/sage/local/include -I/usr/include -I/home/Travis/sage/local/include/python2.7 -c libImaging/UnsharpMask.c -o build/temp.cygwin-1.7.27-i686-2.7/libImaging/UnsharpMask.o
308gcc -I/usr/include/ncurses -fno-strict-aliasing -g -O2 -DNDEBUG -g -fwrapv -O3 -Wall -DHAVE_LIBZ -I/home/Travis/sage/local/include/freetype2 -I/home/Travis/sage/local/var/tmp/sage/build/pillow-2.2.2/src/libImaging -I/home/Travis/sage/local/include -I/usr/include -I/home/Travis/sage/local/include/python2.7 -c libImaging/XbmDecode.c -o build/temp.cygwin-1.7.27-i686-2.7/libImaging/XbmDecode.o
309gcc -I/usr/include/ncurses -fno-strict-aliasing -g -O2 -DNDEBUG -g -fwrapv -O3 -Wall -DHAVE_LIBZ -I/home/Travis/sage/local/include/freetype2 -I/home/Travis/sage/local/var/tmp/sage/build/pillow-2.2.2/src/libImaging -I/home/Travis/sage/local/include -I/usr/include -I/home/Travis/sage/local/include/python2.7 -c libImaging/XbmEncode.c -o build/temp.cygwin-1.7.27-i686-2.7/libImaging/XbmEncode.o
310gcc -I/usr/include/ncurses -fno-strict-aliasing -g -O2 -DNDEBUG -g -fwrapv -O3 -Wall -DHAVE_LIBZ -I/home/Travis/sage/local/include/freetype2 -I/home/Travis/sage/local/var/tmp/sage/build/pillow-2.2.2/src/libImaging -I/home/Travis/sage/local/include -I/usr/include -I/home/Travis/sage/local/include/python2.7 -c libImaging/ZipDecode.c -o build/temp.cygwin-1.7.27-i686-2.7/libImaging/ZipDecode.o
311gcc -I/usr/include/ncurses -fno-strict-aliasing -g -O2 -DNDEBUG -g -fwrapv -O3 -Wall -DHAVE_LIBZ -I/home/Travis/sage/local/include/freetype2 -I/home/Travis/sage/local/var/tmp/sage/build/pillow-2.2.2/src/libImaging -I/home/Travis/sage/local/include -I/usr/include -I/home/Travis/sage/local/include/python2.7 -c libImaging/ZipEncode.c -o build/temp.cygwin-1.7.27-i686-2.7/libImaging/ZipEncode.o
312gcc -I/usr/include/ncurses -fno-strict-aliasing -g -O2 -DNDEBUG -g -fwrapv -O3 -Wall -DHAVE_LIBZ -I/home/Travis/sage/local/include/freetype2 -I/home/Travis/sage/local/var/tmp/sage/build/pillow-2.2.2/src/libImaging -I/home/Travis/sage/local/include -I/usr/include -I/home/Travis/sage/local/include/python2.7 -c libImaging/TiffDecode.c -o build/temp.cygwin-1.7.27-i686-2.7/libImaging/TiffDecode.o
313gcc -shared -Wl,--enable-auto-image-base -L/home/Travis/sage/local/lib build/temp.cygwin-1.7.27-i686-2.7/_imaging.o build/temp.cygwin-1.7.27-i686-2.7/decode.o build/temp.cygwin-1.7.27-i686-2.7/encode.o build/temp.cygwin-1.7.27-i686-2.7/map.o build/temp.cygwin-1.7.27-i686-2.7/display.o build/temp.cygwin-1.7.27-i686-2.7/outline.o build/temp.cygwin-1.7.27-i686-2.7/path.o build/temp.cygwin-1.7.27-i686-2.7/libImaging/Access.o build/temp.cygwin-1.7.27-i686-2.7/libImaging/AlphaComposite.o build/temp.cygwin-1.7.27-i686-2.7/libImaging/Antialias.o build/temp.cygwin-1.7.27-i686-2.7/libImaging/Bands.o build/temp.cygwin-1.7.27-i686-2.7/libImaging/BitDecode.o build/temp.cygwin-1.7.27-i686-2.7/libImaging/Blend.o build/temp.cygwin-1.7.27-i686-2.7/libImaging/Chops.o build/temp.cygwin-1.7.27-i686-2.7/libImaging/Convert.o build/temp.cygwin-1.7.27-i686-2.7/libImaging/ConvertYCbCr.o build/temp.cygwin-1.7.27-i686-2.7/libImaging/Copy.o build/temp.cygwin-1.7.27-i686-2.7/libImaging/Crc32.o build/temp.cygwin-1.7.27-i686-2.7/libImaging/Crop.o build/temp.cygwin-1.7.27-i686-2.7/libImaging/Dib.o build/temp.cygwin-1.7.27-i686-2.7/libImaging/Draw.o build/temp.cygwin-1.7.27-i686-2.7/libImaging/Effects.o build/temp.cygwin-1.7.27-i686-2.7/libImaging/EpsEncode.o build/temp.cygwin-1.7.27-i686-2.7/libImaging/File.o build/temp.cygwin-1.7.27-i686-2.7/libImaging/Fill.o build/temp.cygwin-1.7.27-i686-2.7/libImaging/Filter.o build/temp.cygwin-1.7.27-i686-2.7/libImaging/FliDecode.o build/temp.cygwin-1.7.27-i686-2.7/libImaging/Geometry.o build/temp.cygwin-1.7.27-i686-2.7/libImaging/GetBBox.o build/temp.cygwin-1.7.27-i686-2.7/libImaging/GifDecode.o build/temp.cygwin-1.7.27-i686-2.7/libImaging/GifEncode.o build/temp.cygwin-1.7.27-i686-2.7/libImaging/HexDecode.o build/temp.cygwin-1.7.27-i686-2.7/libImaging/Histo.o build/temp.cygwin-1.7.27-i686-2.7/libImaging/JpegDecode.o build/temp.cygwin-1.7.27-i686-2.7/libImaging/JpegEncode.o build/temp.cygwin-1.7.27-i686-2.7/libImaging/LzwDecode.o build/temp.cygwin-1.7.27-i686-2.7/libImaging/Matrix.o build/temp.cygwin-1.7.27-i686-2.7/libImaging/ModeFilter.o build/temp.cygwin-1.7.27-i686-2.7/libImaging/MspDecode.o build/temp.cygwin-1.7.27-i686-2.7/libImaging/Negative.o build/temp.cygwin-1.7.27-i686-2.7/libImaging/Offset.o build/temp.cygwin-1.7.27-i686-2.7/libImaging/Pack.o build/temp.cygwin-1.7.27-i686-2.7/libImaging/PackDecode.o build/temp.cygwin-1.7.27-i686-2.7/libImaging/Palette.o build/temp.cygwin-1.7.27-i686-2.7/libImaging/Paste.o build/temp.cygwin-1.7.27-i686-2.7/libImaging/Quant.o build/temp.cygwin-1.7.27-i686-2.7/libImaging/QuantOctree.o build/temp.cygwin-1.7.27-i686-2.7/libImaging/QuantHash.o build/temp.cygwin-1.7.27-i686-2.7/libImaging/QuantHeap.o build/temp.cygwin-1.7.27-i686-2.7/libImaging/PcdDecode.o build/temp.cygwin-1.7.27-i686-2.7/libImaging/PcxDecode.o build/temp.cygwin-1.7.27-i686-2.7/libImaging/PcxEncode.o build/temp.cygwin-1.7.27-i686-2.7/libImaging/Point.o build/temp.cygwin-1.7.27-i686-2.7/libImaging/RankFilter.o build/temp.cygwin-1.7.27-i686-2.7/libImaging/RawDecode.o build/temp.cygwin-1.7.27-i686-2.7/libImaging/RawEncode.o build/temp.cygwin-1.7.27-i686-2.7/libImaging/Storage.o build/temp.cygwin-1.7.27-i686-2.7/libImaging/SunRleDecode.o build/temp.cygwin-1.7.27-i686-2.7/libImaging/TgaRleDecode.o build/temp.cygwin-1.7.27-i686-2.7/libImaging/Unpack.o build/temp.cygwin-1.7.27-i686-2.7/libImaging/UnpackYCC.o build/temp.cygwin-1.7.27-i686-2.7/libImaging/UnsharpMask.o build/temp.cygwin-1.7.27-i686-2.7/libImaging/XbmDecode.o build/temp.cygwin-1.7.27-i686-2.7/libImaging/XbmEncode.o build/temp.cygwin-1.7.27-i686-2.7/libImaging/ZipDecode.o build/temp.cygwin-1.7.27-i686-2.7/libImaging/ZipEncode.o build/temp.cygwin-1.7.27-i686-2.7/libImaging/TiffDecode.o -L/home/Travis/sage/local/lib -L/usr/lib/python2.7/config -L/usr/local/lib -L/usr/lib -L/home/Travis/sage/local/lib/python2.7/config -lz -lpython2.7 -o build/lib.cygwin-1.7.27-i686-2.7/PIL/_imaging.dll
314building 'PIL._imagingft' extension
315gcc -I/usr/include/ncurses -fno-strict-aliasing -g -O2 -DNDEBUG -g -fwrapv -O3 -Wall -I/home/Travis/sage/local/include/freetype2 -I/home/Travis/sage/local/var/tmp/sage/build/pillow-2.2.2/src/libImaging -I/home/Travis/sage/local/include -I/usr/include -I/home/Travis/sage/local/include/python2.7 -c _imagingft.c -o build/temp.cygwin-1.7.27-i686-2.7/_imagingft.o
316gcc -shared -Wl,--enable-auto-image-base -L/home/Travis/sage/local/lib build/temp.cygwin-1.7.27-i686-2.7/_imagingft.o -L/home/Travis/sage/local/lib -L/usr/lib/python2.7/config -L/usr/local/lib -L/usr/lib -L/home/Travis/sage/local/lib/python2.7/config -lfreetype -lpython2.7 -o build/lib.cygwin-1.7.27-i686-2.7/PIL/_imagingft.dll
317/home/Travis/sage/local/lib/libfreetype.a(sfnt.o): In function `error_callback':
318/home/Travis/sage/local/var/tmp/sage/build/freetype-2.5.2.p0/src/src/sfnt/pngshim.c:125: undefined reference to `png_get_error_ptr'
319/home/Travis/sage/local/lib/libfreetype.a(sfnt.o): In function `Load_SBit_Png':
320/home/Travis/sage/local/var/tmp/sage/build/freetype-2.5.2.p0/src/src/sfnt/pngshim.c:220: undefined reference to `png_create_read_struct'
321/home/Travis/sage/local/var/tmp/sage/build/freetype-2.5.2.p0/src/src/sfnt/pngshim.c:230: undefined reference to `png_create_info_struct'
322/home/Travis/sage/local/var/tmp/sage/build/freetype-2.5.2.p0/src/src/sfnt/pngshim.c:359: undefined reference to `png_destroy_read_struct'
323/home/Travis/sage/local/var/tmp/sage/build/freetype-2.5.2.p0/src/src/sfnt/pngshim.c:244: undefined reference to `png_set_read_fn'
324/home/Travis/sage/local/var/tmp/sage/build/freetype-2.5.2.p0/src/src/sfnt/pngshim.c:246: undefined reference to `png_read_info'
325/home/Travis/sage/local/var/tmp/sage/build/freetype-2.5.2.p0/src/src/sfnt/pngshim.c:247: undefined reference to `png_get_IHDR'
326/home/Travis/sage/local/var/tmp/sage/build/freetype-2.5.2.p0/src/src/sfnt/pngshim.c:281: undefined reference to `png_set_palette_to_rgb'
327/home/Travis/sage/local/var/tmp/sage/build/freetype-2.5.2.p0/src/src/sfnt/pngshim.c:294: undefined reference to `png_get_valid'
328/home/Travis/sage/local/var/tmp/sage/build/freetype-2.5.2.p0/src/src/sfnt/pngshim.c:311: undefined reference to `png_set_filler'
329/home/Travis/sage/local/var/tmp/sage/build/freetype-2.5.2.p0/src/src/sfnt/pngshim.c:314: undefined reference to `png_read_update_info'
330/home/Travis/sage/local/var/tmp/sage/build/freetype-2.5.2.p0/src/src/sfnt/pngshim.c:315: undefined reference to `png_get_IHDR'
331/home/Travis/sage/local/var/tmp/sage/build/freetype-2.5.2.p0/src/src/sfnt/pngshim.c:334: undefined reference to `png_set_read_user_transform_fn'
332/home/Travis/sage/local/var/tmp/sage/build/freetype-2.5.2.p0/src/src/sfnt/pngshim.c:352: undefined reference to `png_read_image'
333/home/Travis/sage/local/var/tmp/sage/build/freetype-2.5.2.p0/src/src/sfnt/pngshim.c:356: undefined reference to `png_read_end'
334/home/Travis/sage/local/var/tmp/sage/build/freetype-2.5.2.p0/src/src/sfnt/pngshim.c:234: undefined reference to `png_destroy_read_struct'
335/home/Travis/sage/local/var/tmp/sage/build/freetype-2.5.2.p0/src/src/sfnt/pngshim.c:295: undefined reference to `png_set_tRNS_to_alpha'
336/home/Travis/sage/local/var/tmp/sage/build/freetype-2.5.2.p0/src/src/sfnt/pngshim.c:287: undefined reference to `png_set_expand_gray_1_2_4_to_8'
337/home/Travis/sage/local/var/tmp/sage/build/freetype-2.5.2.p0/src/src/sfnt/pngshim.c:309: undefined reference to `png_set_interlace_handling'
338/home/Travis/sage/local/var/tmp/sage/build/freetype-2.5.2.p0/src/src/sfnt/pngshim.c:306: undefined reference to `png_set_gray_to_rgb'
339/home/Travis/sage/local/var/tmp/sage/build/freetype-2.5.2.p0/src/src/sfnt/pngshim.c:301: undefined reference to `png_set_packing'
340/home/Travis/sage/local/var/tmp/sage/build/freetype-2.5.2.p0/src/src/sfnt/pngshim.c:298: undefined reference to `png_set_strip_16'
341/home/Travis/sage/local/var/tmp/sage/build/freetype-2.5.2.p0/src/src/sfnt/pngshim.c:339: undefined reference to `png_set_read_user_transform_fn'
342/home/Travis/sage/local/lib/libfreetype.a(sfnt.o): In function `read_data_from_FT_Stream':
343/home/Travis/sage/local/var/tmp/sage/build/freetype-2.5.2.p0/src/src/sfnt/pngshim.c:156: undefined reference to `png_get_io_ptr'
344/home/Travis/sage/local/var/tmp/sage/build/freetype-2.5.2.p0/src/src/sfnt/pngshim.c:162: undefined reference to `png_get_error_ptr'
345/home/Travis/sage/local/var/tmp/sage/build/freetype-2.5.2.p0/src/src/sfnt/pngshim.c:166: undefined reference to `png_error'
346/home/Travis/sage/local/lib/libfreetype.a(ftgzip.o): In function `ft_gzip_file_done':
347/home/Travis/sage/local/var/tmp/sage/build/freetype-2.5.2.p0/src/src/gzip/ftgzip.c:323: undefined reference to `inflateEnd'
348/home/Travis/sage/local/lib/libfreetype.a(ftgzip.o): In function `ft_gzip_file_fill_output':
349/home/Travis/sage/local/var/tmp/sage/build/freetype-2.5.2.p0/src/src/gzip/ftgzip.c:426: undefined reference to `inflate'
350/home/Travis/sage/local/lib/libfreetype.a(ftgzip.o): In function `ft_gzip_file_reset':
351/home/Travis/sage/local/var/tmp/sage/build/freetype-2.5.2.p0/src/src/gzip/ftgzip.c:352: undefined reference to `inflateReset'
352/home/Travis/sage/local/lib/libfreetype.a(ftgzip.o): In function `ft_gzip_file_init':
353/home/Travis/sage/local/var/tmp/sage/build/freetype-2.5.2.p0/src/src/gzip/ftgzip.c:308: undefined reference to `inflateInit2_'
354/home/Travis/sage/local/lib/libfreetype.a(ftgzip.o): In function `ft_gzip_file_done':
355/home/Travis/sage/local/var/tmp/sage/build/freetype-2.5.2.p0/src/src/gzip/ftgzip.c:323: undefined reference to `inflateEnd'
356/home/Travis/sage/local/lib/libfreetype.a(ftgzip.o): In function `FT_Gzip_Uncompress':
357/home/Travis/sage/local/var/tmp/sage/build/freetype-2.5.2.p0/src/src/gzip/ftgzip.c:715: undefined reference to `inflateInit2_'
358/home/Travis/sage/local/var/tmp/sage/build/freetype-2.5.2.p0/src/src/gzip/ftgzip.c:719: undefined reference to `inflate'
359/home/Travis/sage/local/var/tmp/sage/build/freetype-2.5.2.p0/src/src/gzip/ftgzip.c:722: undefined reference to `inflateEnd'
360/home/Travis/sage/local/var/tmp/sage/build/freetype-2.5.2.p0/src/src/gzip/ftgzip.c:730: undefined reference to `inflateEnd'
361/home/Travis/sage/local/lib/libfreetype.a(ftbzip2.o): In function `ft_bzip2_file_done':
362/home/Travis/sage/local/var/tmp/sage/build/freetype-2.5.2.p0/src/src/bzip2/ftbzip2.c:198: undefined reference to `BZ2_bzDecompressEnd'
363/home/Travis/sage/local/lib/libfreetype.a(ftbzip2.o): In function `ft_bzip2_file_fill_output':
364/home/Travis/sage/local/var/tmp/sage/build/freetype-2.5.2.p0/src/src/bzip2/ftbzip2.c:303: undefined reference to `BZ2_bzDecompress'
365/home/Travis/sage/local/lib/libfreetype.a(ftbzip2.o): In function `ft_bzip2_file_reset':
366/home/Travis/sage/local/var/tmp/sage/build/freetype-2.5.2.p0/src/src/bzip2/ftbzip2.c:227: undefined reference to `BZ2_bzDecompressEnd'
367/home/Travis/sage/local/var/tmp/sage/build/freetype-2.5.2.p0/src/src/bzip2/ftbzip2.c:238: undefined reference to `BZ2_bzDecompressInit'
368/home/Travis/sage/local/lib/libfreetype.a(ftbzip2.o): In function `ft_bzip2_file_init':
369/home/Travis/sage/local/var/tmp/sage/build/freetype-2.5.2.p0/src/src/bzip2/ftbzip2.c:183: undefined reference to `BZ2_bzDecompressInit'
370collect2: error: ld returned 1 exit status
371error: command 'gcc' failed with exit status 1
372Error building / installing Pillow
373
374real    0m56.683s
375user    0m25.091s
376sys     0m13.858s
377************************************************************************
378Error installing package pillow-2.2.2
379************************************************************************
380Please email sage-devel (http://groups.google.com/group/sage-devel)
381explaining the problem and including the relevant part of the log file
382  /home/Travis/sage/logs/pkgs/pillow-2.2.2.log
383Describe your computer, operating system, etc.
384If you want to try to fix the problem yourself, *don't* just cd to
385/home/Travis/sage/local/var/tmp/sage/build/pillow-2.2.2 and type 'make' or whatever is appropriate.
386Instead, the following commands setup all environment variables
387correctly and load a subshell for you to debug the error:
388  (cd '/home/Travis/sage/local/var/tmp/sage/build/pillow-2.2.2' && '/home/Travis/sage/sage' --sh)
389When you are done debugging, you can type "exit" to leave the subshell.
390************************************************************************
391Makefile:842: recipe for target '/home/Travis/sage/local/var/lib/sage/installed/pillow-2.2.2' failed
392make[2]: *** [/home/Travis/sage/local/var/lib/sage/installed/pillow-2.2.2] Error 1
393make[2]: Leaving directory '/home/Travis/sage/build'
394Makefile:375: recipe for target 'all' failed
395make[1]: *** [all] Error 2
396make[1]: Leaving directory '/home/Travis/sage/build'
397
398real    1m7.740s
399user    0m26.236s
400sys     0m16.772s
401***************************************************************
402Error building Sage.
403
404The following package(s) may have failed to build:
405
406package: pillow-2.2.2
407log file: /home/Travis/sage/logs/pkgs/pillow-2.2.2.log
408build directory: /home/Travis/sage/local/var/tmp/sage/build/pillow-2.2.2
409
410The build directory may contain configuration files and other potentially
411helpful information. WARNING: if you now run 'make' again, the build
412directory will, by default, be deleted. Set the environment variable
413SAGE_KEEP_BUILT_SPKGS to 'yes' to prevent this.
414
415Makefile:18: recipe for target 'build' failed