Ticket #15273: config.log

File config.log, 37.7 KB (added by drkirkby, 8 years ago)

config.log of source downloaded from gf2x web site, so has no sage-specific mods

Line 
1This file contains any messages produced by compilers while
2running configure, to aid debugging if configure makes a mistake.
3
4It was created by gf2x configure 1.1, which was
5generated by GNU Autoconf 2.68.  Invocation command line was
6
7  $ ./configure
8
9## --------- ##
10## Platform. ##
11## --------- ##
12
13hostname = hawk
14uname -m = i86pc
15uname -r = 5.11
16uname -s = SunOS
17uname -v = snv_134
18
19/usr/bin/uname -p = i386
20/bin/uname -X     = System = SunOS
21Node = hawk
22Release = 5.11
23KernelID = snv_134
24Machine = i86pc
25BusType = <unknown>
26Serial = <unknown>
27Users = <unknown>
28OEM# = 0
29Origin# = 1
30NumCPU = 8
31
32/bin/arch              = i86pc
33/usr/bin/arch -k       = i86pc
34/usr/convex/getsysinfo = unknown
35/usr/bin/hostinfo      = unknown
36/bin/machine           = unknown
37/usr/bin/oslevel       = unknown
38/bin/universe          = unknown
39
40PATH: /usr/local/bins-for-sage
41PATH: /usr/local/gcc-4.6.0-delayed/bin
42PATH: /usr/local/bin
43PATH: /usr/local/texlive/2010/bin/i386-solaris/
44PATH: /usr/bin
45PATH: /usr/sbin
46
47
48## ----------- ##
49## Core tests. ##
50## ----------- ##
51
52configure:2461: checking build system type
53configure:2475: result: i386-pc-solaris2.11
54configure:2495: checking host system type
55configure:2508: result: i386-pc-solaris2.11
56configure:2528: checking target system type
57configure:2541: result: i386-pc-solaris2.11
58configure:2594: checking for a BSD-compatible install
59configure:2662: result: /usr/bin/ginstall -c
60configure:2673: checking whether build environment is sane
61configure:2723: result: yes
62configure:2864: checking for a thread-safe mkdir -p
63configure:2903: result: config/install-sh -c -d
64configure:2916: checking for gawk
65configure:2932: found /usr/bin/gawk
66configure:2943: result: gawk
67configure:2954: checking whether make -j12 sets $(MAKE)
68configure:2976: result: yes
69configure:3103: checking how to print strings
70configure:3132: result: print -r
71configure:3163: checking for style of include used by make -j12
72configure:3191: result: GNU
73configure:3261: checking for gcc
74configure:3277: found /usr/local/gcc-4.6.0-delayed/bin/gcc
75configure:3288: result: gcc
76configure:3517: checking for C compiler version
77configure:3526: gcc --version >&5
78gcc (GCC) 4.6.0
79Copyright (C) 2011 Free Software Foundation, Inc.
80This is free software; see the source for copying conditions.  There is NO
81warranty; not even for MERCHANTABILITY or FITNESS FOR A PARTICULAR PURPOSE.
82
83configure:3537: $? = 0
84configure:3526: gcc -v >&5
85Using built-in specs.
86COLLECT_GCC=/usr/local/gcc-4.6.0/bin/gcc
87COLLECT_LTO_WRAPPER=/usr/local/gcc-4.6.0/libexec/gcc/i386-pc-solaris2.11/4.6.0/lto-wrapper
88Target: i386-pc-solaris2.11
89Configured with: ../gcc-4.6.0/configure --prefix=/usr/local/gcc-4.6.0 --with-gmp=/usr/local/gcc-4.6.0 --with-mpfr=/usr/local/gcc-4.6.0 --with-mpc=/usr/local/gcc-4.6.0 --enable-languages=c,c++,fortran --with-gnu-as --with-as=/usr/local/binutils-2.20/bin/as --without-gnu-ld --with-ld=/usr/ccs/bin/ld
90Thread model: posix
91gcc version 4.6.0 (GCC)
92configure:3537: $? = 0
93configure:3526: gcc -V >&5
94gcc: error: unrecognized option '-V'
95gcc: fatal error: no input files
96compilation terminated.
97configure:3537: $? = 1
98configure:3526: gcc -qversion >&5
99gcc: error: unrecognized option '-qversion'
100gcc: fatal error: no input files
101compilation terminated.
102configure:3537: $? = 1
103configure:3557: checking whether the C compiler works
104configure:3579: gcc -g -O4   conftest.c  >&5
105configure:3583: $? = 0
106configure:3631: result: yes
107configure:3634: checking for C compiler default output file name
108configure:3636: result: a.out
109configure:3642: checking for suffix of executables
110configure:3649: gcc -o conftest -g -O4   conftest.c  >&5
111configure:3653: $? = 0
112configure:3675: result:
113configure:3697: checking whether we are cross compiling
114configure:3705: gcc -o conftest -g -O4   conftest.c  >&5
115configure:3709: $? = 0
116configure:3716: ./conftest
117configure:3720: $? = 0
118configure:3735: result: no
119configure:3740: checking for suffix of object files
120configure:3762: gcc -c -g -O4  conftest.c >&5
121configure:3766: $? = 0
122configure:3787: result: o
123configure:3791: checking whether we are using the GNU C compiler
124configure:3810: gcc -c -g -O4  conftest.c >&5
125configure:3810: $? = 0
126configure:3819: result: yes
127configure:3828: checking whether gcc accepts -g
128configure:3848: gcc -c -g  conftest.c >&5
129configure:3848: $? = 0
130configure:3889: result: yes
131configure:3906: checking for gcc option to accept ISO C89
132configure:3970: gcc  -c -g -O4  conftest.c >&5
133configure:3970: $? = 0
134configure:3983: result: none needed
135configure:4005: checking dependency style of gcc
136configure:4115: result: gcc3
137configure:4130: checking for a sed that does not truncate output
138configure:4194: result: /usr/bin/gsed
139configure:4212: checking for grep that handles long lines and -e
140configure:4270: result: /usr/bin/ggrep
141configure:4275: checking for egrep
142configure:4337: result: /usr/bin/ggrep -E
143configure:4342: checking for fgrep
144configure:4404: result: /usr/bin/ggrep -F
145configure:4439: checking for ld used by gcc
146configure:4506: result: /usr/ccs/bin/ld
147configure:4513: checking if the linker (/usr/ccs/bin/ld) is GNU ld
148configure:4528: result: no
149configure:4540: checking for BSD- or MS-compatible name lister (nm)
150configure:4589: result: /usr/bin/nm -p
151configure:4719: checking the name lister (/usr/bin/nm -p) interface
152configure:4726: gcc -c -g -O4  conftest.c >&5
153configure:4729: /usr/bin/nm -p "conftest.o"
154configure:4732: output
155
156
157conftest.o:
1580000000000 s
1590000000000 s
1600000000000 s
1610000000000 b
1620000000000 s
1630000000000 s
1640000000000 s
1650000000000 s
1660000000000 f conftest.c
1670000000000 B some_variable
168configure:4739: result: BSD nm
169configure:4742: checking whether ln -s works
170configure:4746: result: yes
171configure:4754: checking the maximum length of command line arguments
172configure:4879: result: 786240
173configure:4896: checking whether the shell understands some XSI constructs
174configure:4906: result: yes
175configure:4910: checking whether the shell understands "+="
176configure:4916: result: yes
177configure:4951: checking how to convert i386-pc-solaris2.11 file names to i386-pc-solaris2.11 format
178configure:4991: result: func_convert_file_noop
179configure:4998: checking how to convert i386-pc-solaris2.11 file names to toolchain format
180configure:5018: result: func_convert_file_noop
181configure:5025: checking for /usr/ccs/bin/ld option to reload object files
182configure:5032: result: -r
183configure:5106: checking for objdump
184configure:5136: result: no
185configure:5165: checking how to recognize dependent libraries
186configure:5367: result: pass_all
187configure:5452: checking for dlltool
188configure:5482: result: no
189configure:5512: checking how to associate runtime and link libraries
190configure:5539: result: print -r --
191configure:5600: checking for ar
192configure:5616: found /usr/bin/ar
193configure:5627: result: ar
194configure:5664: checking for archiver @FILE support
195configure:5681: gcc -c -g -O4  conftest.c >&5
196configure:5681: $? = 0
197configure:5684: ar cru libconftest.a @conftest.lst >&5
198ar: cannot open @conftest.lst
199        No such file or directory
200ar: @conftest.lst not found
201configure:5687: $? = 1
202configure:5707: result: no
203configure:5765: checking for strip
204configure:5781: found /usr/bin/strip
205configure:5792: result: strip
206configure:5864: checking for ranlib
207configure:5880: found /usr/bin/ranlib
208configure:5891: result: ranlib
209configure:5993: checking command to parse /usr/bin/nm -p output from gcc object
210configure:6112: gcc -c -g -O4  conftest.c >&5
211configure:6115: $? = 0
212configure:6119: /usr/bin/nm -p conftest.o \| sed -n -e 's/^.*[ ]\([BDRT][BDRT]*\)[ ][ ]*\([_A-Za-z][_A-Za-z0-9]*\)$/\1 \2 \2/p' | sed '/ __gnu_lto/d' \> conftest.nm
213configure:6122: $? = 0
214configure:6188: gcc -o conftest -g -O4   conftest.c conftstm.o >&5
215configure:6191: $? = 0
216configure:6229: result: ok
217configure:6266: checking for sysroot
218configure:6296: result: no
219configure:6539: checking for mt
220configure:6555: found /usr/bin/mt
221configure:6566: result: mt
222configure:6589: checking if mt is a manifest tool
223configure:6595: mt '-?'
224mt: unknown command: -?
225configure:6603: result: no
226configure:7235: checking how to run the C preprocessor
227configure:7266: gcc -E  conftest.c
228configure:7266: $? = 0
229configure:7280: gcc -E  conftest.c
230conftest.c:11:28: fatal error: ac_nonexistent.h: No such file or directory
231compilation terminated.
232configure:7280: $? = 1
233configure: failed program was:
234| /* confdefs.h */
235| #define PACKAGE_NAME "gf2x"
236| #define PACKAGE_TARNAME "gf2x"
237| #define PACKAGE_VERSION "1.1"
238| #define PACKAGE_STRING "gf2x 1.1"
239| #define PACKAGE_BUGREPORT ""
240| #define PACKAGE_URL ""
241| #define PACKAGE "gf2x"
242| #define VERSION "1.1"
243| /* end confdefs.h.  */
244| #include <ac_nonexistent.h>
245configure:7305: result: gcc -E
246configure:7325: gcc -E  conftest.c
247configure:7325: $? = 0
248configure:7339: gcc -E  conftest.c
249conftest.c:11:28: fatal error: ac_nonexistent.h: No such file or directory
250compilation terminated.
251configure:7339: $? = 1
252configure: failed program was:
253| /* confdefs.h */
254| #define PACKAGE_NAME "gf2x"
255| #define PACKAGE_TARNAME "gf2x"
256| #define PACKAGE_VERSION "1.1"
257| #define PACKAGE_STRING "gf2x 1.1"
258| #define PACKAGE_BUGREPORT ""
259| #define PACKAGE_URL ""
260| #define PACKAGE "gf2x"
261| #define VERSION "1.1"
262| /* end confdefs.h.  */
263| #include <ac_nonexistent.h>
264configure:7368: checking for ANSI C header files
265configure:7388: gcc -c -g -O4  conftest.c >&5
266configure:7388: $? = 0
267configure:7461: gcc -o conftest -g -O4   conftest.c  >&5
268configure:7461: $? = 0
269configure:7461: ./conftest
270configure:7461: $? = 0
271configure:7472: result: yes
272configure:7485: checking for sys/types.h
273configure:7485: gcc -c -g -O4  conftest.c >&5
274configure:7485: $? = 0
275configure:7485: result: yes
276configure:7485: checking for sys/stat.h
277configure:7485: gcc -c -g -O4  conftest.c >&5
278configure:7485: $? = 0
279configure:7485: result: yes
280configure:7485: checking for stdlib.h
281configure:7485: gcc -c -g -O4  conftest.c >&5
282configure:7485: $? = 0
283configure:7485: result: yes
284configure:7485: checking for string.h
285configure:7485: gcc -c -g -O4  conftest.c >&5
286configure:7485: $? = 0
287configure:7485: result: yes
288configure:7485: checking for memory.h
289configure:7485: gcc -c -g -O4  conftest.c >&5
290configure:7485: $? = 0
291configure:7485: result: yes
292configure:7485: checking for strings.h
293configure:7485: gcc -c -g -O4  conftest.c >&5
294configure:7485: $? = 0
295configure:7485: result: yes
296configure:7485: checking for inttypes.h
297configure:7485: gcc -c -g -O4  conftest.c >&5
298configure:7485: $? = 0
299configure:7485: result: yes
300configure:7485: checking for stdint.h
301configure:7485: gcc -c -g -O4  conftest.c >&5
302configure:7485: $? = 0
303configure:7485: result: yes
304configure:7485: checking for unistd.h
305configure:7485: gcc -c -g -O4  conftest.c >&5
306configure:7485: $? = 0
307configure:7485: result: yes
308configure:7499: checking for dlfcn.h
309configure:7499: gcc -c -g -O4  conftest.c >&5
310configure:7499: $? = 0
311configure:7499: result: yes
312configure:7686: checking for objdir
313configure:7701: result: .libs
314configure:7972: checking if gcc supports -fno-rtti -fno-exceptions
315configure:7990: gcc -c -g -O4  -fno-rtti -fno-exceptions conftest.c >&5
316cc1: warning: command line option '-fno-rtti' is valid for C++/ObjC++ but not for C [enabled by default]
317configure:7994: $? = 0
318configure:8007: result: no
319configure:8317: checking for gcc option to produce PIC
320configure:8324: result: -fPIC -DPIC
321configure:8332: checking if gcc PIC flag -fPIC -DPIC works
322configure:8350: gcc -c -g -O4  -fPIC -DPIC -DPIC conftest.c >&5
323configure:8354: $? = 0
324configure:8367: result: yes
325configure:8396: checking if gcc static flag -static works
326configure:8424: result: no
327configure:8439: checking if gcc supports -c -o file.o
328configure:8460: gcc -c -g -O4  -o out/conftest2.o conftest.c >&5
329configure:8464: $? = 0
330configure:8486: result: yes
331configure:8494: checking if gcc supports -c -o file.o
332configure:8541: result: yes
333configure:8574: checking whether the gcc linker (/usr/ccs/bin/ld) supports shared libraries
334configure:9736: result: yes
335configure:9773: checking whether -lc should be explicitly linked in
336configure:9781: gcc -c -g -O4  conftest.c >&5
337configure:9784: $? = 0
338configure:9799: gcc -shared  -fPIC -DPIC -Wl,-z -Wl,text -Wl,-h -Wl,conftest -o conftest conftest.o  -v 2\>\&1 \| /usr/bin/ggrep  -lc  \>/dev/null 2\>\&1
339configure:9802: $? = 0
340configure:9816: result: no
341configure:9981: checking dynamic linker characteristics
342configure:10730: result: solaris2.11 ld.so
343configure:10837: checking how to hardcode library paths into programs
344configure:10862: result: immediate
345configure:11402: checking whether stripping libraries is possible
346configure:11424: result: no
347configure:11442: checking if libtool supports shared libraries
348configure:11444: result: yes
349configure:11447: checking whether to build shared libraries
350configure:11468: result: yes
351configure:11471: checking whether to build static libraries
352configure:11475: result: yes
353configure:11585: checking for gcc
354configure:11612: result: gcc
355configure:11841: checking for C compiler version
356configure:11850: gcc --version >&5
357gcc (GCC) 4.6.0
358Copyright (C) 2011 Free Software Foundation, Inc.
359This is free software; see the source for copying conditions.  There is NO
360warranty; not even for MERCHANTABILITY or FITNESS FOR A PARTICULAR PURPOSE.
361
362configure:11861: $? = 0
363configure:11850: gcc -v >&5
364Using built-in specs.
365COLLECT_GCC=/usr/local/gcc-4.6.0/bin/gcc
366COLLECT_LTO_WRAPPER=/usr/local/gcc-4.6.0/libexec/gcc/i386-pc-solaris2.11/4.6.0/lto-wrapper
367Target: i386-pc-solaris2.11
368Configured with: ../gcc-4.6.0/configure --prefix=/usr/local/gcc-4.6.0 --with-gmp=/usr/local/gcc-4.6.0 --with-mpfr=/usr/local/gcc-4.6.0 --with-mpc=/usr/local/gcc-4.6.0 --enable-languages=c,c++,fortran --with-gnu-as --with-as=/usr/local/binutils-2.20/bin/as --without-gnu-ld --with-ld=/usr/ccs/bin/ld
369Thread model: posix
370gcc version 4.6.0 (GCC)
371configure:11861: $? = 0
372configure:11850: gcc -V >&5
373gcc: error: unrecognized option '-V'
374gcc: fatal error: no input files
375compilation terminated.
376configure:11861: $? = 1
377configure:11850: gcc -qversion >&5
378gcc: error: unrecognized option '-qversion'
379gcc: fatal error: no input files
380compilation terminated.
381configure:11861: $? = 1
382configure:11865: checking whether we are using the GNU C compiler
383configure:11893: result: yes
384configure:11902: checking whether gcc accepts -g
385configure:11963: result: yes
386configure:11980: checking for gcc option to accept ISO C89
387configure:12057: result: none needed
388configure:12079: checking dependency style of gcc
389configure:12189: result: gcc3
390configure:12262: checking for g++
391configure:12278: found /usr/local/gcc-4.6.0-delayed/bin/g++
392configure:12289: result: g++
393configure:12316: checking for C++ compiler version
394configure:12325: g++ --version >&5
395g++ (GCC) 4.6.0
396Copyright (C) 2011 Free Software Foundation, Inc.
397This is free software; see the source for copying conditions.  There is NO
398warranty; not even for MERCHANTABILITY or FITNESS FOR A PARTICULAR PURPOSE.
399
400configure:12336: $? = 0
401configure:12325: g++ -v >&5
402Using built-in specs.
403COLLECT_GCC=/usr/local/gcc-4.6.0/bin/g++
404COLLECT_LTO_WRAPPER=/usr/local/gcc-4.6.0/libexec/gcc/i386-pc-solaris2.11/4.6.0/lto-wrapper
405Target: i386-pc-solaris2.11
406Configured with: ../gcc-4.6.0/configure --prefix=/usr/local/gcc-4.6.0 --with-gmp=/usr/local/gcc-4.6.0 --with-mpfr=/usr/local/gcc-4.6.0 --with-mpc=/usr/local/gcc-4.6.0 --enable-languages=c,c++,fortran --with-gnu-as --with-as=/usr/local/binutils-2.20/bin/as --without-gnu-ld --with-ld=/usr/ccs/bin/ld
407Thread model: posix
408gcc version 4.6.0 (GCC)
409configure:12336: $? = 0
410configure:12325: g++ -V >&5
411g++: error: unrecognized option '-V'
412g++: fatal error: no input files
413compilation terminated.
414configure:12336: $? = 1
415configure:12325: g++ -qversion >&5
416g++: error: unrecognized option '-qversion'
417g++: fatal error: no input files
418compilation terminated.
419configure:12336: $? = 1
420configure:12340: checking whether we are using the GNU C++ compiler
421configure:12359: g++ -c   conftest.cpp >&5
422configure:12359: $? = 0
423configure:12368: result: yes
424configure:12377: checking whether g++ accepts -g
425configure:12397: g++ -c -g  conftest.cpp >&5
426configure:12397: $? = 0
427configure:12438: result: yes
428configure:12463: checking dependency style of g++
429configure:12573: result: gcc3
430configure:12606: checking how to run the C++ preprocessor
431configure:12633: g++ -E  conftest.cpp
432configure:12633: $? = 0
433configure:12647: g++ -E  conftest.cpp
434conftest.cpp:23:28: fatal error: ac_nonexistent.h: No such file or directory
435compilation terminated.
436configure:12647: $? = 1
437configure: failed program was:
438| /* confdefs.h */
439| #define PACKAGE_NAME "gf2x"
440| #define PACKAGE_TARNAME "gf2x"
441| #define PACKAGE_VERSION "1.1"
442| #define PACKAGE_STRING "gf2x 1.1"
443| #define PACKAGE_BUGREPORT ""
444| #define PACKAGE_URL ""
445| #define PACKAGE "gf2x"
446| #define VERSION "1.1"
447| #define STDC_HEADERS 1
448| #define HAVE_SYS_TYPES_H 1
449| #define HAVE_SYS_STAT_H 1
450| #define HAVE_STDLIB_H 1
451| #define HAVE_STRING_H 1
452| #define HAVE_MEMORY_H 1
453| #define HAVE_STRINGS_H 1
454| #define HAVE_INTTYPES_H 1
455| #define HAVE_STDINT_H 1
456| #define HAVE_UNISTD_H 1
457| #define HAVE_DLFCN_H 1
458| #define LT_OBJDIR ".libs/"
459| /* end confdefs.h.  */
460| #include <ac_nonexistent.h>
461configure:12672: result: g++ -E
462configure:12692: g++ -E  conftest.cpp
463configure:12692: $? = 0
464configure:12706: g++ -E  conftest.cpp
465conftest.cpp:23:28: fatal error: ac_nonexistent.h: No such file or directory
466compilation terminated.
467configure:12706: $? = 1
468configure: failed program was:
469| /* confdefs.h */
470| #define PACKAGE_NAME "gf2x"
471| #define PACKAGE_TARNAME "gf2x"
472| #define PACKAGE_VERSION "1.1"
473| #define PACKAGE_STRING "gf2x 1.1"
474| #define PACKAGE_BUGREPORT ""
475| #define PACKAGE_URL ""
476| #define PACKAGE "gf2x"
477| #define VERSION "1.1"
478| #define STDC_HEADERS 1
479| #define HAVE_SYS_TYPES_H 1
480| #define HAVE_SYS_STAT_H 1
481| #define HAVE_STDLIB_H 1
482| #define HAVE_STRING_H 1
483| #define HAVE_MEMORY_H 1
484| #define HAVE_STRINGS_H 1
485| #define HAVE_INTTYPES_H 1
486| #define HAVE_STDINT_H 1
487| #define HAVE_UNISTD_H 1
488| #define HAVE_DLFCN_H 1
489| #define LT_OBJDIR ".libs/"
490| /* end confdefs.h.  */
491| #include <ac_nonexistent.h>
492configure:12876: checking for ld used by g++
493configure:12943: result: /usr/ccs/bin/ld
494configure:12950: checking if the linker (/usr/ccs/bin/ld) is GNU ld
495configure:12965: result: no
496configure:13020: checking whether the g++ linker (/usr/ccs/bin/ld) supports shared libraries
497configure:14024: result: yes
498configure:14059: g++ -c -g -O2  conftest.cpp >&5
499configure:14062: $? = 0
500configure:14582: checking for g++ option to produce PIC
501configure:14589: result: -fPIC -DPIC
502configure:14597: checking if g++ PIC flag -fPIC -DPIC works
503configure:14615: g++ -c -g -O2  -fPIC -DPIC -DPIC conftest.cpp >&5
504configure:14619: $? = 0
505configure:14632: result: yes
506configure:14655: checking if g++ static flag -static works
507configure:14683: result: no
508configure:14695: checking if g++ supports -c -o file.o
509configure:14716: g++ -c -g -O2  -o out/conftest2.o conftest.cpp >&5
510configure:14720: $? = 0
511configure:14742: result: yes
512configure:14747: checking if g++ supports -c -o file.o
513configure:14794: result: yes
514configure:14824: checking whether the g++ linker (/usr/ccs/bin/ld) supports shared libraries
515configure:14861: result: yes
516configure:15004: checking dynamic linker characteristics
517configure:15687: result: solaris2.11 ld.so
518configure:15740: checking how to hardcode library paths into programs
519configure:15765: result: immediate
520configure:15806: checking warning verbosity option
521configure:15844: result: -Wall -W for C++ -Wall -W for C
522configure:15849: checking for gcc option to accept ISO C99
523configure:15998: gcc  -c -g -O4 -Wall -W  conftest.c >&5
524conftest.c:73:29: error: expected ';', ',' or ')' before 'text'
525conftest.c: In function 'test_varargs':
526conftest.c:94:9: warning: variable 'fnumber' set but not used [-Wunused-but-set-variable]
527conftest.c:93:7: warning: variable 'number' set but not used [-Wunused-but-set-variable]
528conftest.c:92:15: warning: variable 'str' set but not used [-Wunused-but-set-variable]
529conftest.c: In function 'main':
530conftest.c:125:3: warning: implicit declaration of function 'test_restrict' [-Wimplicit-function-declaration]
531conftest.c:127:18: error: expected '=', ',', ';', 'asm' or '__attribute__' before 'newvar'
532conftest.c:127:18: error: 'newvar' undeclared (first use in this function)
533conftest.c:127:18: note: each undeclared identifier is reported only once for each function it appears in
534conftest.c:137:3: error: 'for' loop initial declarations are only allowed in C99 mode
535conftest.c:137:3: note: use option -std=c99 or -std=gnu99 to compile your code
536configure:15998: $? = 1
537configure: failed program was:
538| /* confdefs.h */
539| #define PACKAGE_NAME "gf2x"
540| #define PACKAGE_TARNAME "gf2x"
541| #define PACKAGE_VERSION "1.1"
542| #define PACKAGE_STRING "gf2x 1.1"
543| #define PACKAGE_BUGREPORT ""
544| #define PACKAGE_URL ""
545| #define PACKAGE "gf2x"
546| #define VERSION "1.1"
547| #define STDC_HEADERS 1
548| #define HAVE_SYS_TYPES_H 1
549| #define HAVE_SYS_STAT_H 1
550| #define HAVE_STDLIB_H 1
551| #define HAVE_STRING_H 1
552| #define HAVE_MEMORY_H 1
553| #define HAVE_STRINGS_H 1
554| #define HAVE_INTTYPES_H 1
555| #define HAVE_STDINT_H 1
556| #define HAVE_UNISTD_H 1
557| #define HAVE_DLFCN_H 1
558| #define LT_OBJDIR ".libs/"
559| /* end confdefs.h.  */
560| #include <stdarg.h>
561| #include <stdbool.h>
562| #include <stdlib.h>
563| #include <wchar.h>
564| #include <stdio.h>
565|
566| // Check varargs macros.  These examples are taken from C99 6.10.3.5.
567| #define debug(...) fprintf (stderr, __VA_ARGS__)
568| #define showlist(...) puts (#__VA_ARGS__)
569| #define report(test,...) ((test) ? puts (#test) : printf (__VA_ARGS__))
570| static void
571| test_varargs_macros (void)
572| {
573|   int x = 1234;
574|   int y = 5678;
575|   debug ("Flag");
576|   debug ("X = %d\n", x);
577|   showlist (The first, second, and third items.);
578|   report (x>y, "x is %d but y is %d", x, y);
579| }
580|
581| // Check long long types.
582| #define BIG64 18446744073709551615ull
583| #define BIG32 4294967295ul
584| #define BIG_OK (BIG64 / BIG32 == 4294967297ull && BIG64 % BIG32 == 0)
585| #if !BIG_OK
586|   your preprocessor is broken;
587| #endif
588| #if BIG_OK
589| #else
590|   your preprocessor is broken;
591| #endif
592| static long long int bignum = -9223372036854775807LL;
593| static unsigned long long int ubignum = BIG64;
594|
595| struct incomplete_array
596| {
597|   int datasize;
598|   double data[];
599| };
600|
601| struct named_init {
602|   int number;
603|   const wchar_t *name;
604|   double average;
605| };
606|
607| typedef const char *ccp;
608|
609| static inline int
610| test_restrict (ccp restrict text)
611| {
612|   // See if C++-style comments work.
613|   // Iterate through items via the restricted pointer.
614|   // Also check for declarations in for loops.
615|   for (unsigned int i = 0; *(text+i) != '\0'; ++i)
616|     continue;
617|   return 0;
618| }
619|
620| // Check varargs and va_copy.
621| static void
622| test_varargs (const char *format, ...)
623| {
624|   va_list args;
625|   va_start (args, format);
626|   va_list args_copy;
627|   va_copy (args_copy, args);
628|
629|   const char *str;
630|   int number;
631|   float fnumber;
632|
633|   while (*format)
634|     {
635|       switch (*format++)
636|       {
637|       case 's': // string
638|         str = va_arg (args_copy, const char *);
639|         break;
640|       case 'd': // int
641|         number = va_arg (args_copy, int);
642|         break;
643|       case 'f': // float
644|         fnumber = va_arg (args_copy, double);
645|         break;
646|       default:
647|         break;
648|       }
649|     }
650|   va_end (args_copy);
651|   va_end (args);
652| }
653|
654| int
655| main ()
656| {
657|
658|   // Check bool.
659|   _Bool success = false;
660|
661|   // Check restrict.
662|   if (test_restrict ("String literal") == 0)
663|     success = true;
664|   char *restrict newvar = "Another string";
665|
666|   // Check varargs.
667|   test_varargs ("s, d' f .", "string", 65, 34.234);
668|   test_varargs_macros ();
669|
670|   // Check flexible array members.
671|   struct incomplete_array *ia =
672|     malloc (sizeof (struct incomplete_array) + (sizeof (double) * 10));
673|   ia->datasize = 10;
674|   for (int i = 0; i < ia->datasize; ++i)
675|     ia->data[i] = i * 1.234;
676|
677|   // Check named initializers.
678|   struct named_init ni = {
679|     .number = 34,
680|     .name = L"Test wide string",
681|     .average = 543.34343,
682|   };
683|
684|   ni.number = 58;
685|
686|   int dynamic_array[ni.number];
687|   dynamic_array[ni.number - 1] = 543;
688|
689|   // work around unused variable warnings
690|   return (!success || bignum == 0LL || ubignum == 0uLL || newvar[0] == 'x'
691|         || dynamic_array[ni.number - 1] != 543);
692|
693|   ;
694|   return 0;
695| }
696configure:15998: gcc -std=gnu99 -c -g -O4 -Wall -W  conftest.c >&5
697conftest.c: In function 'test_varargs':
698conftest.c:94:9: warning: variable 'fnumber' set but not used [-Wunused-but-set-variable]
699conftest.c:93:7: warning: variable 'number' set but not used [-Wunused-but-set-variable]
700conftest.c:92:15: warning: variable 'str' set but not used [-Wunused-but-set-variable]
701configure:15998: $? = 0
702configure:16018: result: -std=gnu99
703configure:16094: checking build system compiler gcc -std=gnu99
704configure:16107: gcc -std=gnu99 conftest.c
705conftest.c: In function 'main':
706conftest.c:4:3: warning: implicit declaration of function 'exit' [-Wimplicit-function-declaration]
707conftest.c:4:3: warning: incompatible implicit declaration of built-in function 'exit' [enabled by default]
708configure:16110: $? = 0
709configure:16117: result: yes
710configure:16136: checking for build system executable suffix
711configure:16150: gcc -std=gnu99 conftest.c -o conftest.exe
712conftest.c: In function 'main':
713conftest.c:4:3: warning: implicit declaration of function 'exit' [-Wimplicit-function-declaration]
714conftest.c:4:3: warning: incompatible implicit declaration of built-in function 'exit' [enabled by default]
715configure:16153: $? = 0
716./configure[16155]: ./conftest: not found [No such file or directory]
717configure:16150: gcc -std=gnu99 conftest.c -o conftest,ff8
718conftest.c: In function 'main':
719conftest.c:4:3: warning: implicit declaration of function 'exit' [-Wimplicit-function-declaration]
720conftest.c:4:3: warning: incompatible implicit declaration of built-in function 'exit' [enabled by default]
721configure:16153: $? = 0
722./configure[16155]: ./conftest: not found [No such file or directory]
723configure:16150: gcc -std=gnu99 conftest.c -o conftest
724conftest.c: In function 'main':
725conftest.c:4:3: warning: implicit declaration of function 'exit' [-Wimplicit-function-declaration]
726conftest.c:4:3: warning: incompatible implicit declaration of built-in function 'exit' [enabled by default]
727configure:16153: $? = 0
728configure:16167: result:
729configure:16175: checking whether gcc -std=gnu99 and cc understand -c and -o together
730configure:16206: gcc -std=gnu99 -c conftest.c -o conftest2.o >&5
731configure:16210: $? = 0
732configure:16216: gcc -std=gnu99 -c conftest.c -o conftest2.o >&5
733configure:16220: $? = 0
734configure:16231: cc -c conftest.c >&5
735configure:16235: $? = 0
736configure:16243: cc -c conftest.c -o conftest2.o >&5
737configure:16247: $? = 0
738configure:16253: cc -c conftest.c -o conftest2.o >&5
739configure:16257: $? = 0
740configure:16275: result: yes
741configure:16306: checking size of unsigned long
742configure:16311: gcc -std=gnu99 -o conftest -g -O4 -Wall -W   conftest.c  >&5
743configure:16311: $? = 0
744configure:16311: ./conftest
745configure:16311: $? = 0
746configure:16325: result: 4
747configure:16342: checking whether gcc -std=gnu99 can compile and run sse-2 code
748configure:16366: gcc -std=gnu99 -o conftest -g -O4 -Wall -W   conftest.c  >&5
749configure:16366: $? = 0
750configure:16366: ./conftest
751configure:16366: $? = 0
752configure:16409: result: yes
753configure:16478: checking whether gcc -std=gnu99 can compile pclmulqdq and if it is supported by the hardware
754configure:16511: gcc -std=gnu99 -o conftest -g -O4 -Wall -W   conftest.c  >&5
755In file included from conftest.c:26:0:
756/usr/local/gcc-4.6.0/lib/gcc/i386-pc-solaris2.11/4.6.0/include/wmmintrin.h:34:3: error: #error "AES/PCLMUL instructions not enabled"
757conftest.c: In function 'main':
758conftest.c:35:1: warning: implicit declaration of function '_mm_clmulepi64_si128' [-Wimplicit-function-declaration]
759conftest.c:35:6: error: incompatible types when assigning to type '__v2di' from type 'int'
760configure:16511: $? = 1
761configure: program exited with status 1
762configure: failed program was:
763| /* confdefs.h */
764| #define PACKAGE_NAME "gf2x"
765| #define PACKAGE_TARNAME "gf2x"
766| #define PACKAGE_VERSION "1.1"
767| #define PACKAGE_STRING "gf2x 1.1"
768| #define PACKAGE_BUGREPORT ""
769| #define PACKAGE_URL ""
770| #define PACKAGE "gf2x"
771| #define VERSION "1.1"
772| #define STDC_HEADERS 1
773| #define HAVE_SYS_TYPES_H 1
774| #define HAVE_SYS_STAT_H 1
775| #define HAVE_STDLIB_H 1
776| #define HAVE_STRING_H 1
777| #define HAVE_MEMORY_H 1
778| #define HAVE_STRINGS_H 1
779| #define HAVE_INTTYPES_H 1
780| #define HAVE_STDINT_H 1
781| #define HAVE_UNISTD_H 1
782| #define HAVE_DLFCN_H 1
783| #define LT_OBJDIR ".libs/"
784| #define SIZEOF_UNSIGNED_LONG 4
785| #define HAVE_SSE2_SUPPORT 1
786| /* end confdefs.h.  */
787|
788| #include <wmmintrin.h>
789| #include <assert.h>
790| int main() {
791| assert(sizeof(unsigned long) == 8); /* assume 64-bit */
792| typedef union { __v2di s; unsigned long x[2]; } __v2di_proxy;
793| __v2di xx, yy;
794| __v2di_proxy zz;
795| xx = (__v2di) { 23, 0 };
796| yy = (__v2di) { 47, 0 };
797| zz.s = _mm_clmulepi64_si128(xx, yy, 0);
798| return zz.x[0] - 61;
799| }
800|
801configure:16541: gcc -std=gnu99 -o conftest -g -O4 -Wall -W -mpclmul   conftest.c  >&5
802configure:16541: $? = 0
803configure:16541: ./conftest
804Assertion failed: sizeof(unsigned long) == 8, file conftest.c, line 29, function main
805./configure[1691]: eval: line 1: 5870: Abort(coredump)
806configure:16541: $? = 6
807configure: program exited with status 6
808configure: failed program was:
809| /* confdefs.h */
810| #define PACKAGE_NAME "gf2x"
811| #define PACKAGE_TARNAME "gf2x"
812| #define PACKAGE_VERSION "1.1"
813| #define PACKAGE_STRING "gf2x 1.1"
814| #define PACKAGE_BUGREPORT ""
815| #define PACKAGE_URL ""
816| #define PACKAGE "gf2x"
817| #define VERSION "1.1"
818| #define STDC_HEADERS 1
819| #define HAVE_SYS_TYPES_H 1
820| #define HAVE_SYS_STAT_H 1
821| #define HAVE_STDLIB_H 1
822| #define HAVE_STRING_H 1
823| #define HAVE_MEMORY_H 1
824| #define HAVE_STRINGS_H 1
825| #define HAVE_INTTYPES_H 1
826| #define HAVE_STDINT_H 1
827| #define HAVE_UNISTD_H 1
828| #define HAVE_DLFCN_H 1
829| #define LT_OBJDIR ".libs/"
830| #define SIZEOF_UNSIGNED_LONG 4
831| #define HAVE_SSE2_SUPPORT 1
832| /* end confdefs.h.  */
833|
834| #include <wmmintrin.h>
835| #include <assert.h>
836| int main() {
837| assert(sizeof(unsigned long) == 8); /* assume 64-bit */
838| typedef union { __v2di s; unsigned long x[2]; } __v2di_proxy;
839| __v2di xx, yy;
840| __v2di_proxy zz;
841| xx = (__v2di) { 23, 0 };
842| yy = (__v2di) { 47, 0 };
843| zz.s = _mm_clmulepi64_si128(xx, yy, 0);
844| return zz.x[0] - 61;
845| }
846|
847configure:16563: result: no
848configure:16843: using ABI="default"
849configure:16845:       CC="gcc -std=gnu99"
850configure:16847:       CFLAGS="-g -O4 -Wall -W"
851configure:16849:       CPPFLAGS=""
852configure:16851:       hwdir="x86_sse2"
853configure:16882: checking the number of bits in an unsigned long
854configure:16920: gcc -std=gnu99 -o conftest -g -O4 -Wall -W   conftest.c  >&5
855configure:16920: $? = 0
856configure:16920: ./conftest
857configure:16920: $? = 0
858configure:16924: error: test program failed
859
860## ---------------- ##
861## Cache variables. ##
862## ---------------- ##
863
864ac_cv_build=i386-pc-solaris2.11
865ac_cv_c_compiler_gnu=yes
866ac_cv_cxx_compiler_gnu=yes
867ac_cv_env_CCC_set=''
868ac_cv_env_CCC_value=''
869ac_cv_env_CC_FOR_BUILD_set=''
870ac_cv_env_CC_FOR_BUILD_value=''
871ac_cv_env_CC_set=''
872ac_cv_env_CC_value=''
873ac_cv_env_CFLAGS_set=''
874ac_cv_env_CFLAGS_value=''
875ac_cv_env_CPPFLAGS_set=''
876ac_cv_env_CPPFLAGS_value=''
877ac_cv_env_CPP_set=''
878ac_cv_env_CPP_value=''
879ac_cv_env_CXXCPP_set=''
880ac_cv_env_CXXCPP_value=''
881ac_cv_env_CXXFLAGS_set=''
882ac_cv_env_CXXFLAGS_value=''
883ac_cv_env_CXX_set=''
884ac_cv_env_CXX_value=''
885ac_cv_env_LDFLAGS_set=''
886ac_cv_env_LDFLAGS_value=''
887ac_cv_env_LIBS_set=''
888ac_cv_env_LIBS_value=''
889ac_cv_env_build_alias_set=''
890ac_cv_env_build_alias_value=''
891ac_cv_env_host_alias_set=''
892ac_cv_env_host_alias_value=''
893ac_cv_env_target_alias_set=''
894ac_cv_env_target_alias_value=''
895ac_cv_header_dlfcn_h=yes
896ac_cv_header_inttypes_h=yes
897ac_cv_header_memory_h=yes
898ac_cv_header_stdc=yes
899ac_cv_header_stdint_h=yes
900ac_cv_header_stdlib_h=yes
901ac_cv_header_string_h=yes
902ac_cv_header_strings_h=yes
903ac_cv_header_sys_stat_h=yes
904ac_cv_header_sys_types_h=yes
905ac_cv_header_unistd_h=yes
906ac_cv_host=i386-pc-solaris2.11
907ac_cv_objext=o
908ac_cv_path_EGREP='/usr/bin/ggrep -E'
909ac_cv_path_FGREP='/usr/bin/ggrep -F'
910ac_cv_path_GREP=/usr/bin/ggrep
911ac_cv_path_SED=/usr/bin/gsed
912ac_cv_path_install='/usr/bin/ginstall -c'
913ac_cv_prog_AWK=gawk
914ac_cv_prog_CPP='gcc -E'
915ac_cv_prog_CXXCPP='g++ -E'
916ac_cv_prog_ac_ct_AR=ar
917ac_cv_prog_ac_ct_CC=gcc
918ac_cv_prog_ac_ct_CXX=g++
919ac_cv_prog_ac_ct_MANIFEST_TOOL=mt
920ac_cv_prog_ac_ct_RANLIB=ranlib
921ac_cv_prog_ac_ct_STRIP=strip
922ac_cv_prog_cc_c89=''
923ac_cv_prog_cc_c99=-std=gnu99
924ac_cv_prog_cc_g=yes
925ac_cv_prog_cc_gcc_c_o=yes
926ac_cv_prog_cxx_g=yes
927ac_cv_prog_make_make_set=yes
928ac_cv_sizeof_unsigned_long=4
929ac_cv_target=i386-pc-solaris2.11
930am_cv_CC_dependencies_compiler_type=gcc3
931am_cv_CXX_dependencies_compiler_type=gcc3
932gf2x_cv_cc_supports_pclmul=no
933gf2x_cv_cc_supports_sse2=yes
934gf2x_cv_prog_exeext_for_build=''
935lt_cv_ar_at_file=no
936lt_cv_archive_cmds_need_lc=no
937lt_cv_deplibs_check_method=pass_all
938lt_cv_file_magic_cmd='$MAGIC_CMD'
939lt_cv_file_magic_test_file=''
940lt_cv_ld_reload_flag=-r
941lt_cv_nm_interface='BSD nm'
942lt_cv_objdir=.libs
943lt_cv_path_LD=/usr/ccs/bin/ld
944lt_cv_path_LDCXX=/usr/ccs/bin/ld
945lt_cv_path_NM='/usr/bin/nm -p'
946lt_cv_path_mainfest_tool=no
947lt_cv_prog_compiler_c_o=yes
948lt_cv_prog_compiler_c_o_CXX=yes
949lt_cv_prog_compiler_pic='-fPIC -DPIC'
950lt_cv_prog_compiler_pic_CXX='-fPIC -DPIC'
951lt_cv_prog_compiler_pic_works=yes
952lt_cv_prog_compiler_pic_works_CXX=yes
953lt_cv_prog_compiler_rtti_exceptions=no
954lt_cv_prog_compiler_static_works=no
955lt_cv_prog_compiler_static_works_CXX=no
956lt_cv_prog_gnu_ld=no
957lt_cv_prog_gnu_ldcxx=no
958lt_cv_sharedlib_from_linklib_cmd='print -r --'
959lt_cv_sys_global_symbol_pipe=$'sed -n -e \'s/^.*[\t ]\\([BDRT][BDRT]*\\)[\t ][\t ]*\\([_A-Za-z][_A-Za-z0-9]*\\)$/\\1 \\2 \\2/p\' | sed \'/ __gnu_lto/d\''
960lt_cv_sys_global_symbol_to_c_name_address=$'sed -n -e \'s/^: \\([^ ]*\\)[ ]*$/  {\\"\\1\\", (void *) 0},/p\' -e \'s/^[BDRT]* \\([^ ]*\\) \\([^ ]*\\)$/  {"\\2", (void *) \\&\\2},/p\''
961lt_cv_sys_global_symbol_to_c_name_address_lib_prefix=$'sed -n -e \'s/^: \\([^ ]*\\)[ ]*$/  {\\"\\1\\", (void *) 0},/p\' -e \'s/^[BDRT]* \\([^ ]*\\) \\(lib[^ ]*\\)$/  {"\\2", (void *) \\&\\2},/p\' -e \'s/^[BDRT]* \\([^ ]*\\) \\([^ ]*\\)$/  {"lib\\2", (void *) \\&\\2},/p\''
962lt_cv_sys_global_symbol_to_cdecl=$'sed -n -e \'s/^T .* \\(.*\\)$/extern int \\1();/p\' -e \'s/^[BDRT]* .* \\(.*\\)$/extern char \\1;/p\''
963lt_cv_sys_max_cmd_len=786240
964lt_cv_to_host_file_cmd=func_convert_file_noop
965lt_cv_to_tool_file_cmd=func_convert_file_noop
966
967## ----------------- ##
968## Output variables. ##
969## ----------------- ##
970
971ACLOCAL='${SHELL} /export/home/drkirkby/gf2x-1.1/config/missing --run aclocal-1.11'
972AMDEPBACKSLASH='\'
973AMDEP_FALSE='#'
974AMDEP_TRUE=''
975AMTAR='${SHELL} /export/home/drkirkby/gf2x-1.1/config/missing --run tar'
976AR='ar'
977AUTOCONF='${SHELL} /export/home/drkirkby/gf2x-1.1/config/missing --run autoconf'
978AUTOHEADER='${SHELL} /export/home/drkirkby/gf2x-1.1/config/missing --run autoheader'
979AUTOMAKE='${SHELL} /export/home/drkirkby/gf2x-1.1/config/missing --run automake-1.11'
980AWK='gawk'
981CC='gcc -std=gnu99'
982CCDEPMODE='depmode=gcc3'
983CC_FOR_BUILD='gcc -std=gnu99'
984CFLAGS='-g -O4 -Wall -W'
985CPP='gcc -E'
986CPPFLAGS=''
987CXX='g++'
988CXXCPP='g++ -E'
989CXXDEPMODE='depmode=gcc3'
990CXXFLAGS='-g -O2 -Wall -W'
991CYGPATH_W='echo'
992DEFS=''
993DEPDIR='.deps'
994DLLTOOL='false'
995DSYMUTIL=''
996DUMPBIN=''
997ECHO_C='\c'
998ECHO_N=''
999ECHO_T=''
1000EGREP='/usr/bin/ggrep -E'
1001ENABLE_NTL_CHECKS_FALSE=''
1002ENABLE_NTL_CHECKS_TRUE='#'
1003EXEEXT=''
1004EXEEXT_FOR_BUILD=''
1005FGREP='/usr/bin/ggrep -F'
1006GF2X_32BIT_SOURCES_FALSE=''
1007GF2X_32BIT_SOURCES_TRUE=''
1008GF2X_64BIT_SOURCES_FALSE=''
1009GF2X_64BIT_SOURCES_TRUE=''
1010GF2X_PCLMUL_AVAILABLE_FALSE=''
1011GF2X_PCLMUL_AVAILABLE_TRUE=''
1012GF2X_SSE2_AVAILABLE_FALSE=''
1013GF2X_SSE2_AVAILABLE_TRUE=''
1014GF2X_WORDSIZE='32'
1015GREP='/usr/bin/ggrep'
1016INSTALL_DATA='${INSTALL} -m 644'
1017INSTALL_PROGRAM='${INSTALL}'
1018INSTALL_SCRIPT='${INSTALL}'
1019INSTALL_STRIP_PROGRAM='$(install_sh) -c -s'
1020LD='/usr/ccs/bin/ld'
1021LDFLAGS=''
1022LIBOBJS=''
1023LIBS=''
1024LIBTOOL='$(SHELL) $(top_builddir)/libtool'
1025LIPO=''
1026LN_S='ln -s'
1027LTLIBOBJS=''
1028MAKEINFO='${SHELL} /export/home/drkirkby/gf2x-1.1/config/missing --run makeinfo'
1029MANIFEST_TOOL=':'
1030MKDIR_P='config/install-sh -c -d'
1031NM='/usr/bin/nm -p'
1032NMEDIT=''
1033OBJDUMP='false'
1034OBJEXT='o'
1035OTOOL64=''
1036OTOOL=''
1037PACKAGE='gf2x'
1038PACKAGE_BUGREPORT=''
1039PACKAGE_NAME='gf2x'
1040PACKAGE_STRING='gf2x 1.1'
1041PACKAGE_TARNAME='gf2x'
1042PACKAGE_URL=''
1043PACKAGE_VERSION='1.1'
1044PATH_SEPARATOR=':'
1045RANLIB='ranlib'
1046SED='/usr/bin/gsed'
1047SET_MAKE=''
1048SHELL='/bin/sh'
1049STRIP='strip'
1050VERSION='1.1'
1051ac_ct_AR='ar'
1052ac_ct_CC='gcc'
1053ac_ct_CXX='g++'
1054ac_ct_DUMPBIN=''
1055am__EXEEXT_FALSE=''
1056am__EXEEXT_TRUE=''
1057am__fastdepCC_FALSE='#'
1058am__fastdepCC_TRUE=''
1059am__fastdepCXX_FALSE='#'
1060am__fastdepCXX_TRUE=''
1061am__include='include'
1062am__isrc=''
1063am__leading_dot='.'
1064am__quote=''
1065am__tar='${AMTAR} chof - "$$tardir"'
1066am__untar='${AMTAR} xf -'
1067bindir='${exec_prefix}/bin'
1068build='i386-pc-solaris2.11'
1069build_alias=''
1070build_cpu='i386'
1071build_os='solaris2.11'
1072build_vendor='pc'
1073datadir='${datarootdir}'
1074datarootdir='${prefix}/share'
1075docdir='${datarootdir}/doc/${PACKAGE_TARNAME}'
1076dvidir='${docdir}'
1077exec_prefix='NONE'
1078gf2x_lib_version='1:0:0'
1079host='i386-pc-solaris2.11'
1080host_alias=''
1081host_cpu='i386'
1082host_os='solaris2.11'
1083host_vendor='pc'
1084htmldir='${docdir}'
1085includedir='${prefix}/include'
1086infodir='${datarootdir}/info'
1087install_sh='${SHELL} /export/home/drkirkby/gf2x-1.1/config/install-sh'
1088libdir='${exec_prefix}/lib'
1089libexecdir='${exec_prefix}/libexec'
1090localedir='${datarootdir}/locale'
1091localstatedir='${prefix}/var'
1092mandir='${datarootdir}/man'
1093mkdir_p='$(top_builddir)/config/install-sh -c -d'
1094oldincludedir='/usr/include'
1095pdfdir='${docdir}'
1096prefix='NONE'
1097program_transform_name='s,x,x,'
1098psdir='${docdir}'
1099sbindir='${exec_prefix}/sbin'
1100sharedstatedir='${prefix}/com'
1101sysconfdir='${prefix}/etc'
1102target='i386-pc-solaris2.11'
1103target_alias=''
1104target_cpu='i386'
1105target_os='solaris2.11'
1106target_vendor='pc'
1107
1108## ----------- ##
1109## confdefs.h. ##
1110## ----------- ##
1111
1112/* confdefs.h */
1113#define PACKAGE_NAME "gf2x"
1114#define PACKAGE_TARNAME "gf2x"
1115#define PACKAGE_VERSION "1.1"
1116#define PACKAGE_STRING "gf2x 1.1"
1117#define PACKAGE_BUGREPORT ""
1118#define PACKAGE_URL ""
1119#define PACKAGE "gf2x"
1120#define VERSION "1.1"
1121#define STDC_HEADERS 1
1122#define HAVE_SYS_TYPES_H 1
1123#define HAVE_SYS_STAT_H 1
1124#define HAVE_STDLIB_H 1
1125#define HAVE_STRING_H 1
1126#define HAVE_MEMORY_H 1
1127#define HAVE_STRINGS_H 1
1128#define HAVE_INTTYPES_H 1
1129#define HAVE_STDINT_H 1
1130#define HAVE_UNISTD_H 1
1131#define HAVE_DLFCN_H 1
1132#define LT_OBJDIR ".libs/"
1133#define SIZEOF_UNSIGNED_LONG 4
1134#define HAVE_SSE2_SUPPORT 1
1135
1136configure: exit 1