Ticket #13768: VDelecroix-polymake-2.12.log

File VDelecroix-polymake-2.12.log, 158.5 KB (added by vdelecroix, 6 years ago)

log file of a failed installation (Linux 3.16.0-4-amd64 Debian 3.16.7-2 x86_64)

Line 
1Attempting to download package polymake-2.12
2>>> Trying to download http://www.infty.nl/misc/polymake-2.12.spkg
3[............................................................]
4polymake-2.12
5====================================================
6Extracting package /opt/sage_flatsurf/upstream/polymake-2.12.spkg
7-rw-r--r-- 1 vincent vincent 13249997 Dec  7 20:36 /opt/sage_flatsurf/upstream/polymake-2.12.spkg
8Finished extraction
9****************************************************
10Host system:
11Linux mangouste 3.16.0-4-amd64 #1 SMP Debian 3.16.7-2 (2014-11-06) x86_64 GNU/Linux
12****************************************************
13C compiler: gcc
14C compiler version:
15Using built-in specs.
16COLLECT_GCC=/usr/bin/gcc
17COLLECT_LTO_WRAPPER=/usr/lib/gcc/x86_64-linux-gnu/4.9/lto-wrapper
18Target: x86_64-linux-gnu
19Configured with: ../src/configure -v --with-pkgversion='Debian 4.9.1-19' --with-bugurl=file:///usr/share/doc/gcc-4.9/README.Bugs --enable-languages=c,c++,java,go,d,fortran,objc,obj-c++ --prefix=/usr --program-suffix=-4.9 --enable-shared --enable-linker-build-id --libexecdir=/usr/lib --without-included-gettext --enable-threads=posix --with-gxx-include-dir=/usr/include/c++/4.9 --libdir=/usr/lib --enable-nls --with-sysroot=/ --enable-clocale=gnu --enable-libstdcxx-debug --enable-libstdcxx-time=yes --enable-gnu-unique-object --disable-vtable-verify --enable-plugin --with-system-zlib --disable-browser-plugin --enable-java-awt=gtk --enable-gtk-cairo --with-java-home=/usr/lib/jvm/java-1.5.0-gcj-4.9-amd64/jre --enable-java-home --with-jvm-root-dir=/usr/lib/jvm/java-1.5.0-gcj-4.9-amd64 --with-jvm-jar-dir=/usr/lib/jvm-exports/java-1.5.0-gcj-4.9-amd64 --with-arch-directory=amd64 --with-ecj-jar=/usr/share/java/eclipse-ecj.jar --enable-objc-gc --enable-multiarch --with-arch-32=i586 --with-abi=m64 --with-multilib-list=m32,m64,mx32 --enable-multilib --with-tune=generic --enable-checking=release --build=x86_64-linux-gnu --host=x86_64-linux-gnu --target=x86_64-linux-gnu
20Thread model: posix
21gcc version 4.9.1 (Debian 4.9.1-19)
22****************************************************
23WARNING: perl module XML::Writer required for polymake not found on your machine.
24         Please be sure to install it prior to starting to use polymake.
25         If you have installed them in a non-standard location
26         please add the path to the environment variable PERL5LIB
27WARNING: perl module XML::LibXSLT required for polymake not found on your machine.
28         Please be sure to install it prior to starting to use polymake.
29         If you have installed them in a non-standard location
30         please add the path to the environment variable PERL5LIB
31WARNING: perl module Term::ReadLine::Gnu required for polymake not found on your machine.
32         Please be sure to install it prior to starting to use polymake.
33         If you have installed them in a non-standard location
34         please add the path to the environment variable PERL5LIB
35
36Configuration goes on, nevertheless.
37Could not find configuration program xml2-config for library libxml2.
38Probably you need to install development package for it;
39usually it is called libxml2-devel or similarly.
40If the library is installed at a non-standard location,
41please specify it in option --with-libxml2
42Failed to configure.
43
44real    0m4.543s
45user    0m1.672s
46sys     0m0.192s
47************************************************************************
48Error installing package polymake-2.12
49************************************************************************
50Please email sage-devel (http://groups.google.com/group/sage-devel)
51explaining the problem and including the relevant part of the log file
52  /opt/sage_flatsurf/logs/pkgs/polymake-2.12.log
53Describe your computer, operating system, etc.
54If you want to try to fix the problem yourself, *don't* just cd to
55/opt/sage_flatsurf/local/var/tmp/sage/build/polymake-2.12 and type 'make' or whatever is appropriate.
56Instead, the following commands setup all environment variables
57correctly and load a subshell for you to debug the error:
58  (cd '/opt/sage_flatsurf/local/var/tmp/sage/build/polymake-2.12' && '/opt/sage_flatsurf/sage' --sh)
59When you are done debugging, you can type "exit" to leave the subshell.
60************************************************************************
61polymake-2.12
62====================================================
63Extracting package /opt/sage_flatsurf/upstream/polymake-2.12.spkg
64-rw-r--r-- 1 vincent vincent 13249997 Dec  7 20:36 /opt/sage_flatsurf/upstream/polymake-2.12.spkg
65Finished extraction
66****************************************************
67Host system:
68Linux mangouste 3.16.0-4-amd64 #1 SMP Debian 3.16.7-2 (2014-11-06) x86_64 GNU/Linux
69****************************************************
70C compiler: gcc
71C compiler version:
72Using built-in specs.
73COLLECT_GCC=/usr/bin/gcc
74COLLECT_LTO_WRAPPER=/usr/lib/gcc/x86_64-linux-gnu/4.9/lto-wrapper
75Target: x86_64-linux-gnu
76Configured with: ../src/configure -v --with-pkgversion='Debian 4.9.1-19' --with-bugurl=file:///usr/share/doc/gcc-4.9/README.Bugs --enable-languages=c,c++,java,go,d,fortran,objc,obj-c++ --prefix=/usr --program-suffix=-4.9 --enable-shared --enable-linker-build-id --libexecdir=/usr/lib --without-included-gettext --enable-threads=posix --with-gxx-include-dir=/usr/include/c++/4.9 --libdir=/usr/lib --enable-nls --with-sysroot=/ --enable-clocale=gnu --enable-libstdcxx-debug --enable-libstdcxx-time=yes --enable-gnu-unique-object --disable-vtable-verify --enable-plugin --with-system-zlib --disable-browser-plugin --enable-java-awt=gtk --enable-gtk-cairo --with-java-home=/usr/lib/jvm/java-1.5.0-gcj-4.9-amd64/jre --enable-java-home --with-jvm-root-dir=/usr/lib/jvm/java-1.5.0-gcj-4.9-amd64 --with-jvm-jar-dir=/usr/lib/jvm-exports/java-1.5.0-gcj-4.9-amd64 --with-arch-directory=amd64 --with-ecj-jar=/usr/share/java/eclipse-ecj.jar --enable-objc-gc --enable-multiarch --with-arch-32=i586 --with-abi=m64 --with-multilib-list=m32,m64,mx32 --enable-multilib --with-tune=generic --enable-checking=release --build=x86_64-linux-gnu --host=x86_64-linux-gnu --target=x86_64-linux-gnu
77Thread model: posix
78gcc version 4.9.1 (Debian 4.9.1-19)
79****************************************************
80make[1]: Entering directory '/opt/sage_flatsurf/local/var/tmp/sage/build/polymake-2.12/src/build.x86_64/lib'
81/bin/sh: 1: Bad substitution
82/bin/sh: 1: Bad substitution
83g++ -c -o linalg_float.o -fPIC -I/opt/sage_flatsurf/local/var/tmp/sage/build/polymake-2.12/src/include/core-wrappers -I/opt/sage_flatsurf/local/var/tmp/sage/build/polymake-2.12/src/include/core -march=native -ftemplate-depth-200 -Wall -Wno-strict-aliasing -Wno-parentheses -I/opt/sage_flatsurf/local/include -DNDEBUG -DPOLYMAKE_DEBUG=0 -O3 -MD -MF linalg_float.d -MT 'linalg_float.o'    /opt/sage_flatsurf/local/var/tmp/sage/build/polymake-2.12/src/lib/core/src/linalg_float.cc
84In file included from ../../include/core/polymake/internal/operations_basic_defs.h:21:0,
85                 from ../../include/core/polymake/internal/comparators_basic_defs.h:21,
86                 from ../../include/core/polymake/internal/comparators_ops.h:24,
87                 from ../../include/core/polymake/Series.h:25,
88                 from ../../include/core/polymake/internal/sparse.h:21,
89                 from ../../include/core/polymake/GenericIO.h:21,
90                 from ../../include/core/polymake/GenericVector.h:21,
91                 from ../../include/core/polymake/Vector.h:25,
92                 from ../../include/core-wrappers/polymake/Vector.h:21,
93                 from ../../include/core/polymake/GenericMatrix.h:21,
94                 from ../../include/core/polymake/Matrix.h:25,
95                 from ../../include/core-wrappers/polymake/Matrix.h:21,
96                 from ../../lib/core/src/linalg_float.cc:19:
97../../include/core/polymake/internal/type_manip.h: In function 'void pm::assert_overloaded(T, T)':
98../../include/core/polymake/internal/type_manip.h:764:47: warning: typedef 'method_must_be_overloaded' locally defined but not used [-Wunused-local-typedefs]
99    typedef typename enable_if<T, false>::type method_must_be_overloaded;
100                                               ^
101In file included from ../../include/core/polymake/internal/operations.h:22:0,
102                 from ../../include/core/polymake/internal/comparators_ops.h:26,
103                 from ../../include/core/polymake/Series.h:25,
104                 from ../../include/core/polymake/internal/sparse.h:21,
105                 from ../../include/core/polymake/GenericIO.h:21,
106                 from ../../include/core/polymake/GenericVector.h:21,
107                 from ../../include/core/polymake/Vector.h:25,
108                 from ../../include/core-wrappers/polymake/Vector.h:21,
109                 from ../../include/core/polymake/GenericMatrix.h:21,
110                 from ../../include/core/polymake/Matrix.h:25,
111                 from ../../include/core-wrappers/polymake/Matrix.h:21,
112                 from ../../lib/core/src/linalg_float.cc:19:
113../../include/core/polymake/internal/iterators.h: In member function 'pm::iterator_pair<Iterator1, Iterator2, Params>::difference_type pm::iterator_pair<Iterator1, Iterator2, Params>::operator-(const iterator&) const':
114../../include/core/polymake/internal/iterators.h:2270:10: warning: typedef 'error_if_unimplemented' locally defined but not used [-Wunused-local-typedefs]
115          error_if_unimplemented;
116          ^
117../../include/core/polymake/internal/iterators.h: In member function 'pm::iterator_pair<Iterator1, Iterator2, Params>::difference_type pm::iterator_pair<Iterator1, Iterator2, Params>::operator-(typename pm::assign_const<pm::iterator_pair<typename pm::iterator_traits<Iterator1>::const_iterator, typename pm::iterator_traits<Iterator2>::const_iterator, Params>, (! pm::identical<pm::iterator_pair<typename pm::iterator_traits<Iterator1>::iterator, typename pm::iterator_traits<Iterator2>::iterator, Params>, pm::iterator_pair<typename pm::iterator_traits<Iterator1>::const_iterator, typename pm::iterator_traits<Iterator2>::const_iterator, Params> >::value)>::type&) const':
118../../include/core/polymake/internal/iterators.h:2276:10: warning: typedef 'error_if_unimplemented' locally defined but not used [-Wunused-local-typedefs]
119          error_if_unimplemented;
120          ^
121../../include/core/polymake/internal/iterators.h: In member function 'bool pm::iterator_pair<Iterator1, Iterator2, Params>::at_end() const':
122../../include/core/polymake/internal/iterators.h:2313:62: warning: typedef 'error_if_unimplemented' locally defined but not used [-Wunused-local-typedefs]
123       typedef typename enable_if<bool, _enable_at_end>::type error_if_unimplemented;
124                                                              ^
125../../include/core/polymake/internal/iterators.h: In member function 'int pm::iterator_pair<Iterator1, Iterator2, Params>::index() const':
126../../include/core/polymake/internal/iterators.h:2332:60: warning: typedef 'error_if_unimplemented' locally defined but not used [-Wunused-local-typedefs]
127       typedef typename enable_if<int, _enable_index>::type error_if_unimplemented;
128                                                            ^
129../../include/core/polymake/internal/iterators.h: In member function 'void pm::iterator_pair<Iterator1, Iterator2, Params>::rewind()':
130../../include/core/polymake/internal/iterators.h:2344:61: warning: typedef 'error_if_unimplemented' locally defined but not used [-Wunused-local-typedefs]
131       typedef typename enable_if<void,_enable_rewind>::type error_if_unimplemented;
132                                                             ^
133In file included from ../../include/core/polymake/internal/sparse.h:23:0,
134                 from ../../include/core/polymake/GenericIO.h:21,
135                 from ../../include/core/polymake/GenericVector.h:21,
136                 from ../../include/core/polymake/Vector.h:25,
137                 from ../../include/core-wrappers/polymake/Vector.h:21,
138                 from ../../include/core/polymake/GenericMatrix.h:21,
139                 from ../../include/core/polymake/Matrix.h:25,
140                 from ../../include/core-wrappers/polymake/Matrix.h:21,
141                 from ../../lib/core/src/linalg_float.cc:19:
142../../include/core/polymake/SelectedSubset.h: In member function 'void pm::unary_predicate_selector<Iterator, Predicate>::rewind()':
143../../include/core/polymake/SelectedSubset.h:79:97: warning: typedef 'error_if_unimplemented' locally defined but not used [-Wunused-local-typedefs]
144       typedef typename enable_if<super, check_iterator_feature<super, rewindable>::value>::type error_if_unimplemented;
145                                                                                                 ^
146In file included from ../../include/core/polymake/internal/sparse.h:23:0,
147                 from ../../include/core/polymake/GenericIO.h:21,
148                 from ../../include/core/polymake/GenericVector.h:21,
149                 from ../../include/core/polymake/Vector.h:25,
150                 from ../../include/core-wrappers/polymake/Vector.h:21,
151                 from ../../include/core/polymake/GenericMatrix.h:21,
152                 from ../../include/core/polymake/Matrix.h:25,
153                 from ../../include/core-wrappers/polymake/Matrix.h:21,
154                 from ../../lib/core/src/linalg_float.cc:19:
155../../include/core/polymake/SelectedSubset.h: In member function 'pm::binary_predicate_selector<IteratorPair, Predicate>& pm::binary_predicate_selector<IteratorPair, Predicate>::operator--()':
156../../include/core/polymake/SelectedSubset.h:436:89: warning: typedef 'error_if_unimplemented' locally defined but not used [-Wunused-local-typedefs]
157       typedef typename enable_if<super, iterator_traits<super>::is_bidirectional>::type error_if_unimplemented;
158                                                                                         ^
159../../include/core/polymake/SelectedSubset.h: In member function 'void pm::binary_predicate_selector<IteratorPair, Predicate>::rewind()':
160../../include/core/polymake/SelectedSubset.h:449:97: warning: typedef 'error_if_unimplemented' locally defined but not used [-Wunused-local-typedefs]
161       typedef typename enable_if<super, check_iterator_feature<super, rewindable>::value>::type error_if_unimplemented;
162                                                                                                 ^
163In file included from ../../include/core/polymake/internal/iterator_zipper.h:22:0,
164                 from ../../include/core/polymake/internal/sparse.h:24,
165                 from ../../include/core/polymake/GenericIO.h:21,
166                 from ../../include/core/polymake/GenericVector.h:21,
167                 from ../../include/core/polymake/Vector.h:25,
168                 from ../../include/core-wrappers/polymake/Vector.h:21,
169                 from ../../include/core/polymake/GenericMatrix.h:21,
170                 from ../../include/core/polymake/Matrix.h:25,
171                 from ../../include/core-wrappers/polymake/Matrix.h:21,
172                 from ../../lib/core/src/linalg_float.cc:19:
173../../include/core/polymake/ContainerUnion.h: In member function 'bool pm::iterator_union<IteratorList, Category>::at_end() const':
174../../include/core/polymake/ContainerUnion.h:449:10: warning: typedef 'error_if_unimplemented' locally defined but not used [-Wunused-local-typedefs]
175          error_if_unimplemented;
176          ^
177../../include/core/polymake/ContainerUnion.h: In member function 'int pm::iterator_union<IteratorList, Category>::index() const':
178../../include/core/polymake/ContainerUnion.h:456:10: warning: typedef 'error_if_unimplemented' locally defined but not used [-Wunused-local-typedefs]
179          error_if_unimplemented;
180          ^
181../../include/core/polymake/ContainerUnion.h: In member function 'void pm::iterator_union<IteratorList, Category>::rewind()':
182../../include/core/polymake/ContainerUnion.h:463:10: warning: typedef 'error_if_unimplemented' locally defined but not used [-Wunused-local-typedefs]
183          error_if_unimplemented;
184          ^
185In file included from ../../include/core/polymake/internal/sparse.h:24:0,
186                 from ../../include/core/polymake/GenericIO.h:21,
187                 from ../../include/core/polymake/GenericVector.h:21,
188                 from ../../include/core/polymake/Vector.h:25,
189                 from ../../include/core-wrappers/polymake/Vector.h:21,
190                 from ../../include/core/polymake/GenericMatrix.h:21,
191                 from ../../include/core/polymake/Matrix.h:25,
192                 from ../../include/core-wrappers/polymake/Matrix.h:21,
193                 from ../../lib/core/src/linalg_float.cc:19:
194../../include/core/polymake/internal/iterator_zipper.h: In member function 'pm::iterator_zipper<Iterator1, Iterator2, Comparator, Controller, _use_index1, _use_index2>& pm::iterator_zipper<Iterator1, Iterator2, Comparator, Controller, _use_index1, _use_index2>::operator--()':
195../../include/core/polymake/internal/iterator_zipper.h:198:10: warning: typedef 'error_if_unimplemented' locally defined but not used [-Wunused-local-typedefs]
196          error_if_unimplemented;
197          ^
198../../include/core/polymake/internal/iterator_zipper.h: In member function 'void pm::iterator_zipper<Iterator1, Iterator2, Comparator, Controller, _use_index1, _use_index2>::rewind()':
199../../include/core/polymake/internal/iterator_zipper.h:225:10: warning: typedef 'error_if_unimplemented' locally defined but not used [-Wunused-local-typedefs]
200          error_if_unimplemented;
201          ^
202In file included from ../../include/core/polymake/GenericVector.h:22:0,
203                 from ../../include/core/polymake/Vector.h:25,
204                 from ../../include/core-wrappers/polymake/Vector.h:21,
205                 from ../../include/core/polymake/GenericMatrix.h:21,
206                 from ../../include/core/polymake/Matrix.h:25,
207                 from ../../include/core-wrappers/polymake/Matrix.h:21,
208                 from ../../lib/core/src/linalg_float.cc:19:
209../../include/core/polymake/TransformedContainer.h: In member function 'void pm::iterator_product<Iterator1, Iterator2, _has_state1, true>::rewind()':
210../../include/core/polymake/TransformedContainer.h:429:10: warning: typedef 'error_if_unimplemented' locally defined but not used [-Wunused-local-typedefs]
211          error_if_unimplemented;
212          ^
213In file included from ../../include/core/polymake/GenericVector.h:24:0,
214                 from ../../include/core/polymake/Vector.h:25,
215                 from ../../include/core-wrappers/polymake/Vector.h:21,
216                 from ../../include/core/polymake/GenericMatrix.h:21,
217                 from ../../include/core/polymake/Matrix.h:25,
218                 from ../../include/core-wrappers/polymake/Matrix.h:21,
219                 from ../../lib/core/src/linalg_float.cc:19:
220../../include/core/polymake/IndexedSubset.h: In member function 'pm::indexed_selector<Iterator1, Iterator2, renumber, _reversed>& pm::indexed_selector<Iterator1, Iterator2, renumber, _reversed>::operator--()':
221../../include/core/polymake/IndexedSubset.h:183:107: warning: typedef 'error_if_unimplemented' locally defined but not used [-Wunused-local-typedefs]
222       typedef typename enable_if<void, iterator_pair_traits<Iterator1,Iterator2>::is_bidirectional>::type error_if_unimplemented;
223                                                                                                           ^
224../../include/core/polymake/IndexedSubset.h: In member function 'pm::indexed_selector<Iterator1, Iterator2, renumber, _reversed>& pm::indexed_selector<Iterator1, Iterator2, renumber, _reversed>::operator+=(int)':
225../../include/core/polymake/IndexedSubset.h:191:100: warning: typedef 'error_if_unimplemented' locally defined but not used [-Wunused-local-typedefs]
226       typedef typename enable_if<void, iterator_pair_traits<Iterator1,Iterator2>::is_random>::type error_if_unimplemented;
227                                                                                                    ^
228../../include/core/polymake/IndexedSubset.h: In member function 'pm::indexed_selector<Iterator1, Iterator2, renumber, _reversed>& pm::indexed_selector<Iterator1, Iterator2, renumber, _reversed>::operator-=(int)':
229../../include/core/polymake/IndexedSubset.h:197:100: warning: typedef 'error_if_unimplemented' locally defined but not used [-Wunused-local-typedefs]
230       typedef typename enable_if<void, iterator_pair_traits<Iterator1,Iterator2>::is_random>::type error_if_unimplemented;
231                                                                                                    ^
232../../include/core/polymake/IndexedSubset.h: In member function 'typename pm::enable_if<typename pm::iterator_traits<Iterator2>::difference_type, pm::comparable_iterator<pm::indexed_selector<Iterator1, Iterator2, renumber, _reversed>, Iterator>::value>::type pm::indexed_selector<Iterator1, Iterator2, renumber, _reversed>::operator-(const Iterator&) const':
233../../include/core/polymake/IndexedSubset.h:210:100: warning: typedef 'error_if_unimplemented' locally defined but not used [-Wunused-local-typedefs]
234       typedef typename enable_if<void, iterator_pair_traits<Iterator1,Iterator2>::is_random>::type error_if_unimplemented;
235                                                                                                    ^
236../../include/core/polymake/IndexedSubset.h: In member function 'typename pm::iterator_traits<Iterator1>::derivable_type::reference pm::indexed_selector<Iterator1, Iterator2, renumber, _reversed>::operator[](int) const':
237../../include/core/polymake/IndexedSubset.h:216:100: warning: typedef 'error_if_unimplemented' locally defined but not used [-Wunused-local-typedefs]
238       typedef typename enable_if<void, iterator_pair_traits<Iterator1,Iterator2>::is_random>::type error_if_unimplemented;
239                                                                                                    ^
240../../include/core/polymake/IndexedSubset.h: In member function 'void pm::indexed_selector<Iterator1, Iterator2, renumber, _reversed>::rewind()':
241../../include/core/polymake/IndexedSubset.h:250:3: warning: typedef 'error_if_unimplemented' locally defined but not used [-Wunused-local-typedefs]
242   error_if_unimplemented;
243   ^
244../../include/core/polymake/IndexedSubset.h: In member function 'void pm::indexed_selector<Iterator1, Iterator2, renumber, _reversed>::contract(bool, int, int)':
245../../include/core/polymake/IndexedSubset.h:258:3: warning: typedef 'error_if_unimplemented' locally defined but not used [-Wunused-local-typedefs]
246   error_if_unimplemented;
247   ^
248In file included from ../../include/core/polymake/GenericVector.h:26:0,
249                 from ../../include/core/polymake/Vector.h:25,
250                 from ../../include/core-wrappers/polymake/Vector.h:21,
251                 from ../../include/core/polymake/GenericMatrix.h:21,
252                 from ../../include/core/polymake/Matrix.h:25,
253                 from ../../include/core-wrappers/polymake/Matrix.h:21,
254                 from ../../lib/core/src/linalg_float.cc:19:
255../../include/core/polymake/ContainerChain.h: In member function 'void pm::iterator_chain<IteratorList, _reversed>::rewind()':
256../../include/core/polymake/ContainerChain.h:463:10: warning: typedef 'error_if_unimplemented' locally defined but not used [-Wunused-local-typedefs]
257          error_if_unimplemented;
258          ^
259../../include/core/polymake/ContainerChain.h: In member function 'int pm::iterator_chain<IteratorList, _reversed>::index() const':
260../../include/core/polymake/ContainerChain.h:472:10: warning: typedef 'error_if_unimplemented' locally defined but not used [-Wunused-local-typedefs]
261          error_if_unimplemented;
262          ^
263In file included from ../../include/core/polymake/GenericMatrix.h:22:0,
264                 from ../../include/core/polymake/Matrix.h:25,
265                 from ../../include/core-wrappers/polymake/Matrix.h:21,
266                 from ../../lib/core/src/linalg_float.cc:19:
267../../include/core/polymake/CascadedContainer.h: In member function 'void pm::cascaded_iterator<Iterator, ExpectedFeatures, depth>::rewind()':
268../../include/core/polymake/CascadedContainer.h:138:70: warning: typedef 'error_if_unimplemented' locally defined but not used [-Wunused-local-typedefs]
269       typedef typename enable_if_iterator<Iterator,rewindable>::type error_if_unimplemented;
270                                                                      ^
271g++ -c -o Ring.o -fPIC -I/opt/sage_flatsurf/local/var/tmp/sage/build/polymake-2.12/src/include/core-wrappers -I/opt/sage_flatsurf/local/var/tmp/sage/build/polymake-2.12/src/include/core -march=native -ftemplate-depth-200 -Wall -Wno-strict-aliasing -Wno-parentheses -I/opt/sage_flatsurf/local/include -DNDEBUG -DPOLYMAKE_DEBUG=0 -O3 -MD -MF Ring.d -MT 'Ring.o'    /opt/sage_flatsurf/local/var/tmp/sage/build/polymake-2.12/src/lib/core/src/Ring.cc
272In file included from ../../include/core/polymake/internal/iterators.h:21:0,
273                 from ../../include/core/polymake/internal/shared_object.h:21,
274                 from ../../include/core/polymake/Array.h:25,
275                 from ../../include/core-wrappers/polymake/Array.h:21,
276                 from ../../include/core/polymake/Ring.h:21,
277                 from ../../include/core-wrappers/polymake/Ring.h:21,
278                 from ../../lib/core/src/Ring.cc:18:
279../../include/core/polymake/internal/type_manip.h: In function 'void pm::assert_overloaded(T, T)':
280../../include/core/polymake/internal/type_manip.h:764:47: warning: typedef 'method_must_be_overloaded' locally defined but not used [-Wunused-local-typedefs]
281    typedef typename enable_if<T, false>::type method_must_be_overloaded;
282                                               ^
283In file included from ../../include/core/polymake/internal/shared_object.h:21:0,
284                 from ../../include/core/polymake/Array.h:25,
285                 from ../../include/core-wrappers/polymake/Array.h:21,
286                 from ../../include/core/polymake/Ring.h:21,
287                 from ../../include/core-wrappers/polymake/Ring.h:21,
288                 from ../../lib/core/src/Ring.cc:18:
289../../include/core/polymake/internal/iterators.h: In member function 'pm::iterator_pair<Iterator1, Iterator2, Params>::difference_type pm::iterator_pair<Iterator1, Iterator2, Params>::operator-(const iterator&) const':
290../../include/core/polymake/internal/iterators.h:2270:10: warning: typedef 'error_if_unimplemented' locally defined but not used [-Wunused-local-typedefs]
291          error_if_unimplemented;
292          ^
293../../include/core/polymake/internal/iterators.h: In member function 'pm::iterator_pair<Iterator1, Iterator2, Params>::difference_type pm::iterator_pair<Iterator1, Iterator2, Params>::operator-(typename pm::assign_const<pm::iterator_pair<typename pm::iterator_traits<Iterator1>::const_iterator, typename pm::iterator_traits<Iterator2>::const_iterator, Params>, (! pm::identical<pm::iterator_pair<typename pm::iterator_traits<Iterator1>::iterator, typename pm::iterator_traits<Iterator2>::iterator, Params>, pm::iterator_pair<typename pm::iterator_traits<Iterator1>::const_iterator, typename pm::iterator_traits<Iterator2>::const_iterator, Params> >::value)>::type&) const':
294../../include/core/polymake/internal/iterators.h:2276:10: warning: typedef 'error_if_unimplemented' locally defined but not used [-Wunused-local-typedefs]
295          error_if_unimplemented;
296          ^
297../../include/core/polymake/internal/iterators.h: In member function 'bool pm::iterator_pair<Iterator1, Iterator2, Params>::at_end() const':
298../../include/core/polymake/internal/iterators.h:2313:62: warning: typedef 'error_if_unimplemented' locally defined but not used [-Wunused-local-typedefs]
299       typedef typename enable_if<bool, _enable_at_end>::type error_if_unimplemented;
300                                                              ^
301../../include/core/polymake/internal/iterators.h: In member function 'int pm::iterator_pair<Iterator1, Iterator2, Params>::index() const':
302../../include/core/polymake/internal/iterators.h:2332:60: warning: typedef 'error_if_unimplemented' locally defined but not used [-Wunused-local-typedefs]
303       typedef typename enable_if<int, _enable_index>::type error_if_unimplemented;
304                                                            ^
305../../include/core/polymake/internal/iterators.h: In member function 'void pm::iterator_pair<Iterator1, Iterator2, Params>::rewind()':
306../../include/core/polymake/internal/iterators.h:2344:61: warning: typedef 'error_if_unimplemented' locally defined but not used [-Wunused-local-typedefs]
307       typedef typename enable_if<void,_enable_rewind>::type error_if_unimplemented;
308                                                             ^
309In file included from ../../include/core/polymake/internal/sparse.h:23:0,
310                 from ../../include/core/polymake/TransformedContainer.h:21,
311                 from ../../include/core/polymake/internal/converters.h:23,
312                 from ../../include/core/polymake/Array.h:26,
313                 from ../../include/core-wrappers/polymake/Array.h:21,
314                 from ../../include/core/polymake/Ring.h:21,
315                 from ../../include/core-wrappers/polymake/Ring.h:21,
316                 from ../../lib/core/src/Ring.cc:18:
317../../include/core/polymake/SelectedSubset.h: In member function 'void pm::unary_predicate_selector<Iterator, Predicate>::rewind()':
318../../include/core/polymake/SelectedSubset.h:79:97: warning: typedef 'error_if_unimplemented' locally defined but not used [-Wunused-local-typedefs]
319       typedef typename enable_if<super, check_iterator_feature<super, rewindable>::value>::type error_if_unimplemented;
320                                                                                                 ^
321In file included from ../../include/core/polymake/internal/sparse.h:23:0,
322                 from ../../include/core/polymake/TransformedContainer.h:21,
323                 from ../../include/core/polymake/internal/converters.h:23,
324                 from ../../include/core/polymake/Array.h:26,
325                 from ../../include/core-wrappers/polymake/Array.h:21,
326                 from ../../include/core/polymake/Ring.h:21,
327                 from ../../include/core-wrappers/polymake/Ring.h:21,
328                 from ../../lib/core/src/Ring.cc:18:
329../../include/core/polymake/SelectedSubset.h: In member function 'pm::binary_predicate_selector<IteratorPair, Predicate>& pm::binary_predicate_selector<IteratorPair, Predicate>::operator--()':
330../../include/core/polymake/SelectedSubset.h:436:89: warning: typedef 'error_if_unimplemented' locally defined but not used [-Wunused-local-typedefs]
331       typedef typename enable_if<super, iterator_traits<super>::is_bidirectional>::type error_if_unimplemented;
332                                                                                         ^
333../../include/core/polymake/SelectedSubset.h: In member function 'void pm::binary_predicate_selector<IteratorPair, Predicate>::rewind()':
334../../include/core/polymake/SelectedSubset.h:449:97: warning: typedef 'error_if_unimplemented' locally defined but not used [-Wunused-local-typedefs]
335       typedef typename enable_if<super, check_iterator_feature<super, rewindable>::value>::type error_if_unimplemented;
336                                                                                                 ^
337In file included from ../../include/core/polymake/internal/iterator_zipper.h:22:0,
338                 from ../../include/core/polymake/internal/sparse.h:24,
339                 from ../../include/core/polymake/TransformedContainer.h:21,
340                 from ../../include/core/polymake/internal/converters.h:23,
341                 from ../../include/core/polymake/Array.h:26,
342                 from ../../include/core-wrappers/polymake/Array.h:21,
343                 from ../../include/core/polymake/Ring.h:21,
344                 from ../../include/core-wrappers/polymake/Ring.h:21,
345                 from ../../lib/core/src/Ring.cc:18:
346../../include/core/polymake/ContainerUnion.h: In member function 'bool pm::iterator_union<IteratorList, Category>::at_end() const':
347../../include/core/polymake/ContainerUnion.h:449:10: warning: typedef 'error_if_unimplemented' locally defined but not used [-Wunused-local-typedefs]
348          error_if_unimplemented;
349          ^
350../../include/core/polymake/ContainerUnion.h: In member function 'int pm::iterator_union<IteratorList, Category>::index() const':
351../../include/core/polymake/ContainerUnion.h:456:10: warning: typedef 'error_if_unimplemented' locally defined but not used [-Wunused-local-typedefs]
352          error_if_unimplemented;
353          ^
354../../include/core/polymake/ContainerUnion.h: In member function 'void pm::iterator_union<IteratorList, Category>::rewind()':
355../../include/core/polymake/ContainerUnion.h:463:10: warning: typedef 'error_if_unimplemented' locally defined but not used [-Wunused-local-typedefs]
356          error_if_unimplemented;
357          ^
358In file included from ../../include/core/polymake/internal/sparse.h:24:0,
359                 from ../../include/core/polymake/TransformedContainer.h:21,
360                 from ../../include/core/polymake/internal/converters.h:23,
361                 from ../../include/core/polymake/Array.h:26,
362                 from ../../include/core-wrappers/polymake/Array.h:21,
363                 from ../../include/core/polymake/Ring.h:21,
364                 from ../../include/core-wrappers/polymake/Ring.h:21,
365                 from ../../lib/core/src/Ring.cc:18:
366../../include/core/polymake/internal/iterator_zipper.h: In member function 'pm::iterator_zipper<Iterator1, Iterator2, Comparator, Controller, _use_index1, _use_index2>& pm::iterator_zipper<Iterator1, Iterator2, Comparator, Controller, _use_index1, _use_index2>::operator--()':
367../../include/core/polymake/internal/iterator_zipper.h:198:10: warning: typedef 'error_if_unimplemented' locally defined but not used [-Wunused-local-typedefs]
368          error_if_unimplemented;
369          ^
370../../include/core/polymake/internal/iterator_zipper.h: In member function 'void pm::iterator_zipper<Iterator1, Iterator2, Comparator, Controller, _use_index1, _use_index2>::rewind()':
371../../include/core/polymake/internal/iterator_zipper.h:225:10: warning: typedef 'error_if_unimplemented' locally defined but not used [-Wunused-local-typedefs]
372          error_if_unimplemented;
373          ^
374In file included from ../../include/core/polymake/internal/converters.h:23:0,
375                 from ../../include/core/polymake/Array.h:26,
376                 from ../../include/core-wrappers/polymake/Array.h:21,
377                 from ../../include/core/polymake/Ring.h:21,
378                 from ../../include/core-wrappers/polymake/Ring.h:21,
379                 from ../../lib/core/src/Ring.cc:18:
380../../include/core/polymake/TransformedContainer.h: In member function 'void pm::iterator_product<Iterator1, Iterator2, _has_state1, true>::rewind()':
381../../include/core/polymake/TransformedContainer.h:429:10: warning: typedef 'error_if_unimplemented' locally defined but not used [-Wunused-local-typedefs]
382          error_if_unimplemented;
383          ^
384g++ -c -o RandomGenerators.o -fPIC -I/opt/sage_flatsurf/local/var/tmp/sage/build/polymake-2.12/src/include/core-wrappers -I/opt/sage_flatsurf/local/var/tmp/sage/build/polymake-2.12/src/include/core -march=native -ftemplate-depth-200 -Wall -Wno-strict-aliasing -Wno-parentheses -I/opt/sage_flatsurf/local/include -DNDEBUG -DPOLYMAKE_DEBUG=0 -O3 -MD -MF RandomGenerators.d -MT 'RandomGenerators.o'    /opt/sage_flatsurf/local/var/tmp/sage/build/polymake-2.12/src/lib/core/src/RandomGenerators.cc
385In file included from ../../include/core/polymake/internal/operations_basic_defs.h:21:0,
386                 from ../../include/core/polymake/internal/operations.h:21,
387                 from ../../include/core/polymake/Integer.h:25,
388                 from ../../include/core-wrappers/polymake/Integer.h:21,
389                 from ../../include/core/polymake/Rational.h:26,
390                 from ../../include/core-wrappers/polymake/Rational.h:21,
391                 from ../../include/core/polymake/RandomGenerators.h:21,
392                 from ../../lib/core/src/RandomGenerators.cc:18:
393../../include/core/polymake/internal/type_manip.h: In function 'void pm::assert_overloaded(T, T)':
394../../include/core/polymake/internal/type_manip.h:764:47: warning: typedef 'method_must_be_overloaded' locally defined but not used [-Wunused-local-typedefs]
395    typedef typename enable_if<T, false>::type method_must_be_overloaded;
396                                               ^
397In file included from ../../include/core/polymake/internal/operations.h:22:0,
398                 from ../../include/core/polymake/Integer.h:25,
399                 from ../../include/core-wrappers/polymake/Integer.h:21,
400                 from ../../include/core/polymake/Rational.h:26,
401                 from ../../include/core-wrappers/polymake/Rational.h:21,
402                 from ../../include/core/polymake/RandomGenerators.h:21,
403                 from ../../lib/core/src/RandomGenerators.cc:18:
404../../include/core/polymake/internal/iterators.h: In member function 'pm::iterator_pair<Iterator1, Iterator2, Params>::difference_type pm::iterator_pair<Iterator1, Iterator2, Params>::operator-(const iterator&) const':
405../../include/core/polymake/internal/iterators.h:2270:10: warning: typedef 'error_if_unimplemented' locally defined but not used [-Wunused-local-typedefs]
406          error_if_unimplemented;
407          ^
408../../include/core/polymake/internal/iterators.h: In member function 'pm::iterator_pair<Iterator1, Iterator2, Params>::difference_type pm::iterator_pair<Iterator1, Iterator2, Params>::operator-(typename pm::assign_const<pm::iterator_pair<typename pm::iterator_traits<Iterator1>::const_iterator, typename pm::iterator_traits<Iterator2>::const_iterator, Params>, (! pm::identical<pm::iterator_pair<typename pm::iterator_traits<Iterator1>::iterator, typename pm::iterator_traits<Iterator2>::iterator, Params>, pm::iterator_pair<typename pm::iterator_traits<Iterator1>::const_iterator, typename pm::iterator_traits<Iterator2>::const_iterator, Params> >::value)>::type&) const':
409../../include/core/polymake/internal/iterators.h:2276:10: warning: typedef 'error_if_unimplemented' locally defined but not used [-Wunused-local-typedefs]
410          error_if_unimplemented;
411          ^
412../../include/core/polymake/internal/iterators.h: In member function 'bool pm::iterator_pair<Iterator1, Iterator2, Params>::at_end() const':
413../../include/core/polymake/internal/iterators.h:2313:62: warning: typedef 'error_if_unimplemented' locally defined but not used [-Wunused-local-typedefs]
414       typedef typename enable_if<bool, _enable_at_end>::type error_if_unimplemented;
415                                                              ^
416../../include/core/polymake/internal/iterators.h: In member function 'int pm::iterator_pair<Iterator1, Iterator2, Params>::index() const':
417../../include/core/polymake/internal/iterators.h:2332:60: warning: typedef 'error_if_unimplemented' locally defined but not used [-Wunused-local-typedefs]
418       typedef typename enable_if<int, _enable_index>::type error_if_unimplemented;
419                                                            ^
420../../include/core/polymake/internal/iterators.h: In member function 'void pm::iterator_pair<Iterator1, Iterator2, Params>::rewind()':
421../../include/core/polymake/internal/iterators.h:2344:61: warning: typedef 'error_if_unimplemented' locally defined but not used [-Wunused-local-typedefs]
422       typedef typename enable_if<void,_enable_rewind>::type error_if_unimplemented;
423                                                             ^
424In file included from ../../include/core/polymake/internal/sparse.h:23:0,
425                 from ../../include/core/polymake/TransformedContainer.h:21,
426                 from ../../include/core/polymake/internal/comparators.h:22,
427                 from ../../include/core/polymake/Integer.h:26,
428                 from ../../include/core-wrappers/polymake/Integer.h:21,
429                 from ../../include/core/polymake/Rational.h:26,
430                 from ../../include/core-wrappers/polymake/Rational.h:21,
431                 from ../../include/core/polymake/RandomGenerators.h:21,
432                 from ../../lib/core/src/RandomGenerators.cc:18:
433../../include/core/polymake/SelectedSubset.h: In member function 'void pm::unary_predicate_selector<Iterator, Predicate>::rewind()':
434../../include/core/polymake/SelectedSubset.h:79:97: warning: typedef 'error_if_unimplemented' locally defined but not used [-Wunused-local-typedefs]
435       typedef typename enable_if<super, check_iterator_feature<super, rewindable>::value>::type error_if_unimplemented;
436                                                                                                 ^
437In file included from ../../include/core/polymake/internal/sparse.h:23:0,
438                 from ../../include/core/polymake/TransformedContainer.h:21,
439                 from ../../include/core/polymake/internal/comparators.h:22,
440                 from ../../include/core/polymake/Integer.h:26,
441                 from ../../include/core-wrappers/polymake/Integer.h:21,
442                 from ../../include/core/polymake/Rational.h:26,
443                 from ../../include/core-wrappers/polymake/Rational.h:21,
444                 from ../../include/core/polymake/RandomGenerators.h:21,
445                 from ../../lib/core/src/RandomGenerators.cc:18:
446../../include/core/polymake/SelectedSubset.h: In member function 'pm::binary_predicate_selector<IteratorPair, Predicate>& pm::binary_predicate_selector<IteratorPair, Predicate>::operator--()':
447../../include/core/polymake/SelectedSubset.h:436:89: warning: typedef 'error_if_unimplemented' locally defined but not used [-Wunused-local-typedefs]
448       typedef typename enable_if<super, iterator_traits<super>::is_bidirectional>::type error_if_unimplemented;
449                                                                                         ^
450../../include/core/polymake/SelectedSubset.h: In member function 'void pm::binary_predicate_selector<IteratorPair, Predicate>::rewind()':
451../../include/core/polymake/SelectedSubset.h:449:97: warning: typedef 'error_if_unimplemented' locally defined but not used [-Wunused-local-typedefs]
452       typedef typename enable_if<super, check_iterator_feature<super, rewindable>::value>::type error_if_unimplemented;
453                                                                                                 ^
454In file included from ../../include/core/polymake/internal/iterator_zipper.h:22:0,
455                 from ../../include/core/polymake/internal/sparse.h:24,
456                 from ../../include/core/polymake/TransformedContainer.h:21,
457                 from ../../include/core/polymake/internal/comparators.h:22,
458                 from ../../include/core/polymake/Integer.h:26,
459                 from ../../include/core-wrappers/polymake/Integer.h:21,
460                 from ../../include/core/polymake/Rational.h:26,
461                 from ../../include/core-wrappers/polymake/Rational.h:21,
462                 from ../../include/core/polymake/RandomGenerators.h:21,
463                 from ../../lib/core/src/RandomGenerators.cc:18:
464../../include/core/polymake/ContainerUnion.h: In member function 'bool pm::iterator_union<IteratorList, Category>::at_end() const':
465../../include/core/polymake/ContainerUnion.h:449:10: warning: typedef 'error_if_unimplemented' locally defined but not used [-Wunused-local-typedefs]
466          error_if_unimplemented;
467          ^
468../../include/core/polymake/ContainerUnion.h: In member function 'int pm::iterator_union<IteratorList, Category>::index() const':
469../../include/core/polymake/ContainerUnion.h:456:10: warning: typedef 'error_if_unimplemented' locally defined but not used [-Wunused-local-typedefs]
470          error_if_unimplemented;
471          ^
472../../include/core/polymake/ContainerUnion.h: In member function 'void pm::iterator_union<IteratorList, Category>::rewind()':
473../../include/core/polymake/ContainerUnion.h:463:10: warning: typedef 'error_if_unimplemented' locally defined but not used [-Wunused-local-typedefs]
474          error_if_unimplemented;
475          ^
476In file included from ../../include/core/polymake/internal/sparse.h:24:0,
477                 from ../../include/core/polymake/TransformedContainer.h:21,
478                 from ../../include/core/polymake/internal/comparators.h:22,
479                 from ../../include/core/polymake/Integer.h:26,
480                 from ../../include/core-wrappers/polymake/Integer.h:21,
481                 from ../../include/core/polymake/Rational.h:26,
482                 from ../../include/core-wrappers/polymake/Rational.h:21,
483                 from ../../include/core/polymake/RandomGenerators.h:21,
484                 from ../../lib/core/src/RandomGenerators.cc:18:
485../../include/core/polymake/internal/iterator_zipper.h: In member function 'pm::iterator_zipper<Iterator1, Iterator2, Comparator, Controller, _use_index1, _use_index2>& pm::iterator_zipper<Iterator1, Iterator2, Comparator, Controller, _use_index1, _use_index2>::operator--()':
486../../include/core/polymake/internal/iterator_zipper.h:198:10: warning: typedef 'error_if_unimplemented' locally defined but not used [-Wunused-local-typedefs]
487          error_if_unimplemented;
488          ^
489../../include/core/polymake/internal/iterator_zipper.h: In member function 'void pm::iterator_zipper<Iterator1, Iterator2, Comparator, Controller, _use_index1, _use_index2>::rewind()':
490../../include/core/polymake/internal/iterator_zipper.h:225:10: warning: typedef 'error_if_unimplemented' locally defined but not used [-Wunused-local-typedefs]
491          error_if_unimplemented;
492          ^
493In file included from ../../include/core/polymake/internal/comparators.h:22:0,
494                 from ../../include/core/polymake/Integer.h:26,
495                 from ../../include/core-wrappers/polymake/Integer.h:21,
496                 from ../../include/core/polymake/Rational.h:26,
497                 from ../../include/core-wrappers/polymake/Rational.h:21,
498                 from ../../include/core/polymake/RandomGenerators.h:21,
499                 from ../../lib/core/src/RandomGenerators.cc:18:
500../../include/core/polymake/TransformedContainer.h: In member function 'void pm::iterator_product<Iterator1, Iterator2, _has_state1, true>::rewind()':
501../../include/core/polymake/TransformedContainer.h:429:10: warning: typedef 'error_if_unimplemented' locally defined but not used [-Wunused-local-typedefs]
502          error_if_unimplemented;
503          ^
504In file included from ../../include/core/polymake/GenericVector.h:24:0,
505                 from ../../include/core/polymake/Vector.h:25,
506                 from ../../include/core-wrappers/polymake/Vector.h:21,
507                 from ../../include/core/polymake/RandomGenerators.h:24,
508                 from ../../lib/core/src/RandomGenerators.cc:18:
509../../include/core/polymake/IndexedSubset.h: In member function 'pm::indexed_selector<Iterator1, Iterator2, renumber, _reversed>& pm::indexed_selector<Iterator1, Iterator2, renumber, _reversed>::operator--()':
510../../include/core/polymake/IndexedSubset.h:183:107: warning: typedef 'error_if_unimplemented' locally defined but not used [-Wunused-local-typedefs]
511       typedef typename enable_if<void, iterator_pair_traits<Iterator1,Iterator2>::is_bidirectional>::type error_if_unimplemented;
512                                                                                                           ^
513../../include/core/polymake/IndexedSubset.h: In member function 'pm::indexed_selector<Iterator1, Iterator2, renumber, _reversed>& pm::indexed_selector<Iterator1, Iterator2, renumber, _reversed>::operator+=(int)':
514../../include/core/polymake/IndexedSubset.h:191:100: warning: typedef 'error_if_unimplemented' locally defined but not used [-Wunused-local-typedefs]
515       typedef typename enable_if<void, iterator_pair_traits<Iterator1,Iterator2>::is_random>::type error_if_unimplemented;
516                                                                                                    ^
517../../include/core/polymake/IndexedSubset.h: In member function 'pm::indexed_selector<Iterator1, Iterator2, renumber, _reversed>& pm::indexed_selector<Iterator1, Iterator2, renumber, _reversed>::operator-=(int)':
518../../include/core/polymake/IndexedSubset.h:197:100: warning: typedef 'error_if_unimplemented' locally defined but not used [-Wunused-local-typedefs]
519       typedef typename enable_if<void, iterator_pair_traits<Iterator1,Iterator2>::is_random>::type error_if_unimplemented;
520                                                                                                    ^
521../../include/core/polymake/IndexedSubset.h: In member function 'typename pm::enable_if<typename pm::iterator_traits<Iterator2>::difference_type, pm::comparable_iterator<pm::indexed_selector<Iterator1, Iterator2, renumber, _reversed>, Iterator>::value>::type pm::indexed_selector<Iterator1, Iterator2, renumber, _reversed>::operator-(const Iterator&) const':
522../../include/core/polymake/IndexedSubset.h:210:100: warning: typedef 'error_if_unimplemented' locally defined but not used [-Wunused-local-typedefs]
523       typedef typename enable_if<void, iterator_pair_traits<Iterator1,Iterator2>::is_random>::type error_if_unimplemented;
524                                                                                                    ^
525../../include/core/polymake/IndexedSubset.h: In member function 'typename pm::iterator_traits<Iterator1>::derivable_type::reference pm::indexed_selector<Iterator1, Iterator2, renumber, _reversed>::operator[](int) const':
526../../include/core/polymake/IndexedSubset.h:216:100: warning: typedef 'error_if_unimplemented' locally defined but not used [-Wunused-local-typedefs]
527       typedef typename enable_if<void, iterator_pair_traits<Iterator1,Iterator2>::is_random>::type error_if_unimplemented;
528                                                                                                    ^
529../../include/core/polymake/IndexedSubset.h: In member function 'void pm::indexed_selector<Iterator1, Iterator2, renumber, _reversed>::rewind()':
530../../include/core/polymake/IndexedSubset.h:250:3: warning: typedef 'error_if_unimplemented' locally defined but not used [-Wunused-local-typedefs]
531   error_if_unimplemented;
532   ^
533../../include/core/polymake/IndexedSubset.h: In member function 'void pm::indexed_selector<Iterator1, Iterator2, renumber, _reversed>::contract(bool, int, int)':
534../../include/core/polymake/IndexedSubset.h:258:3: warning: typedef 'error_if_unimplemented' locally defined but not used [-Wunused-local-typedefs]
535   error_if_unimplemented;
536   ^
537In file included from ../../include/core/polymake/GenericVector.h:26:0,
538                 from ../../include/core/polymake/Vector.h:25,
539                 from ../../include/core-wrappers/polymake/Vector.h:21,
540                 from ../../include/core/polymake/RandomGenerators.h:24,
541                 from ../../lib/core/src/RandomGenerators.cc:18:
542../../include/core/polymake/ContainerChain.h: In member function 'void pm::iterator_chain<IteratorList, _reversed>::rewind()':
543../../include/core/polymake/ContainerChain.h:463:10: warning: typedef 'error_if_unimplemented' locally defined but not used [-Wunused-local-typedefs]
544          error_if_unimplemented;
545          ^
546../../include/core/polymake/ContainerChain.h: In member function 'int pm::iterator_chain<IteratorList, _reversed>::index() const':
547../../include/core/polymake/ContainerChain.h:472:10: warning: typedef 'error_if_unimplemented' locally defined but not used [-Wunused-local-typedefs]
548          error_if_unimplemented;
549          ^
550g++ -c -o Rational.o -fPIC -I/opt/sage_flatsurf/local/var/tmp/sage/build/polymake-2.12/src/include/core-wrappers -I/opt/sage_flatsurf/local/var/tmp/sage/build/polymake-2.12/src/include/core -march=native -ftemplate-depth-200 -Wall -Wno-strict-aliasing -Wno-parentheses -I/opt/sage_flatsurf/local/include -DNDEBUG -DPOLYMAKE_DEBUG=0 -O3 -MD -MF Rational.d -MT 'Rational.o'    /opt/sage_flatsurf/local/var/tmp/sage/build/polymake-2.12/src/lib/core/src/Rational.cc
551In file included from ../../include/core/polymake/internal/operations_basic_defs.h:21:0,
552                 from ../../include/core/polymake/internal/operations.h:21,
553                 from ../../include/core/polymake/Integer.h:25,
554                 from ../../include/core-wrappers/polymake/Integer.h:21,
555                 from ../../include/core/polymake/Rational.h:26,
556                 from ../../include/core-wrappers/polymake/Rational.h:21,
557                 from ../../lib/core/src/Rational.cc:18:
558../../include/core/polymake/internal/type_manip.h: In function 'void pm::assert_overloaded(T, T)':
559../../include/core/polymake/internal/type_manip.h:764:47: warning: typedef 'method_must_be_overloaded' locally defined but not used [-Wunused-local-typedefs]
560    typedef typename enable_if<T, false>::type method_must_be_overloaded;
561                                               ^
562In file included from ../../include/core/polymake/internal/operations.h:22:0,
563                 from ../../include/core/polymake/Integer.h:25,
564                 from ../../include/core-wrappers/polymake/Integer.h:21,
565                 from ../../include/core/polymake/Rational.h:26,
566                 from ../../include/core-wrappers/polymake/Rational.h:21,
567                 from ../../lib/core/src/Rational.cc:18:
568../../include/core/polymake/internal/iterators.h: In member function 'pm::iterator_pair<Iterator1, Iterator2, Params>::difference_type pm::iterator_pair<Iterator1, Iterator2, Params>::operator-(const iterator&) const':
569../../include/core/polymake/internal/iterators.h:2270:10: warning: typedef 'error_if_unimplemented' locally defined but not used [-Wunused-local-typedefs]
570          error_if_unimplemented;
571          ^
572../../include/core/polymake/internal/iterators.h: In member function 'pm::iterator_pair<Iterator1, Iterator2, Params>::difference_type pm::iterator_pair<Iterator1, Iterator2, Params>::operator-(typename pm::assign_const<pm::iterator_pair<typename pm::iterator_traits<Iterator1>::const_iterator, typename pm::iterator_traits<Iterator2>::const_iterator, Params>, (! pm::identical<pm::iterator_pair<typename pm::iterator_traits<Iterator1>::iterator, typename pm::iterator_traits<Iterator2>::iterator, Params>, pm::iterator_pair<typename pm::iterator_traits<Iterator1>::const_iterator, typename pm::iterator_traits<Iterator2>::const_iterator, Params> >::value)>::type&) const':
573../../include/core/polymake/internal/iterators.h:2276:10: warning: typedef 'error_if_unimplemented' locally defined but not used [-Wunused-local-typedefs]
574          error_if_unimplemented;
575          ^
576../../include/core/polymake/internal/iterators.h: In member function 'bool pm::iterator_pair<Iterator1, Iterator2, Params>::at_end() const':
577../../include/core/polymake/internal/iterators.h:2313:62: warning: typedef 'error_if_unimplemented' locally defined but not used [-Wunused-local-typedefs]
578       typedef typename enable_if<bool, _enable_at_end>::type error_if_unimplemented;
579                                                              ^
580../../include/core/polymake/internal/iterators.h: In member function 'int pm::iterator_pair<Iterator1, Iterator2, Params>::index() const':
581../../include/core/polymake/internal/iterators.h:2332:60: warning: typedef 'error_if_unimplemented' locally defined but not used [-Wunused-local-typedefs]
582       typedef typename enable_if<int, _enable_index>::type error_if_unimplemented;
583                                                            ^
584../../include/core/polymake/internal/iterators.h: In member function 'void pm::iterator_pair<Iterator1, Iterator2, Params>::rewind()':
585../../include/core/polymake/internal/iterators.h:2344:61: warning: typedef 'error_if_unimplemented' locally defined but not used [-Wunused-local-typedefs]
586       typedef typename enable_if<void,_enable_rewind>::type error_if_unimplemented;
587                                                             ^
588In file included from ../../include/core/polymake/internal/sparse.h:23:0,
589                 from ../../include/core/polymake/TransformedContainer.h:21,
590                 from ../../include/core/polymake/internal/comparators.h:22,
591                 from ../../include/core/polymake/Integer.h:26,
592                 from ../../include/core-wrappers/polymake/Integer.h:21,
593                 from ../../include/core/polymake/Rational.h:26,
594                 from ../../include/core-wrappers/polymake/Rational.h:21,
595                 from ../../lib/core/src/Rational.cc:18:
596../../include/core/polymake/SelectedSubset.h: In member function 'void pm::unary_predicate_selector<Iterator, Predicate>::rewind()':
597../../include/core/polymake/SelectedSubset.h:79:97: warning: typedef 'error_if_unimplemented' locally defined but not used [-Wunused-local-typedefs]
598       typedef typename enable_if<super, check_iterator_feature<super, rewindable>::value>::type error_if_unimplemented;
599                                                                                                 ^
600In file included from ../../include/core/polymake/internal/sparse.h:23:0,
601                 from ../../include/core/polymake/TransformedContainer.h:21,
602                 from ../../include/core/polymake/internal/comparators.h:22,
603                 from ../../include/core/polymake/Integer.h:26,
604                 from ../../include/core-wrappers/polymake/Integer.h:21,
605                 from ../../include/core/polymake/Rational.h:26,
606                 from ../../include/core-wrappers/polymake/Rational.h:21,
607                 from ../../lib/core/src/Rational.cc:18:
608../../include/core/polymake/SelectedSubset.h: In member function 'pm::binary_predicate_selector<IteratorPair, Predicate>& pm::binary_predicate_selector<IteratorPair, Predicate>::operator--()':
609../../include/core/polymake/SelectedSubset.h:436:89: warning: typedef 'error_if_unimplemented' locally defined but not used [-Wunused-local-typedefs]
610       typedef typename enable_if<super, iterator_traits<super>::is_bidirectional>::type error_if_unimplemented;
611                                                                                         ^
612../../include/core/polymake/SelectedSubset.h: In member function 'void pm::binary_predicate_selector<IteratorPair, Predicate>::rewind()':
613../../include/core/polymake/SelectedSubset.h:449:97: warning: typedef 'error_if_unimplemented' locally defined but not used [-Wunused-local-typedefs]
614       typedef typename enable_if<super, check_iterator_feature<super, rewindable>::value>::type error_if_unimplemented;
615                                                                                                 ^
616In file included from ../../include/core/polymake/internal/iterator_zipper.h:22:0,
617                 from ../../include/core/polymake/internal/sparse.h:24,
618                 from ../../include/core/polymake/TransformedContainer.h:21,
619                 from ../../include/core/polymake/internal/comparators.h:22,
620                 from ../../include/core/polymake/Integer.h:26,
621                 from ../../include/core-wrappers/polymake/Integer.h:21,
622                 from ../../include/core/polymake/Rational.h:26,
623                 from ../../include/core-wrappers/polymake/Rational.h:21,
624                 from ../../lib/core/src/Rational.cc:18:
625../../include/core/polymake/ContainerUnion.h: In member function 'bool pm::iterator_union<IteratorList, Category>::at_end() const':
626../../include/core/polymake/ContainerUnion.h:449:10: warning: typedef 'error_if_unimplemented' locally defined but not used [-Wunused-local-typedefs]
627          error_if_unimplemented;
628          ^
629../../include/core/polymake/ContainerUnion.h: In member function 'int pm::iterator_union<IteratorList, Category>::index() const':
630../../include/core/polymake/ContainerUnion.h:456:10: warning: typedef 'error_if_unimplemented' locally defined but not used [-Wunused-local-typedefs]
631          error_if_unimplemented;
632          ^
633../../include/core/polymake/ContainerUnion.h: In member function 'void pm::iterator_union<IteratorList, Category>::rewind()':
634../../include/core/polymake/ContainerUnion.h:463:10: warning: typedef 'error_if_unimplemented' locally defined but not used [-Wunused-local-typedefs]
635          error_if_unimplemented;
636          ^
637In file included from ../../include/core/polymake/internal/sparse.h:24:0,
638                 from ../../include/core/polymake/TransformedContainer.h:21,
639                 from ../../include/core/polymake/internal/comparators.h:22,
640                 from ../../include/core/polymake/Integer.h:26,
641                 from ../../include/core-wrappers/polymake/Integer.h:21,
642                 from ../../include/core/polymake/Rational.h:26,
643                 from ../../include/core-wrappers/polymake/Rational.h:21,
644                 from ../../lib/core/src/Rational.cc:18:
645../../include/core/polymake/internal/iterator_zipper.h: In member function 'pm::iterator_zipper<Iterator1, Iterator2, Comparator, Controller, _use_index1, _use_index2>& pm::iterator_zipper<Iterator1, Iterator2, Comparator, Controller, _use_index1, _use_index2>::operator--()':
646../../include/core/polymake/internal/iterator_zipper.h:198:10: warning: typedef 'error_if_unimplemented' locally defined but not used [-Wunused-local-typedefs]
647          error_if_unimplemented;
648          ^
649../../include/core/polymake/internal/iterator_zipper.h: In member function 'void pm::iterator_zipper<Iterator1, Iterator2, Comparator, Controller, _use_index1, _use_index2>::rewind()':
650../../include/core/polymake/internal/iterator_zipper.h:225:10: warning: typedef 'error_if_unimplemented' locally defined but not used [-Wunused-local-typedefs]
651          error_if_unimplemented;
652          ^
653In file included from ../../include/core/polymake/internal/comparators.h:22:0,
654                 from ../../include/core/polymake/Integer.h:26,
655                 from ../../include/core-wrappers/polymake/Integer.h:21,
656                 from ../../include/core/polymake/Rational.h:26,
657                 from ../../include/core-wrappers/polymake/Rational.h:21,
658                 from ../../lib/core/src/Rational.cc:18:
659../../include/core/polymake/TransformedContainer.h: In member function 'void pm::iterator_product<Iterator1, Iterator2, _has_state1, true>::rewind()':
660../../include/core/polymake/TransformedContainer.h:429:10: warning: typedef 'error_if_unimplemented' locally defined but not used [-Wunused-local-typedefs]
661          error_if_unimplemented;
662          ^
663g++ -c -o CharBuffer.o -fPIC -I/opt/sage_flatsurf/local/var/tmp/sage/build/polymake-2.12/src/include/core-wrappers -I/opt/sage_flatsurf/local/var/tmp/sage/build/polymake-2.12/src/include/core -march=native -ftemplate-depth-200 -Wall -Wno-strict-aliasing -Wno-parentheses -I/opt/sage_flatsurf/local/include -DNDEBUG -DPOLYMAKE_DEBUG=0 -O3 -MD -MF CharBuffer.d -MT 'CharBuffer.o'    /opt/sage_flatsurf/local/var/tmp/sage/build/polymake-2.12/src/lib/core/src/CharBuffer.cc
664g++ -c -o PlainParser.o -fPIC -I/opt/sage_flatsurf/local/var/tmp/sage/build/polymake-2.12/src/include/core-wrappers -I/opt/sage_flatsurf/local/var/tmp/sage/build/polymake-2.12/src/include/core -march=native -ftemplate-depth-200 -Wall -Wno-strict-aliasing -Wno-parentheses -I/opt/sage_flatsurf/local/include -DNDEBUG -DPOLYMAKE_DEBUG=0 -O3 -MD -MF PlainParser.d -MT 'PlainParser.o'    /opt/sage_flatsurf/local/var/tmp/sage/build/polymake-2.12/src/lib/core/src/PlainParser.cc
665In file included from ../../include/core/polymake/internal/operations_basic_defs.h:21:0,
666                 from ../../include/core/polymake/internal/comparators_basic_defs.h:21,
667                 from ../../include/core/polymake/internal/comparators_ops.h:24,
668                 from ../../include/core/polymake/Series.h:25,
669                 from ../../include/core/polymake/internal/sparse.h:21,
670                 from ../../include/core/polymake/GenericIO.h:21,
671                 from ../../lib/core/src/PlainParser.cc:19:
672../../include/core/polymake/internal/type_manip.h: In function 'void pm::assert_overloaded(T, T)':
673../../include/core/polymake/internal/type_manip.h:764:47: warning: typedef 'method_must_be_overloaded' locally defined but not used [-Wunused-local-typedefs]
674    typedef typename enable_if<T, false>::type method_must_be_overloaded;
675                                               ^
676In file included from ../../include/core/polymake/internal/operations.h:22:0,
677                 from ../../include/core/polymake/internal/comparators_ops.h:26,
678                 from ../../include/core/polymake/Series.h:25,
679                 from ../../include/core/polymake/internal/sparse.h:21,
680                 from ../../include/core/polymake/GenericIO.h:21,
681                 from ../../lib/core/src/PlainParser.cc:19:
682../../include/core/polymake/internal/iterators.h: In member function 'pm::iterator_pair<Iterator1, Iterator2, Params>::difference_type pm::iterator_pair<Iterator1, Iterator2, Params>::operator-(const iterator&) const':
683../../include/core/polymake/internal/iterators.h:2270:10: warning: typedef 'error_if_unimplemented' locally defined but not used [-Wunused-local-typedefs]
684          error_if_unimplemented;
685          ^
686../../include/core/polymake/internal/iterators.h: In member function 'pm::iterator_pair<Iterator1, Iterator2, Params>::difference_type pm::iterator_pair<Iterator1, Iterator2, Params>::operator-(typename pm::assign_const<pm::iterator_pair<typename pm::iterator_traits<Iterator1>::const_iterator, typename pm::iterator_traits<Iterator2>::const_iterator, Params>, (! pm::identical<pm::iterator_pair<typename pm::iterator_traits<Iterator1>::iterator, typename pm::iterator_traits<Iterator2>::iterator, Params>, pm::iterator_pair<typename pm::iterator_traits<Iterator1>::const_iterator, typename pm::iterator_traits<Iterator2>::const_iterator, Params> >::value)>::type&) const':
687../../include/core/polymake/internal/iterators.h:2276:10: warning: typedef 'error_if_unimplemented' locally defined but not used [-Wunused-local-typedefs]
688          error_if_unimplemented;
689          ^
690../../include/core/polymake/internal/iterators.h: In member function 'bool pm::iterator_pair<Iterator1, Iterator2, Params>::at_end() const':
691../../include/core/polymake/internal/iterators.h:2313:62: warning: typedef 'error_if_unimplemented' locally defined but not used [-Wunused-local-typedefs]
692       typedef typename enable_if<bool, _enable_at_end>::type error_if_unimplemented;
693                                                              ^
694../../include/core/polymake/internal/iterators.h: In member function 'int pm::iterator_pair<Iterator1, Iterator2, Params>::index() const':
695../../include/core/polymake/internal/iterators.h:2332:60: warning: typedef 'error_if_unimplemented' locally defined but not used [-Wunused-local-typedefs]
696       typedef typename enable_if<int, _enable_index>::type error_if_unimplemented;
697                                                            ^
698../../include/core/polymake/internal/iterators.h: In member function 'void pm::iterator_pair<Iterator1, Iterator2, Params>::rewind()':
699../../include/core/polymake/internal/iterators.h:2344:61: warning: typedef 'error_if_unimplemented' locally defined but not used [-Wunused-local-typedefs]
700       typedef typename enable_if<void,_enable_rewind>::type error_if_unimplemented;
701                                                             ^
702In file included from ../../include/core/polymake/internal/sparse.h:23:0,
703                 from ../../include/core/polymake/GenericIO.h:21,
704                 from ../../lib/core/src/PlainParser.cc:19:
705../../include/core/polymake/SelectedSubset.h: In member function 'void pm::unary_predicate_selector<Iterator, Predicate>::rewind()':
706../../include/core/polymake/SelectedSubset.h:79:97: warning: typedef 'error_if_unimplemented' locally defined but not used [-Wunused-local-typedefs]
707       typedef typename enable_if<super, check_iterator_feature<super, rewindable>::value>::type error_if_unimplemented;
708                                                                                                 ^
709In file included from ../../include/core/polymake/internal/sparse.h:23:0,
710                 from ../../include/core/polymake/GenericIO.h:21,
711                 from ../../lib/core/src/PlainParser.cc:19:
712../../include/core/polymake/SelectedSubset.h: In member function 'pm::binary_predicate_selector<IteratorPair, Predicate>& pm::binary_predicate_selector<IteratorPair, Predicate>::operator--()':
713../../include/core/polymake/SelectedSubset.h:436:89: warning: typedef 'error_if_unimplemented' locally defined but not used [-Wunused-local-typedefs]
714       typedef typename enable_if<super, iterator_traits<super>::is_bidirectional>::type error_if_unimplemented;
715                                                                                         ^
716../../include/core/polymake/SelectedSubset.h: In member function 'void pm::binary_predicate_selector<IteratorPair, Predicate>::rewind()':
717../../include/core/polymake/SelectedSubset.h:449:97: warning: typedef 'error_if_unimplemented' locally defined but not used [-Wunused-local-typedefs]
718       typedef typename enable_if<super, check_iterator_feature<super, rewindable>::value>::type error_if_unimplemented;
719                                                                                                 ^
720In file included from ../../include/core/polymake/internal/iterator_zipper.h:22:0,
721                 from ../../include/core/polymake/internal/sparse.h:24,
722                 from ../../include/core/polymake/GenericIO.h:21,
723                 from ../../lib/core/src/PlainParser.cc:19:
724../../include/core/polymake/ContainerUnion.h: In member function 'bool pm::iterator_union<IteratorList, Category>::at_end() const':
725../../include/core/polymake/ContainerUnion.h:449:10: warning: typedef 'error_if_unimplemented' locally defined but not used [-Wunused-local-typedefs]
726          error_if_unimplemented;
727          ^
728../../include/core/polymake/ContainerUnion.h: In member function 'int pm::iterator_union<IteratorList, Category>::index() const':
729../../include/core/polymake/ContainerUnion.h:456:10: warning: typedef 'error_if_unimplemented' locally defined but not used [-Wunused-local-typedefs]
730          error_if_unimplemented;
731          ^
732../../include/core/polymake/ContainerUnion.h: In member function 'void pm::iterator_union<IteratorList, Category>::rewind()':
733../../include/core/polymake/ContainerUnion.h:463:10: warning: typedef 'error_if_unimplemented' locally defined but not used [-Wunused-local-typedefs]
734          error_if_unimplemented;
735          ^
736In file included from ../../include/core/polymake/internal/sparse.h:24:0,
737                 from ../../include/core/polymake/GenericIO.h:21,
738                 from ../../lib/core/src/PlainParser.cc:19:
739../../include/core/polymake/internal/iterator_zipper.h: In member function 'pm::iterator_zipper<Iterator1, Iterator2, Comparator, Controller, _use_index1, _use_index2>& pm::iterator_zipper<Iterator1, Iterator2, Comparator, Controller, _use_index1, _use_index2>::operator--()':
740../../include/core/polymake/internal/iterator_zipper.h:198:10: warning: typedef 'error_if_unimplemented' locally defined but not used [-Wunused-local-typedefs]
741          error_if_unimplemented;
742          ^
743../../include/core/polymake/internal/iterator_zipper.h: In member function 'void pm::iterator_zipper<Iterator1, Iterator2, Comparator, Controller, _use_index1, _use_index2>::rewind()':
744../../include/core/polymake/internal/iterator_zipper.h:225:10: warning: typedef 'error_if_unimplemented' locally defined but not used [-Wunused-local-typedefs]
745          error_if_unimplemented;
746          ^
747In file included from ../../include/core/polymake/internal/comparators.h:22:0,
748                 from ../../include/core/polymake/Integer.h:26,
749                 from ../../include/core-wrappers/polymake/Integer.h:21,
750                 from ../../include/core/polymake/Rational.h:26,
751                 from ../../include/core-wrappers/polymake/Rational.h:21,
752                 from ../../lib/core/src/PlainParser.cc:20:
753../../include/core/polymake/TransformedContainer.h: In member function 'void pm::iterator_product<Iterator1, Iterator2, _has_state1, true>::rewind()':
754../../include/core/polymake/TransformedContainer.h:429:10: warning: typedef 'error_if_unimplemented' locally defined but not used [-Wunused-local-typedefs]
755          error_if_unimplemented;
756          ^
757g++ -c -o inlines.o -fPIC -I/opt/sage_flatsurf/local/var/tmp/sage/build/polymake-2.12/src/include/core-wrappers -I/opt/sage_flatsurf/local/var/tmp/sage/build/polymake-2.12/src/include/core -march=native -ftemplate-depth-200 -Wall -Wno-strict-aliasing -Wno-parentheses -I/opt/sage_flatsurf/local/include -DNDEBUG -DPOLYMAKE_DEBUG=0 -O3 -MD -MF inlines.d -MT 'inlines.o'    /opt/sage_flatsurf/local/var/tmp/sage/build/polymake-2.12/src/lib/core/src/inlines.cc
758In file included from ../../include/core/polymake/internal/operations_basic_defs.h:21:0,
759                 from ../../include/core/polymake/internal/comparators_basic_defs.h:21,
760                 from ../../include/core/polymake/pair.h:21,
761                 from ../../lib/core/src/inlines.cc:18:
762../../include/core/polymake/internal/type_manip.h: In function 'void pm::assert_overloaded(T, T)':
763../../include/core/polymake/internal/type_manip.h:764:47: warning: typedef 'method_must_be_overloaded' locally defined but not used [-Wunused-local-typedefs]
764    typedef typename enable_if<T, false>::type method_must_be_overloaded;
765                                               ^
766In file included from ../../include/core/polymake/internal/operations.h:22:0,
767                 from ../../include/core/polymake/internal/comparators_ops.h:26,
768                 from ../../lib/core/src/inlines.cc:19:
769../../include/core/polymake/internal/iterators.h: In member function 'pm::iterator_pair<Iterator1, Iterator2, Params>::difference_type pm::iterator_pair<Iterator1, Iterator2, Params>::operator-(const iterator&) const':
770../../include/core/polymake/internal/iterators.h:2270:10: warning: typedef 'error_if_unimplemented' locally defined but not used [-Wunused-local-typedefs]
771          error_if_unimplemented;
772          ^
773../../include/core/polymake/internal/iterators.h: In member function 'pm::iterator_pair<Iterator1, Iterator2, Params>::difference_type pm::iterator_pair<Iterator1, Iterator2, Params>::operator-(typename pm::assign_const<pm::iterator_pair<typename pm::iterator_traits<Iterator1>::const_iterator, typename pm::iterator_traits<Iterator2>::const_iterator, Params>, (! pm::identical<pm::iterator_pair<typename pm::iterator_traits<Iterator1>::iterator, typename pm::iterator_traits<Iterator2>::iterator, Params>, pm::iterator_pair<typename pm::iterator_traits<Iterator1>::const_iterator, typename pm::iterator_traits<Iterator2>::const_iterator, Params> >::value)>::type&) const':
774../../include/core/polymake/internal/iterators.h:2276:10: warning: typedef 'error_if_unimplemented' locally defined but not used [-Wunused-local-typedefs]
775          error_if_unimplemented;
776          ^
777../../include/core/polymake/internal/iterators.h: In member function 'bool pm::iterator_pair<Iterator1, Iterator2, Params>::at_end() const':
778../../include/core/polymake/internal/iterators.h:2313:62: warning: typedef 'error_if_unimplemented' locally defined but not used [-Wunused-local-typedefs]
779       typedef typename enable_if<bool, _enable_at_end>::type error_if_unimplemented;
780                                                              ^
781../../include/core/polymake/internal/iterators.h: In member function 'int pm::iterator_pair<Iterator1, Iterator2, Params>::index() const':
782../../include/core/polymake/internal/iterators.h:2332:60: warning: typedef 'error_if_unimplemented' locally defined but not used [-Wunused-local-typedefs]
783       typedef typename enable_if<int, _enable_index>::type error_if_unimplemented;
784                                                            ^
785../../include/core/polymake/internal/iterators.h: In member function 'void pm::iterator_pair<Iterator1, Iterator2, Params>::rewind()':
786../../include/core/polymake/internal/iterators.h:2344:61: warning: typedef 'error_if_unimplemented' locally defined but not used [-Wunused-local-typedefs]
787       typedef typename enable_if<void,_enable_rewind>::type error_if_unimplemented;
788                                                             ^
789g++ -c -o Bitset.o -fPIC -I/opt/sage_flatsurf/local/var/tmp/sage/build/polymake-2.12/src/include/core-wrappers -I/opt/sage_flatsurf/local/var/tmp/sage/build/polymake-2.12/src/include/core -march=native -ftemplate-depth-200 -Wall -Wno-strict-aliasing -Wno-parentheses -I/opt/sage_flatsurf/local/include -DNDEBUG -DPOLYMAKE_DEBUG=0 -O3 -MD -MF Bitset.d -MT 'Bitset.o'    /opt/sage_flatsurf/local/var/tmp/sage/build/polymake-2.12/src/lib/core/src/Bitset.cc
790In file included from ../../include/core/polymake/internal/operations_basic_defs.h:21:0,
791                 from ../../include/core/polymake/internal/comparators_basic_defs.h:21,
792                 from ../../include/core/polymake/internal/comparators_ops.h:24,
793                 from ../../include/core/polymake/Series.h:25,
794                 from ../../include/core/polymake/GenericSet.h:27,
795                 from ../../include/core/polymake/Bitset.h:21,
796                 from ../../lib/core/src/Bitset.cc:18:
797../../include/core/polymake/internal/type_manip.h: In function 'void pm::assert_overloaded(T, T)':
798../../include/core/polymake/internal/type_manip.h:764:47: warning: typedef 'method_must_be_overloaded' locally defined but not used [-Wunused-local-typedefs]
799    typedef typename enable_if<T, false>::type method_must_be_overloaded;
800                                               ^
801In file included from ../../include/core/polymake/internal/operations.h:22:0,
802                 from ../../include/core/polymake/internal/comparators_ops.h:26,
803                 from ../../include/core/polymake/Series.h:25,
804                 from ../../include/core/polymake/GenericSet.h:27,
805                 from ../../include/core/polymake/Bitset.h:21,
806                 from ../../lib/core/src/Bitset.cc:18:
807../../include/core/polymake/internal/iterators.h: In member function 'pm::iterator_pair<Iterator1, Iterator2, Params>::difference_type pm::iterator_pair<Iterator1, Iterator2, Params>::operator-(const iterator&) const':
808../../include/core/polymake/internal/iterators.h:2270:10: warning: typedef 'error_if_unimplemented' locally defined but not used [-Wunused-local-typedefs]
809          error_if_unimplemented;
810          ^
811../../include/core/polymake/internal/iterators.h: In member function 'pm::iterator_pair<Iterator1, Iterator2, Params>::difference_type pm::iterator_pair<Iterator1, Iterator2, Params>::operator-(typename pm::assign_const<pm::iterator_pair<typename pm::iterator_traits<Iterator1>::const_iterator, typename pm::iterator_traits<Iterator2>::const_iterator, Params>, (! pm::identical<pm::iterator_pair<typename pm::iterator_traits<Iterator1>::iterator, typename pm::iterator_traits<Iterator2>::iterator, Params>, pm::iterator_pair<typename pm::iterator_traits<Iterator1>::const_iterator, typename pm::iterator_traits<Iterator2>::const_iterator, Params> >::value)>::type&) const':
812../../include/core/polymake/internal/iterators.h:2276:10: warning: typedef 'error_if_unimplemented' locally defined but not used [-Wunused-local-typedefs]
813          error_if_unimplemented;
814          ^
815../../include/core/polymake/internal/iterators.h: In member function 'bool pm::iterator_pair<Iterator1, Iterator2, Params>::at_end() const':
816../../include/core/polymake/internal/iterators.h:2313:62: warning: typedef 'error_if_unimplemented' locally defined but not used [-Wunused-local-typedefs]
817       typedef typename enable_if<bool, _enable_at_end>::type error_if_unimplemented;
818                                                              ^
819../../include/core/polymake/internal/iterators.h: In member function 'int pm::iterator_pair<Iterator1, Iterator2, Params>::index() const':
820../../include/core/polymake/internal/iterators.h:2332:60: warning: typedef 'error_if_unimplemented' locally defined but not used [-Wunused-local-typedefs]
821       typedef typename enable_if<int, _enable_index>::type error_if_unimplemented;
822                                                            ^
823../../include/core/polymake/internal/iterators.h: In member function 'void pm::iterator_pair<Iterator1, Iterator2, Params>::rewind()':
824../../include/core/polymake/internal/iterators.h:2344:61: warning: typedef 'error_if_unimplemented' locally defined but not used [-Wunused-local-typedefs]
825       typedef typename enable_if<void,_enable_rewind>::type error_if_unimplemented;
826                                                             ^
827In file included from ../../include/core/polymake/internal/sparse.h:23:0,
828                 from ../../include/core/polymake/GenericIO.h:21,
829                 from ../../include/core/polymake/GenericSet.h:28,
830                 from ../../include/core/polymake/Bitset.h:21,
831                 from ../../lib/core/src/Bitset.cc:18:
832../../include/core/polymake/SelectedSubset.h: In member function 'void pm::unary_predicate_selector<Iterator, Predicate>::rewind()':
833../../include/core/polymake/SelectedSubset.h:79:97: warning: typedef 'error_if_unimplemented' locally defined but not used [-Wunused-local-typedefs]
834       typedef typename enable_if<super, check_iterator_feature<super, rewindable>::value>::type error_if_unimplemented;
835                                                                                                 ^
836In file included from ../../include/core/polymake/internal/sparse.h:23:0,
837                 from ../../include/core/polymake/GenericIO.h:21,
838                 from ../../include/core/polymake/GenericSet.h:28,
839                 from ../../include/core/polymake/Bitset.h:21,
840                 from ../../lib/core/src/Bitset.cc:18:
841../../include/core/polymake/SelectedSubset.h: In member function 'pm::binary_predicate_selector<IteratorPair, Predicate>& pm::binary_predicate_selector<IteratorPair, Predicate>::operator--()':
842../../include/core/polymake/SelectedSubset.h:436:89: warning: typedef 'error_if_unimplemented' locally defined but not used [-Wunused-local-typedefs]
843       typedef typename enable_if<super, iterator_traits<super>::is_bidirectional>::type error_if_unimplemented;
844                                                                                         ^
845../../include/core/polymake/SelectedSubset.h: In member function 'void pm::binary_predicate_selector<IteratorPair, Predicate>::rewind()':
846../../include/core/polymake/SelectedSubset.h:449:97: warning: typedef 'error_if_unimplemented' locally defined but not used [-Wunused-local-typedefs]
847       typedef typename enable_if<super, check_iterator_feature<super, rewindable>::value>::type error_if_unimplemented;
848                                                                                                 ^
849In file included from ../../include/core/polymake/internal/iterator_zipper.h:22:0,
850                 from ../../include/core/polymake/internal/sparse.h:24,
851                 from ../../include/core/polymake/GenericIO.h:21,
852                 from ../../include/core/polymake/GenericSet.h:28,
853                 from ../../include/core/polymake/Bitset.h:21,
854                 from ../../lib/core/src/Bitset.cc:18:
855../../include/core/polymake/ContainerUnion.h: In member function 'bool pm::iterator_union<IteratorList, Category>::at_end() const':
856../../include/core/polymake/ContainerUnion.h:449:10: warning: typedef 'error_if_unimplemented' locally defined but not used [-Wunused-local-typedefs]
857          error_if_unimplemented;
858          ^
859../../include/core/polymake/ContainerUnion.h: In member function 'int pm::iterator_union<IteratorList, Category>::index() const':
860../../include/core/polymake/ContainerUnion.h:456:10: warning: typedef 'error_if_unimplemented' locally defined but not used [-Wunused-local-typedefs]
861          error_if_unimplemented;
862          ^
863../../include/core/polymake/ContainerUnion.h: In member function 'void pm::iterator_union<IteratorList, Category>::rewind()':
864../../include/core/polymake/ContainerUnion.h:463:10: warning: typedef 'error_if_unimplemented' locally defined but not used [-Wunused-local-typedefs]
865          error_if_unimplemented;
866          ^
867In file included from ../../include/core/polymake/internal/sparse.h:24:0,
868                 from ../../include/core/polymake/GenericIO.h:21,
869                 from ../../include/core/polymake/GenericSet.h:28,
870                 from ../../include/core/polymake/Bitset.h:21,
871                 from ../../lib/core/src/Bitset.cc:18:
872../../include/core/polymake/internal/iterator_zipper.h: In member function 'pm::iterator_zipper<Iterator1, Iterator2, Comparator, Controller, _use_index1, _use_index2>& pm::iterator_zipper<Iterator1, Iterator2, Comparator, Controller, _use_index1, _use_index2>::operator--()':
873../../include/core/polymake/internal/iterator_zipper.h:198:10: warning: typedef 'error_if_unimplemented' locally defined but not used [-Wunused-local-typedefs]
874          error_if_unimplemented;
875          ^
876../../include/core/polymake/internal/iterator_zipper.h: In member function 'void pm::iterator_zipper<Iterator1, Iterator2, Comparator, Controller, _use_index1, _use_index2>::rewind()':
877../../include/core/polymake/internal/iterator_zipper.h:225:10: warning: typedef 'error_if_unimplemented' locally defined but not used [-Wunused-local-typedefs]
878          error_if_unimplemented;
879          ^
880In file included from ../../include/core/polymake/internal/comparators.h:22:0,
881                 from ../../include/core/polymake/GenericSet.h:29,
882                 from ../../include/core/polymake/Bitset.h:21,
883                 from ../../lib/core/src/Bitset.cc:18:
884../../include/core/polymake/TransformedContainer.h: In member function 'void pm::iterator_product<Iterator1, Iterator2, _has_state1, true>::rewind()':
885../../include/core/polymake/TransformedContainer.h:429:10: warning: typedef 'error_if_unimplemented' locally defined but not used [-Wunused-local-typedefs]
886          error_if_unimplemented;
887          ^
888g++ -c -o Integer.o -fPIC -I/opt/sage_flatsurf/local/var/tmp/sage/build/polymake-2.12/src/include/core-wrappers -I/opt/sage_flatsurf/local/var/tmp/sage/build/polymake-2.12/src/include/core -march=native -ftemplate-depth-200 -Wall -Wno-strict-aliasing -Wno-parentheses -I/opt/sage_flatsurf/local/include -DNDEBUG -DPOLYMAKE_DEBUG=0 -O3 -MD -MF Integer.d -MT 'Integer.o'    /opt/sage_flatsurf/local/var/tmp/sage/build/polymake-2.12/src/lib/core/src/Integer.cc
889In file included from ../../include/core/polymake/internal/operations_basic_defs.h:21:0,
890                 from ../../include/core/polymake/internal/operations.h:21,
891                 from ../../include/core/polymake/Integer.h:25,
892                 from ../../include/core-wrappers/polymake/Integer.h:21,
893                 from ../../lib/core/src/Integer.cc:18:
894../../include/core/polymake/internal/type_manip.h: In function 'void pm::assert_overloaded(T, T)':
895../../include/core/polymake/internal/type_manip.h:764:47: warning: typedef 'method_must_be_overloaded' locally defined but not used [-Wunused-local-typedefs]
896    typedef typename enable_if<T, false>::type method_must_be_overloaded;
897                                               ^
898In file included from ../../include/core/polymake/internal/operations.h:22:0,
899                 from ../../include/core/polymake/Integer.h:25,
900                 from ../../include/core-wrappers/polymake/Integer.h:21,
901                 from ../../lib/core/src/Integer.cc:18:
902../../include/core/polymake/internal/iterators.h: In member function 'pm::iterator_pair<Iterator1, Iterator2, Params>::difference_type pm::iterator_pair<Iterator1, Iterator2, Params>::operator-(const iterator&) const':
903../../include/core/polymake/internal/iterators.h:2270:10: warning: typedef 'error_if_unimplemented' locally defined but not used [-Wunused-local-typedefs]
904          error_if_unimplemented;
905          ^
906../../include/core/polymake/internal/iterators.h: In member function 'pm::iterator_pair<Iterator1, Iterator2, Params>::difference_type pm::iterator_pair<Iterator1, Iterator2, Params>::operator-(typename pm::assign_const<pm::iterator_pair<typename pm::iterator_traits<Iterator1>::const_iterator, typename pm::iterator_traits<Iterator2>::const_iterator, Params>, (! pm::identical<pm::iterator_pair<typename pm::iterator_traits<Iterator1>::iterator, typename pm::iterator_traits<Iterator2>::iterator, Params>, pm::iterator_pair<typename pm::iterator_traits<Iterator1>::const_iterator, typename pm::iterator_traits<Iterator2>::const_iterator, Params> >::value)>::type&) const':
907../../include/core/polymake/internal/iterators.h:2276:10: warning: typedef 'error_if_unimplemented' locally defined but not used [-Wunused-local-typedefs]
908          error_if_unimplemented;
909          ^
910../../include/core/polymake/internal/iterators.h: In member function 'bool pm::iterator_pair<Iterator1, Iterator2, Params>::at_end() const':
911../../include/core/polymake/internal/iterators.h:2313:62: warning: typedef 'error_if_unimplemented' locally defined but not used [-Wunused-local-typedefs]
912       typedef typename enable_if<bool, _enable_at_end>::type error_if_unimplemented;
913                                                              ^
914../../include/core/polymake/internal/iterators.h: In member function 'int pm::iterator_pair<Iterator1, Iterator2, Params>::index() const':
915../../include/core/polymake/internal/iterators.h:2332:60: warning: typedef 'error_if_unimplemented' locally defined but not used [-Wunused-local-typedefs]
916       typedef typename enable_if<int, _enable_index>::type error_if_unimplemented;
917                                                            ^
918../../include/core/polymake/internal/iterators.h: In member function 'void pm::iterator_pair<Iterator1, Iterator2, Params>::rewind()':
919../../include/core/polymake/internal/iterators.h:2344:61: warning: typedef 'error_if_unimplemented' locally defined but not used [-Wunused-local-typedefs]
920       typedef typename enable_if<void,_enable_rewind>::type error_if_unimplemented;
921                                                             ^
922In file included from ../../include/core/polymake/internal/sparse.h:23:0,
923                 from ../../include/core/polymake/TransformedContainer.h:21,
924                 from ../../include/core/polymake/internal/comparators.h:22,
925                 from ../../include/core/polymake/Integer.h:26,
926                 from ../../include/core-wrappers/polymake/Integer.h:21,
927                 from ../../lib/core/src/Integer.cc:18:
928../../include/core/polymake/SelectedSubset.h: In member function 'void pm::unary_predicate_selector<Iterator, Predicate>::rewind()':
929../../include/core/polymake/SelectedSubset.h:79:97: warning: typedef 'error_if_unimplemented' locally defined but not used [-Wunused-local-typedefs]
930       typedef typename enable_if<super, check_iterator_feature<super, rewindable>::value>::type error_if_unimplemented;
931                                                                                                 ^
932In file included from ../../include/core/polymake/internal/sparse.h:23:0,
933                 from ../../include/core/polymake/TransformedContainer.h:21,
934                 from ../../include/core/polymake/internal/comparators.h:22,
935                 from ../../include/core/polymake/Integer.h:26,
936                 from ../../include/core-wrappers/polymake/Integer.h:21,
937                 from ../../lib/core/src/Integer.cc:18:
938../../include/core/polymake/SelectedSubset.h: In member function 'pm::binary_predicate_selector<IteratorPair, Predicate>& pm::binary_predicate_selector<IteratorPair, Predicate>::operator--()':
939../../include/core/polymake/SelectedSubset.h:436:89: warning: typedef 'error_if_unimplemented' locally defined but not used [-Wunused-local-typedefs]
940       typedef typename enable_if<super, iterator_traits<super>::is_bidirectional>::type error_if_unimplemented;
941                                                                                         ^
942../../include/core/polymake/SelectedSubset.h: In member function 'void pm::binary_predicate_selector<IteratorPair, Predicate>::rewind()':
943../../include/core/polymake/SelectedSubset.h:449:97: warning: typedef 'error_if_unimplemented' locally defined but not used [-Wunused-local-typedefs]
944       typedef typename enable_if<super, check_iterator_feature<super, rewindable>::value>::type error_if_unimplemented;
945                                                                                                 ^
946In file included from ../../include/core/polymake/internal/iterator_zipper.h:22:0,
947                 from ../../include/core/polymake/internal/sparse.h:24,
948                 from ../../include/core/polymake/TransformedContainer.h:21,
949                 from ../../include/core/polymake/internal/comparators.h:22,
950                 from ../../include/core/polymake/Integer.h:26,
951                 from ../../include/core-wrappers/polymake/Integer.h:21,
952                 from ../../lib/core/src/Integer.cc:18:
953../../include/core/polymake/ContainerUnion.h: In member function 'bool pm::iterator_union<IteratorList, Category>::at_end() const':
954../../include/core/polymake/ContainerUnion.h:449:10: warning: typedef 'error_if_unimplemented' locally defined but not used [-Wunused-local-typedefs]
955          error_if_unimplemented;
956          ^
957../../include/core/polymake/ContainerUnion.h: In member function 'int pm::iterator_union<IteratorList, Category>::index() const':
958../../include/core/polymake/ContainerUnion.h:456:10: warning: typedef 'error_if_unimplemented' locally defined but not used [-Wunused-local-typedefs]
959          error_if_unimplemented;
960          ^
961../../include/core/polymake/ContainerUnion.h: In member function 'void pm::iterator_union<IteratorList, Category>::rewind()':
962../../include/core/polymake/ContainerUnion.h:463:10: warning: typedef 'error_if_unimplemented' locally defined but not used [-Wunused-local-typedefs]
963          error_if_unimplemented;
964          ^
965In file included from ../../include/core/polymake/internal/sparse.h:24:0,
966                 from ../../include/core/polymake/TransformedContainer.h:21,
967                 from ../../include/core/polymake/internal/comparators.h:22,
968                 from ../../include/core/polymake/Integer.h:26,
969                 from ../../include/core-wrappers/polymake/Integer.h:21,
970                 from ../../lib/core/src/Integer.cc:18:
971../../include/core/polymake/internal/iterator_zipper.h: In member function 'pm::iterator_zipper<Iterator1, Iterator2, Comparator, Controller, _use_index1, _use_index2>& pm::iterator_zipper<Iterator1, Iterator2, Comparator, Controller, _use_index1, _use_index2>::operator--()':
972../../include/core/polymake/internal/iterator_zipper.h:198:10: warning: typedef 'error_if_unimplemented' locally defined but not used [-Wunused-local-typedefs]
973          error_if_unimplemented;
974          ^
975../../include/core/polymake/internal/iterator_zipper.h: In member function 'void pm::iterator_zipper<Iterator1, Iterator2, Comparator, Controller, _use_index1, _use_index2>::rewind()':
976../../include/core/polymake/internal/iterator_zipper.h:225:10: warning: typedef 'error_if_unimplemented' locally defined but not used [-Wunused-local-typedefs]
977          error_if_unimplemented;
978          ^
979In file included from ../../include/core/polymake/internal/comparators.h:22:0,
980                 from ../../include/core/polymake/Integer.h:26,
981                 from ../../include/core-wrappers/polymake/Integer.h:21,
982                 from ../../lib/core/src/Integer.cc:18:
983../../include/core/polymake/TransformedContainer.h: In member function 'void pm::iterator_product<Iterator1, Iterator2, _has_state1, true>::rewind()':
984../../include/core/polymake/TransformedContainer.h:429:10: warning: typedef 'error_if_unimplemented' locally defined but not used [-Wunused-local-typedefs]
985          error_if_unimplemented;
986          ^
987../../lib/core/src/Integer.cc: In member function 'size_t pm::Integer::strsize(std::ios_base::fmtflags) const':
988../../lib/core/src/Integer.cc:31:4: warning: case value '520' not in enumerated type 'std::_Ios_Fmtflags' [-Wswitch]
989    case int(std::ios::hex) | int(std::ios::showbase):
990    ^
991../../lib/core/src/Integer.cc:36:4: warning: case value '576' not in enumerated type 'std::_Ios_Fmtflags' [-Wswitch]
992    case int(std::ios::oct) | int(std::ios::showbase):
993    ^
994../../lib/core/src/Integer.cc: In member function 'void pm::Integer::putstr(std::ios_base::fmtflags, char*) const':
995../../lib/core/src/Integer.cc:62:4: warning: case value '520' not in enumerated type 'std::_Ios_Fmtflags' [-Wswitch]
996    case int(std::ios::hex) | int(std::ios::showbase):
997    ^
998../../lib/core/src/Integer.cc:68:4: warning: case value '576' not in enumerated type 'std::_Ios_Fmtflags' [-Wswitch]
999    case int(std::ios::oct) | int(std::ios::showbase):
1000    ^
1001g++ -c -o socketstream.o -fPIC -I/opt/sage_flatsurf/local/var/tmp/sage/build/polymake-2.12/src/include/core-wrappers -I/opt/sage_flatsurf/local/var/tmp/sage/build/polymake-2.12/src/include/core -march=native -ftemplate-depth-200 -Wall -Wno-strict-aliasing -Wno-parentheses -I/opt/sage_flatsurf/local/include -DNDEBUG -DPOLYMAKE_DEBUG=0 -O3 -MD -MF socketstream.d -MT 'socketstream.o'    /opt/sage_flatsurf/local/var/tmp/sage/build/polymake-2.12/src/lib/core/src/socketstream.cc
1002g++ -c -o color.o -fPIC -I/opt/sage_flatsurf/local/var/tmp/sage/build/polymake-2.12/src/include/core-wrappers -I/opt/sage_flatsurf/local/var/tmp/sage/build/polymake-2.12/src/include/core -march=native -ftemplate-depth-200 -Wall -Wno-strict-aliasing -Wno-parentheses -I/opt/sage_flatsurf/local/include -DNDEBUG -DPOLYMAKE_DEBUG=0 -O3 -MD -MF color.d -MT 'color.o'    /opt/sage_flatsurf/local/var/tmp/sage/build/polymake-2.12/src/lib/core/src/color.cc
1003In file included from ../../include/core/polymake/internal/operations_basic_defs.h:21:0,
1004                 from ../../include/core/polymake/internal/operations.h:21,
1005                 from ../../include/core/polymake/GenericStruct.h:21,
1006                 from ../../include/core-wrappers/polymake/GenericStruct.h:21,
1007                 from ../../include/core/polymake/color.h:25,
1008                 from ../../include/core-wrappers/polymake/color.h:21,
1009                 from ../../lib/core/src/color.cc:18:
1010../../include/core/polymake/internal/type_manip.h: In function 'void pm::assert_overloaded(T, T)':
1011../../include/core/polymake/internal/type_manip.h:764:47: warning: typedef 'method_must_be_overloaded' locally defined but not used [-Wunused-local-typedefs]
1012    typedef typename enable_if<T, false>::type method_must_be_overloaded;
1013                                               ^
1014In file included from ../../include/core/polymake/internal/operations.h:22:0,
1015                 from ../../include/core/polymake/GenericStruct.h:21,
1016                 from ../../include/core-wrappers/polymake/GenericStruct.h:21,
1017                 from ../../include/core/polymake/color.h:25,
1018                 from ../../include/core-wrappers/polymake/color.h:21,
1019                 from ../../lib/core/src/color.cc:18:
1020../../include/core/polymake/internal/iterators.h: In member function 'pm::iterator_pair<Iterator1, Iterator2, Params>::difference_type pm::iterator_pair<Iterator1, Iterator2, Params>::operator-(const iterator&) const':
1021../../include/core/polymake/internal/iterators.h:2270:10: warning: typedef 'error_if_unimplemented' locally defined but not used [-Wunused-local-typedefs]
1022          error_if_unimplemented;
1023          ^
1024../../include/core/polymake/internal/iterators.h: In member function 'pm::iterator_pair<Iterator1, Iterator2, Params>::difference_type pm::iterator_pair<Iterator1, Iterator2, Params>::operator-(typename pm::assign_const<pm::iterator_pair<typename pm::iterator_traits<Iterator1>::const_iterator, typename pm::iterator_traits<Iterator2>::const_iterator, Params>, (! pm::identical<pm::iterator_pair<typename pm::iterator_traits<Iterator1>::iterator, typename pm::iterator_traits<Iterator2>::iterator, Params>, pm::iterator_pair<typename pm::iterator_traits<Iterator1>::const_iterator, typename pm::iterator_traits<Iterator2>::const_iterator, Params> >::value)>::type&) const':
1025../../include/core/polymake/internal/iterators.h:2276:10: warning: typedef 'error_if_unimplemented' locally defined but not used [-Wunused-local-typedefs]
1026          error_if_unimplemented;
1027          ^
1028../../include/core/polymake/internal/iterators.h: In member function 'bool pm::iterator_pair<Iterator1, Iterator2, Params>::at_end() const':
1029../../include/core/polymake/internal/iterators.h:2313:62: warning: typedef 'error_if_unimplemented' locally defined but not used [-Wunused-local-typedefs]
1030       typedef typename enable_if<bool, _enable_at_end>::type error_if_unimplemented;
1031                                                              ^
1032../../include/core/polymake/internal/iterators.h: In member function 'int pm::iterator_pair<Iterator1, Iterator2, Params>::index() const':
1033../../include/core/polymake/internal/iterators.h:2332:60: warning: typedef 'error_if_unimplemented' locally defined but not used [-Wunused-local-typedefs]
1034       typedef typename enable_if<int, _enable_index>::type error_if_unimplemented;
1035                                                            ^
1036../../include/core/polymake/internal/iterators.h: In member function 'void pm::iterator_pair<Iterator1, Iterator2, Params>::rewind()':
1037../../include/core/polymake/internal/iterators.h:2344:61: warning: typedef 'error_if_unimplemented' locally defined but not used [-Wunused-local-typedefs]
1038       typedef typename enable_if<void,_enable_rewind>::type error_if_unimplemented;
1039                                                             ^
1040In file included from ../../include/core/polymake/internal/sparse.h:23:0,
1041                 from ../../include/core/polymake/GenericIO.h:21,
1042                 from ../../include/core/polymake/perl/Value.h:21,
1043                 from ../../include/core/polymake/client.h:22,
1044                 from ../../include/core-wrappers/polymake/GenericStruct.h:22,
1045                 from ../../include/core/polymake/color.h:25,
1046                 from ../../include/core-wrappers/polymake/color.h:21,
1047                 from ../../lib/core/src/color.cc:18:
1048../../include/core/polymake/SelectedSubset.h: In member function 'void pm::unary_predicate_selector<Iterator, Predicate>::rewind()':
1049../../include/core/polymake/SelectedSubset.h:79:97: warning: typedef 'error_if_unimplemented' locally defined but not used [-Wunused-local-typedefs]
1050       typedef typename enable_if<super, check_iterator_feature<super, rewindable>::value>::type error_if_unimplemented;
1051                                                                                                 ^
1052In file included from ../../include/core/polymake/internal/sparse.h:23:0,
1053                 from ../../include/core/polymake/GenericIO.h:21,
1054                 from ../../include/core/polymake/perl/Value.h:21,
1055                 from ../../include/core/polymake/client.h:22,
1056                 from ../../include/core-wrappers/polymake/GenericStruct.h:22,
1057                 from ../../include/core/polymake/color.h:25,
1058                 from ../../include/core-wrappers/polymake/color.h:21,
1059                 from ../../lib/core/src/color.cc:18:
1060../../include/core/polymake/SelectedSubset.h: In member function 'pm::binary_predicate_selector<IteratorPair, Predicate>& pm::binary_predicate_selector<IteratorPair, Predicate>::operator--()':
1061../../include/core/polymake/SelectedSubset.h:436:89: warning: typedef 'error_if_unimplemented' locally defined but not used [-Wunused-local-typedefs]
1062       typedef typename enable_if<super, iterator_traits<super>::is_bidirectional>::type error_if_unimplemented;
1063                                                                                         ^
1064../../include/core/polymake/SelectedSubset.h: In member function 'void pm::binary_predicate_selector<IteratorPair, Predicate>::rewind()':
1065../../include/core/polymake/SelectedSubset.h:449:97: warning: typedef 'error_if_unimplemented' locally defined but not used [-Wunused-local-typedefs]
1066       typedef typename enable_if<super, check_iterator_feature<super, rewindable>::value>::type error_if_unimplemented;
1067                                                                                                 ^
1068In file included from ../../include/core/polymake/internal/iterator_zipper.h:22:0,
1069                 from ../../include/core/polymake/internal/sparse.h:24,
1070                 from ../../include/core/polymake/GenericIO.h:21,
1071                 from ../../include/core/polymake/perl/Value.h:21,
1072                 from ../../include/core/polymake/client.h:22,
1073                 from ../../include/core-wrappers/polymake/GenericStruct.h:22,
1074                 from ../../include/core/polymake/color.h:25,
1075                 from ../../include/core-wrappers/polymake/color.h:21,
1076                 from ../../lib/core/src/color.cc:18:
1077../../include/core/polymake/ContainerUnion.h: In member function 'bool pm::iterator_union<IteratorList, Category>::at_end() const':
1078../../include/core/polymake/ContainerUnion.h:449:10: warning: typedef 'error_if_unimplemented' locally defined but not used [-Wunused-local-typedefs]
1079          error_if_unimplemented;
1080          ^
1081../../include/core/polymake/ContainerUnion.h: In member function 'int pm::iterator_union<IteratorList, Category>::index() const':
1082../../include/core/polymake/ContainerUnion.h:456:10: warning: typedef 'error_if_unimplemented' locally defined but not used [-Wunused-local-typedefs]
1083          error_if_unimplemented;
1084          ^
1085../../include/core/polymake/ContainerUnion.h: In member function 'void pm::iterator_union<IteratorList, Category>::rewind()':
1086../../include/core/polymake/ContainerUnion.h:463:10: warning: typedef 'error_if_unimplemented' locally defined but not used [-Wunused-local-typedefs]
1087          error_if_unimplemented;
1088          ^
1089In file included from ../../include/core/polymake/internal/sparse.h:24:0,
1090                 from ../../include/core/polymake/GenericIO.h:21,
1091                 from ../../include/core/polymake/perl/Value.h:21,
1092                 from ../../include/core/polymake/client.h:22,
1093                 from ../../include/core-wrappers/polymake/GenericStruct.h:22,
1094                 from ../../include/core/polymake/color.h:25,
1095                 from ../../include/core-wrappers/polymake/color.h:21,
1096                 from ../../lib/core/src/color.cc:18:
1097../../include/core/polymake/internal/iterator_zipper.h: In member function 'pm::iterator_zipper<Iterator1, Iterator2, Comparator, Controller, _use_index1, _use_index2>& pm::iterator_zipper<Iterator1, Iterator2, Comparator, Controller, _use_index1, _use_index2>::operator--()':
1098../../include/core/polymake/internal/iterator_zipper.h:198:10: warning: typedef 'error_if_unimplemented' locally defined but not used [-Wunused-local-typedefs]
1099          error_if_unimplemented;
1100          ^
1101../../include/core/polymake/internal/iterator_zipper.h: In member function 'void pm::iterator_zipper<Iterator1, Iterator2, Comparator, Controller, _use_index1, _use_index2>::rewind()':
1102../../include/core/polymake/internal/iterator_zipper.h:225:10: warning: typedef 'error_if_unimplemented' locally defined but not used [-Wunused-local-typedefs]
1103          error_if_unimplemented;
1104          ^
1105In file included from ../../include/core/polymake/internal/assoc.h:23:0,
1106                 from ../../include/core/polymake/perl/Value.h:22,
1107                 from ../../include/core/polymake/client.h:22,
1108                 from ../../include/core-wrappers/polymake/GenericStruct.h:22,
1109                 from ../../include/core/polymake/color.h:25,
1110                 from ../../include/core-wrappers/polymake/color.h:21,
1111                 from ../../lib/core/src/color.cc:18:
1112../../include/core/polymake/TransformedContainer.h: In member function 'void pm::iterator_product<Iterator1, Iterator2, _has_state1, true>::rewind()':
1113../../include/core/polymake/TransformedContainer.h:429:10: warning: typedef 'error_if_unimplemented' locally defined but not used [-Wunused-local-typedefs]
1114          error_if_unimplemented;
1115          ^
1116g++ -c -o FacetList.o -fPIC -I/opt/sage_flatsurf/local/var/tmp/sage/build/polymake-2.12/src/include/core-wrappers -I/opt/sage_flatsurf/local/var/tmp/sage/build/polymake-2.12/src/include/core -march=native -ftemplate-depth-200 -Wall -Wno-strict-aliasing -Wno-parentheses -I/opt/sage_flatsurf/local/include -DNDEBUG -DPOLYMAKE_DEBUG=0 -O3 -MD -MF FacetList.d -MT 'FacetList.o'    /opt/sage_flatsurf/local/var/tmp/sage/build/polymake-2.12/src/lib/core/src/FacetList.cc
1117In file included from ../../include/core/polymake/internal/operations_basic_defs.h:21:0,
1118                 from ../../include/core/polymake/internal/comparators_basic_defs.h:21,
1119                 from ../../include/core/polymake/pair.h:21,
1120                 from ../../include/core/polymake/internal/sparse2d_ruler.h:21,
1121                 from ../../include/core/polymake/FacetList.h:25,
1122                 from ../../include/core-wrappers/polymake/FacetList.h:21,
1123                 from ../../lib/core/src/FacetList.cc:22:
1124../../include/core/polymake/internal/type_manip.h: In function 'void pm::assert_overloaded(T, T)':
1125../../include/core/polymake/internal/type_manip.h:764:47: warning: typedef 'method_must_be_overloaded' locally defined but not used [-Wunused-local-typedefs]
1126    typedef typename enable_if<T, false>::type method_must_be_overloaded;
1127                                               ^
1128In file included from ../../include/core/polymake/internal/AVL.h:25:0,
1129                 from ../../include/core/polymake/internal/sparse2d.h:21,
1130                 from ../../include/core/polymake/IncidenceMatrix.h:26,
1131                 from ../../include/core-wrappers/polymake/IncidenceMatrix.h:21,
1132                 from ../../include/core/polymake/FacetList.h:26,
1133                 from ../../include/core-wrappers/polymake/FacetList.h:21,
1134                 from ../../lib/core/src/FacetList.cc:22:
1135../../include/core/polymake/internal/iterators.h: In member function 'pm::iterator_pair<Iterator1, Iterator2, Params>::difference_type pm::iterator_pair<Iterator1, Iterator2, Params>::operator-(const iterator&) const':
1136../../include/core/polymake/internal/iterators.h:2270:10: warning: typedef 'error_if_unimplemented' locally defined but not used [-Wunused-local-typedefs]
1137          error_if_unimplemented;
1138          ^
1139../../include/core/polymake/internal/iterators.h: In member function 'pm::iterator_pair<Iterator1, Iterator2, Params>::difference_type pm::iterator_pair<Iterator1, Iterator2, Params>::operator-(typename pm::assign_const<pm::iterator_pair<typename pm::iterator_traits<Iterator1>::const_iterator, typename pm::iterator_traits<Iterator2>::const_iterator, Params>, (! pm::identical<pm::iterator_pair<typename pm::iterator_traits<Iterator1>::iterator, typename pm::iterator_traits<Iterator2>::iterator, Params>, pm::iterator_pair<typename pm::iterator_traits<Iterator1>::const_iterator, typename pm::iterator_traits<Iterator2>::const_iterator, Params> >::value)>::type&) const':
1140../../include/core/polymake/internal/iterators.h:2276:10: warning: typedef 'error_if_unimplemented' locally defined but not used [-Wunused-local-typedefs]
1141          error_if_unimplemented;
1142          ^
1143../../include/core/polymake/internal/iterators.h: In member function 'bool pm::iterator_pair<Iterator1, Iterator2, Params>::at_end() const':
1144../../include/core/polymake/internal/iterators.h:2313:62: warning: typedef 'error_if_unimplemented' locally defined but not used [-Wunused-local-typedefs]
1145       typedef typename enable_if<bool, _enable_at_end>::type error_if_unimplemented;
1146                                                              ^
1147../../include/core/polymake/internal/iterators.h: In member function 'int pm::iterator_pair<Iterator1, Iterator2, Params>::index() const':
1148../../include/core/polymake/internal/iterators.h:2332:60: warning: typedef 'error_if_unimplemented' locally defined but not used [-Wunused-local-typedefs]
1149       typedef typename enable_if<int, _enable_index>::type error_if_unimplemented;
1150                                                            ^
1151../../include/core/polymake/internal/iterators.h: In member function 'void pm::iterator_pair<Iterator1, Iterator2, Params>::rewind()':
1152../../include/core/polymake/internal/iterators.h:2344:61: warning: typedef 'error_if_unimplemented' locally defined but not used [-Wunused-local-typedefs]
1153       typedef typename enable_if<void,_enable_rewind>::type error_if_unimplemented;
1154                                                             ^
1155In file included from ../../include/core/polymake/internal/sparse.h:23:0,
1156                 from ../../include/core/polymake/TransformedContainer.h:21,
1157                 from ../../include/core/polymake/internal/comparators.h:22,
1158                 from ../../include/core/polymake/internal/AVL.h:26,
1159                 from ../../include/core/polymake/internal/sparse2d.h:21,
1160                 from ../../include/core/polymake/IncidenceMatrix.h:26,
1161                 from ../../include/core-wrappers/polymake/IncidenceMatrix.h:21,
1162                 from ../../include/core/polymake/FacetList.h:26,
1163                 from ../../include/core-wrappers/polymake/FacetList.h:21,
1164                 from ../../lib/core/src/FacetList.cc:22:
1165../../include/core/polymake/SelectedSubset.h: In member function 'void pm::unary_predicate_selector<Iterator, Predicate>::rewind()':
1166../../include/core/polymake/SelectedSubset.h:79:97: warning: typedef 'error_if_unimplemented' locally defined but not used [-Wunused-local-typedefs]
1167       typedef typename enable_if<super, check_iterator_feature<super, rewindable>::value>::type error_if_unimplemented;
1168                                                                                                 ^
1169In file included from ../../include/core/polymake/internal/sparse.h:23:0,
1170                 from ../../include/core/polymake/TransformedContainer.h:21,
1171                 from ../../include/core/polymake/internal/comparators.h:22,
1172                 from ../../include/core/polymake/internal/AVL.h:26,
1173                 from ../../include/core/polymake/internal/sparse2d.h:21,
1174                 from ../../include/core/polymake/IncidenceMatrix.h:26,
1175                 from ../../include/core-wrappers/polymake/IncidenceMatrix.h:21,
1176                 from ../../include/core/polymake/FacetList.h:26,
1177                 from ../../include/core-wrappers/polymake/FacetList.h:21,
1178                 from ../../lib/core/src/FacetList.cc:22:
1179../../include/core/polymake/SelectedSubset.h: In member function 'pm::binary_predicate_selector<IteratorPair, Predicate>& pm::binary_predicate_selector<IteratorPair, Predicate>::operator--()':
1180../../include/core/polymake/SelectedSubset.h:436:89: warning: typedef 'error_if_unimplemented' locally defined but not used [-Wunused-local-typedefs]
1181       typedef typename enable_if<super, iterator_traits<super>::is_bidirectional>::type error_if_unimplemented;
1182                                                                                         ^
1183../../include/core/polymake/SelectedSubset.h: In member function 'void pm::binary_predicate_selector<IteratorPair, Predicate>::rewind()':
1184../../include/core/polymake/SelectedSubset.h:449:97: warning: typedef 'error_if_unimplemented' locally defined but not used [-Wunused-local-typedefs]
1185       typedef typename enable_if<super, check_iterator_feature<super, rewindable>::value>::type error_if_unimplemented;
1186                                                                                                 ^
1187In file included from ../../include/core/polymake/internal/iterator_zipper.h:22:0,
1188                 from ../../include/core/polymake/internal/sparse.h:24,
1189                 from ../../include/core/polymake/TransformedContainer.h:21,
1190                 from ../../include/core/polymake/internal/comparators.h:22,
1191                 from ../../include/core/polymake/internal/AVL.h:26,
1192                 from ../../include/core/polymake/internal/sparse2d.h:21,
1193                 from ../../include/core/polymake/IncidenceMatrix.h:26,
1194                 from ../../include/core-wrappers/polymake/IncidenceMatrix.h:21,
1195                 from ../../include/core/polymake/FacetList.h:26,
1196                 from ../../include/core-wrappers/polymake/FacetList.h:21,
1197                 from ../../lib/core/src/FacetList.cc:22:
1198../../include/core/polymake/ContainerUnion.h: In member function 'bool pm::iterator_union<IteratorList, Category>::at_end() const':
1199../../include/core/polymake/ContainerUnion.h:449:10: warning: typedef 'error_if_unimplemented' locally defined but not used [-Wunused-local-typedefs]
1200          error_if_unimplemented;
1201          ^
1202../../include/core/polymake/ContainerUnion.h: In member function 'int pm::iterator_union<IteratorList, Category>::index() const':
1203../../include/core/polymake/ContainerUnion.h:456:10: warning: typedef 'error_if_unimplemented' locally defined but not used [-Wunused-local-typedefs]
1204          error_if_unimplemented;
1205          ^
1206../../include/core/polymake/ContainerUnion.h: In member function 'void pm::iterator_union<IteratorList, Category>::rewind()':
1207../../include/core/polymake/ContainerUnion.h:463:10: warning: typedef 'error_if_unimplemented' locally defined but not used [-Wunused-local-typedefs]
1208          error_if_unimplemented;
1209          ^
1210In file included from ../../include/core/polymake/internal/sparse.h:24:0,
1211                 from ../../include/core/polymake/TransformedContainer.h:21,
1212                 from ../../include/core/polymake/internal/comparators.h:22,
1213                 from ../../include/core/polymake/internal/AVL.h:26,
1214                 from ../../include/core/polymake/internal/sparse2d.h:21,
1215                 from ../../include/core/polymake/IncidenceMatrix.h:26,
1216                 from ../../include/core-wrappers/polymake/IncidenceMatrix.h:21,
1217                 from ../../include/core/polymake/FacetList.h:26,
1218                 from ../../include/core-wrappers/polymake/FacetList.h:21,
1219                 from ../../lib/core/src/FacetList.cc:22:
1220../../include/core/polymake/internal/iterator_zipper.h: In member function 'pm::iterator_zipper<Iterator1, Iterator2, Comparator, Controller, _use_index1, _use_index2>& pm::iterator_zipper<Iterator1, Iterator2, Comparator, Controller, _use_index1, _use_index2>::operator--()':
1221../../include/core/polymake/internal/iterator_zipper.h:198:10: warning: typedef 'error_if_unimplemented' locally defined but not used [-Wunused-local-typedefs]
1222          error_if_unimplemented;
1223          ^
1224../../include/core/polymake/internal/iterator_zipper.h: In member function 'void pm::iterator_zipper<Iterator1, Iterator2, Comparator, Controller, _use_index1, _use_index2>::rewind()':
1225../../include/core/polymake/internal/iterator_zipper.h:225:10: warning: typedef 'error_if_unimplemented' locally defined but not used [-Wunused-local-typedefs]
1226          error_if_unimplemented;
1227          ^
1228In file included from ../../include/core/polymake/internal/comparators.h:22:0,
1229                 from ../../include/core/polymake/internal/AVL.h:26,
1230                 from ../../include/core/polymake/internal/sparse2d.h:21,
1231                 from ../../include/core/polymake/IncidenceMatrix.h:26,
1232                 from ../../include/core-wrappers/polymake/IncidenceMatrix.h:21,
1233                 from ../../include/core/polymake/FacetList.h:26,
1234                 from ../../include/core-wrappers/polymake/FacetList.h:21,
1235                 from ../../lib/core/src/FacetList.cc:22:
1236../../include/core/polymake/TransformedContainer.h: In member function 'void pm::iterator_product<Iterator1, Iterator2, _has_state1, true>::rewind()':
1237../../include/core/polymake/TransformedContainer.h:429:10: warning: typedef 'error_if_unimplemented' locally defined but not used [-Wunused-local-typedefs]
1238          error_if_unimplemented;
1239          ^
1240In file included from ../../include/core/polymake/Set.h:30:0,
1241                 from ../../include/core-wrappers/polymake/Set.h:21,
1242                 from ../../include/core/polymake/IncidenceMatrix.h:27,
1243                 from ../../include/core-wrappers/polymake/IncidenceMatrix.h:21,
1244                 from ../../include/core/polymake/FacetList.h:26,
1245                 from ../../include/core-wrappers/polymake/FacetList.h:21,
1246                 from ../../lib/core/src/FacetList.cc:22:
1247../../include/core/polymake/IndexedSubset.h: In member function 'pm::indexed_selector<Iterator1, Iterator2, renumber, _reversed>& pm::indexed_selector<Iterator1, Iterator2, renumber, _reversed>::operator--()':
1248../../include/core/polymake/IndexedSubset.h:183:107: warning: typedef 'error_if_unimplemented' locally defined but not used [-Wunused-local-typedefs]
1249       typedef typename enable_if<void, iterator_pair_traits<Iterator1,Iterator2>::is_bidirectional>::type error_if_unimplemented;
1250                                                                                                           ^
1251../../include/core/polymake/IndexedSubset.h: In member function 'pm::indexed_selector<Iterator1, Iterator2, renumber, _reversed>& pm::indexed_selector<Iterator1, Iterator2, renumber, _reversed>::operator+=(int)':
1252../../include/core/polymake/IndexedSubset.h:191:100: warning: typedef 'error_if_unimplemented' locally defined but not used [-Wunused-local-typedefs]
1253       typedef typename enable_if<void, iterator_pair_traits<Iterator1,Iterator2>::is_random>::type error_if_unimplemented;
1254                                                                                                    ^
1255../../include/core/polymake/IndexedSubset.h: In member function 'pm::indexed_selector<Iterator1, Iterator2, renumber, _reversed>& pm::indexed_selector<Iterator1, Iterator2, renumber, _reversed>::operator-=(int)':
1256../../include/core/polymake/IndexedSubset.h:197:100: warning: typedef 'error_if_unimplemented' locally defined but not used [-Wunused-local-typedefs]
1257       typedef typename enable_if<void, iterator_pair_traits<Iterator1,Iterator2>::is_random>::type error_if_unimplemented;
1258                                                                                                    ^
1259../../include/core/polymake/IndexedSubset.h: In member function 'typename pm::enable_if<typename pm::iterator_traits<Iterator2>::difference_type, pm::comparable_iterator<pm::indexed_selector<Iterator1, Iterator2, renumber, _reversed>, Iterator>::value>::type pm::indexed_selector<Iterator1, Iterator2, renumber, _reversed>::operator-(const Iterator&) const':
1260../../include/core/polymake/IndexedSubset.h:210:100: warning: typedef 'error_if_unimplemented' locally defined but not used [-Wunused-local-typedefs]
1261       typedef typename enable_if<void, iterator_pair_traits<Iterator1,Iterator2>::is_random>::type error_if_unimplemented;
1262                                                                                                    ^
1263../../include/core/polymake/IndexedSubset.h: In member function 'typename pm::iterator_traits<Iterator1>::derivable_type::reference pm::indexed_selector<Iterator1, Iterator2, renumber, _reversed>::operator[](int) const':
1264../../include/core/polymake/IndexedSubset.h:216:100: warning: typedef 'error_if_unimplemented' locally defined but not used [-Wunused-local-typedefs]
1265       typedef typename enable_if<void, iterator_pair_traits<Iterator1,Iterator2>::is_random>::type error_if_unimplemented;
1266                                                                                                    ^
1267../../include/core/polymake/IndexedSubset.h: In member function 'void pm::indexed_selector<Iterator1, Iterator2, renumber, _reversed>::rewind()':
1268../../include/core/polymake/IndexedSubset.h:250:3: warning: typedef 'error_if_unimplemented' locally defined but not used [-Wunused-local-typedefs]
1269   error_if_unimplemented;
1270   ^
1271../../include/core/polymake/IndexedSubset.h: In member function 'void pm::indexed_selector<Iterator1, Iterator2, renumber, _reversed>::contract(bool, int, int)':
1272../../include/core/polymake/IndexedSubset.h:258:3: warning: typedef 'error_if_unimplemented' locally defined but not used [-Wunused-local-typedefs]
1273   error_if_unimplemented;
1274   ^
1275In file included from ../../include/core/polymake/internal/matrix_methods.h:22:0,
1276                 from ../../include/core/polymake/GenericIncidenceMatrix.h:21,
1277                 from ../../include/core/polymake/IncidenceMatrix.h:28,
1278                 from ../../include/core-wrappers/polymake/IncidenceMatrix.h:21,
1279                 from ../../include/core/polymake/FacetList.h:26,
1280                 from ../../include/core-wrappers/polymake/FacetList.h:21,
1281                 from ../../lib/core/src/FacetList.cc:22:
1282../../include/core/polymake/ContainerChain.h: In member function 'void pm::iterator_chain<IteratorList, _reversed>::rewind()':
1283../../include/core/polymake/ContainerChain.h:463:10: warning: typedef 'error_if_unimplemented' locally defined but not used [-Wunused-local-typedefs]
1284          error_if_unimplemented;
1285          ^
1286../../include/core/polymake/ContainerChain.h: In member function 'int pm::iterator_chain<IteratorList, _reversed>::index() const':
1287../../include/core/polymake/ContainerChain.h:472:10: warning: typedef 'error_if_unimplemented' locally defined but not used [-Wunused-local-typedefs]
1288          error_if_unimplemented;
1289          ^
1290In file included from ../../include/core/polymake/GenericMatrix.h:22:0,
1291                 from ../../include/core/polymake/permutations.h:21,
1292                 from ../../include/core/polymake/IncidenceMatrix.h:29,
1293                 from ../../include/core-wrappers/polymake/IncidenceMatrix.h:21,
1294                 from ../../include/core/polymake/FacetList.h:26,
1295                 from ../../include/core-wrappers/polymake/FacetList.h:21,
1296                 from ../../lib/core/src/FacetList.cc:22:
1297../../include/core/polymake/CascadedContainer.h: In member function 'void pm::cascaded_iterator<Iterator, ExpectedFeatures, depth>::rewind()':
1298../../include/core/polymake/CascadedContainer.h:138:70: warning: typedef 'error_if_unimplemented' locally defined but not used [-Wunused-local-typedefs]
1299       typedef typename enable_if_iterator<Iterator,rewindable>::type error_if_unimplemented;
1300                                                                      ^
1301g++ -c -o SharedMemoryMatrix.o -fPIC -I/opt/sage_flatsurf/local/var/tmp/sage/build/polymake-2.12/src/include/core-wrappers -I/opt/sage_flatsurf/local/var/tmp/sage/build/polymake-2.12/src/include/core -march=native -ftemplate-depth-200 -Wall -Wno-strict-aliasing -Wno-parentheses -I/opt/sage_flatsurf/local/include -DNDEBUG -DPOLYMAKE_DEBUG=0 -O3 -MD -MF SharedMemoryMatrix.d -MT 'SharedMemoryMatrix.o'    /opt/sage_flatsurf/local/var/tmp/sage/build/polymake-2.12/src/lib/core/src/SharedMemoryMatrix.cc
1302In file included from ../../include/core/polymake/internal/operations_basic_defs.h:21:0,
1303                 from ../../include/core/polymake/internal/comparators_basic_defs.h:21,
1304                 from ../../include/core/polymake/internal/comparators_ops.h:24,
1305                 from ../../include/core/polymake/Series.h:25,
1306                 from ../../include/core/polymake/internal/sparse.h:21,
1307                 from ../../include/core/polymake/GenericIO.h:21,
1308                 from ../../include/core/polymake/GenericVector.h:21,
1309                 from ../../include/core/polymake/Vector.h:25,
1310                 from ../../include/core-wrappers/polymake/Vector.h:21,
1311                 from ../../include/core/polymake/GenericMatrix.h:21,
1312                 from ../../include/core/polymake/Matrix.h:25,
1313                 from ../../include/core-wrappers/polymake/Matrix.h:21,
1314                 from ../../include/core/polymake/SharedMemoryMatrix.h:21,
1315                 from ../../lib/core/src/SharedMemoryMatrix.cc:18:
1316../../include/core/polymake/internal/type_manip.h: In function 'void pm::assert_overloaded(T, T)':
1317../../include/core/polymake/internal/type_manip.h:764:47: warning: typedef 'method_must_be_overloaded' locally defined but not used [-Wunused-local-typedefs]
1318    typedef typename enable_if<T, false>::type method_must_be_overloaded;
1319                                               ^
1320In file included from ../../include/core/polymake/internal/operations.h:22:0,
1321                 from ../../include/core/polymake/internal/comparators_ops.h:26,
1322                 from ../../include/core/polymake/Series.h:25,
1323                 from ../../include/core/polymake/internal/sparse.h:21,
1324                 from ../../include/core/polymake/GenericIO.h:21,
1325                 from ../../include/core/polymake/GenericVector.h:21,
1326                 from ../../include/core/polymake/Vector.h:25,
1327                 from ../../include/core-wrappers/polymake/Vector.h:21,
1328                 from ../../include/core/polymake/GenericMatrix.h:21,
1329                 from ../../include/core/polymake/Matrix.h:25,
1330                 from ../../include/core-wrappers/polymake/Matrix.h:21,
1331                 from ../../include/core/polymake/SharedMemoryMatrix.h:21,
1332                 from ../../lib/core/src/SharedMemoryMatrix.cc:18:
1333../../include/core/polymake/internal/iterators.h: In member function 'pm::iterator_pair<Iterator1, Iterator2, Params>::difference_type pm::iterator_pair<Iterator1, Iterator2, Params>::operator-(const iterator&) const':
1334../../include/core/polymake/internal/iterators.h:2270:10: warning: typedef 'error_if_unimplemented' locally defined but not used [-Wunused-local-typedefs]
1335          error_if_unimplemented;
1336          ^
1337../../include/core/polymake/internal/iterators.h: In member function 'pm::iterator_pair<Iterator1, Iterator2, Params>::difference_type pm::iterator_pair<Iterator1, Iterator2, Params>::operator-(typename pm::assign_const<pm::iterator_pair<typename pm::iterator_traits<Iterator1>::const_iterator, typename pm::iterator_traits<Iterator2>::const_iterator, Params>, (! pm::identical<pm::iterator_pair<typename pm::iterator_traits<Iterator1>::iterator, typename pm::iterator_traits<Iterator2>::iterator, Params>, pm::iterator_pair<typename pm::iterator_traits<Iterator1>::const_iterator, typename pm::iterator_traits<Iterator2>::const_iterator, Params> >::value)>::type&) const':
1338../../include/core/polymake/internal/iterators.h:2276:10: warning: typedef 'error_if_unimplemented' locally defined but not used [-Wunused-local-typedefs]
1339          error_if_unimplemented;
1340          ^
1341../../include/core/polymake/internal/iterators.h: In member function 'bool pm::iterator_pair<Iterator1, Iterator2, Params>::at_end() const':
1342../../include/core/polymake/internal/iterators.h:2313:62: warning: typedef 'error_if_unimplemented' locally defined but not used [-Wunused-local-typedefs]
1343       typedef typename enable_if<bool, _enable_at_end>::type error_if_unimplemented;
1344                                                              ^
1345../../include/core/polymake/internal/iterators.h: In member function 'int pm::iterator_pair<Iterator1, Iterator2, Params>::index() const':
1346../../include/core/polymake/internal/iterators.h:2332:60: warning: typedef 'error_if_unimplemented' locally defined but not used [-Wunused-local-typedefs]
1347       typedef typename enable_if<int, _enable_index>::type error_if_unimplemented;
1348                                                            ^
1349../../include/core/polymake/internal/iterators.h: In member function 'void pm::iterator_pair<Iterator1, Iterator2, Params>::rewind()':
1350../../include/core/polymake/internal/iterators.h:2344:61: warning: typedef 'error_if_unimplemented' locally defined but not used [-Wunused-local-typedefs]
1351       typedef typename enable_if<void,_enable_rewind>::type error_if_unimplemented;
1352                                                             ^
1353In file included from ../../include/core/polymake/internal/sparse.h:23:0,
1354                 from ../../include/core/polymake/GenericIO.h:21,
1355                 from ../../include/core/polymake/GenericVector.h:21,
1356                 from ../../include/core/polymake/Vector.h:25,
1357                 from ../../include/core-wrappers/polymake/Vector.h:21,
1358                 from ../../include/core/polymake/GenericMatrix.h:21,
1359                 from ../../include/core/polymake/Matrix.h:25,
1360                 from ../../include/core-wrappers/polymake/Matrix.h:21,
1361                 from ../../include/core/polymake/SharedMemoryMatrix.h:21,
1362                 from ../../lib/core/src/SharedMemoryMatrix.cc:18:
1363../../include/core/polymake/SelectedSubset.h: In member function 'void pm::unary_predicate_selector<Iterator, Predicate>::rewind()':
1364../../include/core/polymake/SelectedSubset.h:79:97: warning: typedef 'error_if_unimplemented' locally defined but not used [-Wunused-local-typedefs]
1365       typedef typename enable_if<super, check_iterator_feature<super, rewindable>::value>::type error_if_unimplemented;
1366                                                                                                 ^
1367In file included from ../../include/core/polymake/internal/sparse.h:23:0,
1368                 from ../../include/core/polymake/GenericIO.h:21,
1369                 from ../../include/core/polymake/GenericVector.h:21,
1370                 from ../../include/core/polymake/Vector.h:25,
1371                 from ../../include/core-wrappers/polymake/Vector.h:21,
1372                 from ../../include/core/polymake/GenericMatrix.h:21,
1373                 from ../../include/core/polymake/Matrix.h:25,
1374                 from ../../include/core-wrappers/polymake/Matrix.h:21,
1375                 from ../../include/core/polymake/SharedMemoryMatrix.h:21,
1376                 from ../../lib/core/src/SharedMemoryMatrix.cc:18:
1377../../include/core/polymake/SelectedSubset.h: In member function 'pm::binary_predicate_selector<IteratorPair, Predicate>& pm::binary_predicate_selector<IteratorPair, Predicate>::operator--()':
1378../../include/core/polymake/SelectedSubset.h:436:89: warning: typedef 'error_if_unimplemented' locally defined but not used [-Wunused-local-typedefs]
1379       typedef typename enable_if<super, iterator_traits<super>::is_bidirectional>::type error_if_unimplemented;
1380                                                                                         ^
1381../../include/core/polymake/SelectedSubset.h: In member function 'void pm::binary_predicate_selector<IteratorPair, Predicate>::rewind()':
1382../../include/core/polymake/SelectedSubset.h:449:97: warning: typedef 'error_if_unimplemented' locally defined but not used [-Wunused-local-typedefs]
1383       typedef typename enable_if<super, check_iterator_feature<super, rewindable>::value>::type error_if_unimplemented;
1384                                                                                                 ^
1385In file included from ../../include/core/polymake/internal/iterator_zipper.h:22:0,
1386                 from ../../include/core/polymake/internal/sparse.h:24,
1387                 from ../../include/core/polymake/GenericIO.h:21,
1388                 from ../../include/core/polymake/GenericVector.h:21,
1389                 from ../../include/core/polymake/Vector.h:25,
1390                 from ../../include/core-wrappers/polymake/Vector.h:21,
1391                 from ../../include/core/polymake/GenericMatrix.h:21,
1392                 from ../../include/core/polymake/Matrix.h:25,
1393                 from ../../include/core-wrappers/polymake/Matrix.h:21,
1394                 from ../../include/core/polymake/SharedMemoryMatrix.h:21,
1395                 from ../../lib/core/src/SharedMemoryMatrix.cc:18:
1396../../include/core/polymake/ContainerUnion.h: In member function 'bool pm::iterator_union<IteratorList, Category>::at_end() const':
1397../../include/core/polymake/ContainerUnion.h:449:10: warning: typedef 'error_if_unimplemented' locally defined but not used [-Wunused-local-typedefs]
1398          error_if_unimplemented;
1399          ^
1400../../include/core/polymake/ContainerUnion.h: In member function 'int pm::iterator_union<IteratorList, Category>::index() const':
1401../../include/core/polymake/ContainerUnion.h:456:10: warning: typedef 'error_if_unimplemented' locally defined but not used [-Wunused-local-typedefs]
1402          error_if_unimplemented;
1403          ^
1404../../include/core/polymake/ContainerUnion.h: In member function 'void pm::iterator_union<IteratorList, Category>::rewind()':
1405../../include/core/polymake/ContainerUnion.h:463:10: warning: typedef 'error_if_unimplemented' locally defined but not used [-Wunused-local-typedefs]
1406          error_if_unimplemented;
1407          ^
1408In file included from ../../include/core/polymake/internal/sparse.h:24:0,
1409                 from ../../include/core/polymake/GenericIO.h:21,
1410                 from ../../include/core/polymake/GenericVector.h:21,
1411                 from ../../include/core/polymake/Vector.h:25,
1412                 from ../../include/core-wrappers/polymake/Vector.h:21,
1413                 from ../../include/core/polymake/GenericMatrix.h:21,
1414                 from ../../include/core/polymake/Matrix.h:25,
1415                 from ../../include/core-wrappers/polymake/Matrix.h:21,
1416                 from ../../include/core/polymake/SharedMemoryMatrix.h:21,
1417                 from ../../lib/core/src/SharedMemoryMatrix.cc:18:
1418../../include/core/polymake/internal/iterator_zipper.h: In member function 'pm::iterator_zipper<Iterator1, Iterator2, Comparator, Controller, _use_index1, _use_index2>& pm::iterator_zipper<Iterator1, Iterator2, Comparator, Controller, _use_index1, _use_index2>::operator--()':
1419../../include/core/polymake/internal/iterator_zipper.h:198:10: warning: typedef 'error_if_unimplemented' locally defined but not used [-Wunused-local-typedefs]
1420          error_if_unimplemented;
1421          ^
1422../../include/core/polymake/internal/iterator_zipper.h: In member function 'void pm::iterator_zipper<Iterator1, Iterator2, Comparator, Controller, _use_index1, _use_index2>::rewind()':
1423../../include/core/polymake/internal/iterator_zipper.h:225:10: warning: typedef 'error_if_unimplemented' locally defined but not used [-Wunused-local-typedefs]
1424          error_if_unimplemented;
1425          ^
1426In file included from ../../include/core/polymake/GenericVector.h:22:0,
1427                 from ../../include/core/polymake/Vector.h:25,
1428                 from ../../include/core-wrappers/polymake/Vector.h:21,
1429                 from ../../include/core/polymake/GenericMatrix.h:21,
1430                 from ../../include/core/polymake/Matrix.h:25,
1431                 from ../../include/core-wrappers/polymake/Matrix.h:21,
1432                 from ../../include/core/polymake/SharedMemoryMatrix.h:21,
1433                 from ../../lib/core/src/SharedMemoryMatrix.cc:18:
1434../../include/core/polymake/TransformedContainer.h: In member function 'void pm::iterator_product<Iterator1, Iterator2, _has_state1, true>::rewind()':
1435../../include/core/polymake/TransformedContainer.h:429:10: warning: typedef 'error_if_unimplemented' locally defined but not used [-Wunused-local-typedefs]
1436          error_if_unimplemented;
1437          ^
1438In file included from ../../include/core/polymake/GenericVector.h:24:0,
1439                 from ../../include/core/polymake/Vector.h:25,
1440                 from ../../include/core-wrappers/polymake/Vector.h:21,
1441                 from ../../include/core/polymake/GenericMatrix.h:21,
1442                 from ../../include/core/polymake/Matrix.h:25,
1443                 from ../../include/core-wrappers/polymake/Matrix.h:21,
1444                 from ../../include/core/polymake/SharedMemoryMatrix.h:21,
1445                 from ../../lib/core/src/SharedMemoryMatrix.cc:18:
1446../../include/core/polymake/IndexedSubset.h: In member function 'pm::indexed_selector<Iterator1, Iterator2, renumber, _reversed>& pm::indexed_selector<Iterator1, Iterator2, renumber, _reversed>::operator--()':
1447../../include/core/polymake/IndexedSubset.h:183:107: warning: typedef 'error_if_unimplemented' locally defined but not used [-Wunused-local-typedefs]
1448       typedef typename enable_if<void, iterator_pair_traits<Iterator1,Iterator2>::is_bidirectional>::type error_if_unimplemented;
1449                                                                                                           ^
1450../../include/core/polymake/IndexedSubset.h: In member function 'pm::indexed_selector<Iterator1, Iterator2, renumber, _reversed>& pm::indexed_selector<Iterator1, Iterator2, renumber, _reversed>::operator+=(int)':
1451../../include/core/polymake/IndexedSubset.h:191:100: warning: typedef 'error_if_unimplemented' locally defined but not used [-Wunused-local-typedefs]
1452       typedef typename enable_if<void, iterator_pair_traits<Iterator1,Iterator2>::is_random>::type error_if_unimplemented;
1453                                                                                                    ^
1454../../include/core/polymake/IndexedSubset.h: In member function 'pm::indexed_selector<Iterator1, Iterator2, renumber, _reversed>& pm::indexed_selector<Iterator1, Iterator2, renumber, _reversed>::operator-=(int)':
1455../../include/core/polymake/IndexedSubset.h:197:100: warning: typedef 'error_if_unimplemented' locally defined but not used [-Wunused-local-typedefs]
1456       typedef typename enable_if<void, iterator_pair_traits<Iterator1,Iterator2>::is_random>::type error_if_unimplemented;
1457                                                                                                    ^
1458../../include/core/polymake/IndexedSubset.h: In member function 'typename pm::enable_if<typename pm::iterator_traits<Iterator2>::difference_type, pm::comparable_iterator<pm::indexed_selector<Iterator1, Iterator2, renumber, _reversed>, Iterator>::value>::type pm::indexed_selector<Iterator1, Iterator2, renumber, _reversed>::operator-(const Iterator&) const':
1459../../include/core/polymake/IndexedSubset.h:210:100: warning: typedef 'error_if_unimplemented' locally defined but not used [-Wunused-local-typedefs]
1460       typedef typename enable_if<void, iterator_pair_traits<Iterator1,Iterator2>::is_random>::type error_if_unimplemented;
1461                                                                                                    ^
1462../../include/core/polymake/IndexedSubset.h: In member function 'typename pm::iterator_traits<Iterator1>::derivable_type::reference pm::indexed_selector<Iterator1, Iterator2, renumber, _reversed>::operator[](int) const':
1463../../include/core/polymake/IndexedSubset.h:216:100: warning: typedef 'error_if_unimplemented' locally defined but not used [-Wunused-local-typedefs]
1464       typedef typename enable_if<void, iterator_pair_traits<Iterator1,Iterator2>::is_random>::type error_if_unimplemented;
1465                                                                                                    ^
1466../../include/core/polymake/IndexedSubset.h: In member function 'void pm::indexed_selector<Iterator1, Iterator2, renumber, _reversed>::rewind()':
1467../../include/core/polymake/IndexedSubset.h:250:3: warning: typedef 'error_if_unimplemented' locally defined but not used [-Wunused-local-typedefs]
1468   error_if_unimplemented;
1469   ^
1470../../include/core/polymake/IndexedSubset.h: In member function 'void pm::indexed_selector<Iterator1, Iterator2, renumber, _reversed>::contract(bool, int, int)':
1471../../include/core/polymake/IndexedSubset.h:258:3: warning: typedef 'error_if_unimplemented' locally defined but not used [-Wunused-local-typedefs]
1472   error_if_unimplemented;
1473   ^
1474In file included from ../../include/core/polymake/GenericVector.h:26:0,
1475                 from ../../include/core/polymake/Vector.h:25,
1476                 from ../../include/core-wrappers/polymake/Vector.h:21,
1477                 from ../../include/core/polymake/GenericMatrix.h:21,
1478                 from ../../include/core/polymake/Matrix.h:25,
1479                 from ../../include/core-wrappers/polymake/Matrix.h:21,
1480                 from ../../include/core/polymake/SharedMemoryMatrix.h:21,
1481                 from ../../lib/core/src/SharedMemoryMatrix.cc:18:
1482../../include/core/polymake/ContainerChain.h: In member function 'void pm::iterator_chain<IteratorList, _reversed>::rewind()':
1483../../include/core/polymake/ContainerChain.h:463:10: warning: typedef 'error_if_unimplemented' locally defined but not used [-Wunused-local-typedefs]
1484          error_if_unimplemented;
1485          ^
1486../../include/core/polymake/ContainerChain.h: In member function 'int pm::iterator_chain<IteratorList, _reversed>::index() const':
1487../../include/core/polymake/ContainerChain.h:472:10: warning: typedef 'error_if_unimplemented' locally defined but not used [-Wunused-local-typedefs]
1488          error_if_unimplemented;
1489          ^
1490In file included from ../../include/core/polymake/GenericMatrix.h:22:0,
1491                 from ../../include/core/polymake/Matrix.h:25,
1492                 from ../../include/core-wrappers/polymake/Matrix.h:21,
1493                 from ../../include/core/polymake/SharedMemoryMatrix.h:21,
1494                 from ../../lib/core/src/SharedMemoryMatrix.cc:18:
1495../../include/core/polymake/CascadedContainer.h: In member function 'void pm::cascaded_iterator<Iterator, ExpectedFeatures, depth>::rewind()':
1496../../include/core/polymake/CascadedContainer.h:138:70: warning: typedef 'error_if_unimplemented' locally defined but not used [-Wunused-local-typedefs]
1497       typedef typename enable_if_iterator<Iterator,rewindable>::type error_if_unimplemented;
1498                                                                      ^
1499g++ -c -o AccurateFloat.o -fPIC -I/opt/sage_flatsurf/local/var/tmp/sage/build/polymake-2.12/src/include/core-wrappers -I/opt/sage_flatsurf/local/var/tmp/sage/build/polymake-2.12/src/include/core -march=native -ftemplate-depth-200 -Wall -Wno-strict-aliasing -Wno-parentheses -I/opt/sage_flatsurf/local/include -DNDEBUG -DPOLYMAKE_DEBUG=0 -O3 -MD -MF AccurateFloat.d -MT 'AccurateFloat.o'    /opt/sage_flatsurf/local/var/tmp/sage/build/polymake-2.12/src/lib/core/src/AccurateFloat.cc
1500In file included from ../../include/core/polymake/internal/operations_basic_defs.h:21:0,
1501                 from ../../include/core/polymake/internal/operations.h:21,
1502                 from ../../include/core/polymake/Integer.h:25,
1503                 from ../../include/core-wrappers/polymake/Integer.h:21,
1504                 from ../../include/core/polymake/Rational.h:26,
1505                 from ../../include/core-wrappers/polymake/Rational.h:21,
1506                 from ../../include/core/polymake/AccurateFloat.h:21,
1507                 from ../../lib/core/src/AccurateFloat.cc:18:
1508../../include/core/polymake/internal/type_manip.h: In function 'void pm::assert_overloaded(T, T)':
1509../../include/core/polymake/internal/type_manip.h:764:47: warning: typedef 'method_must_be_overloaded' locally defined but not used [-Wunused-local-typedefs]
1510    typedef typename enable_if<T, false>::type method_must_be_overloaded;
1511                                               ^
1512In file included from ../../include/core/polymake/internal/operations.h:22:0,
1513                 from ../../include/core/polymake/Integer.h:25,
1514                 from ../../include/core-wrappers/polymake/Integer.h:21,
1515                 from ../../include/core/polymake/Rational.h:26,
1516                 from ../../include/core-wrappers/polymake/Rational.h:21,
1517                 from ../../include/core/polymake/AccurateFloat.h:21,
1518                 from ../../lib/core/src/AccurateFloat.cc:18:
1519../../include/core/polymake/internal/iterators.h: In member function 'pm::iterator_pair<Iterator1, Iterator2, Params>::difference_type pm::iterator_pair<Iterator1, Iterator2, Params>::operator-(const iterator&) const':
1520../../include/core/polymake/internal/iterators.h:2270:10: warning: typedef 'error_if_unimplemented' locally defined but not used [-Wunused-local-typedefs]
1521          error_if_unimplemented;
1522          ^
1523../../include/core/polymake/internal/iterators.h: In member function 'pm::iterator_pair<Iterator1, Iterator2, Params>::difference_type pm::iterator_pair<Iterator1, Iterator2, Params>::operator-(typename pm::assign_const<pm::iterator_pair<typename pm::iterator_traits<Iterator1>::const_iterator, typename pm::iterator_traits<Iterator2>::const_iterator, Params>, (! pm::identical<pm::iterator_pair<typename pm::iterator_traits<Iterator1>::iterator, typename pm::iterator_traits<Iterator2>::iterator, Params>, pm::iterator_pair<typename pm::iterator_traits<Iterator1>::const_iterator, typename pm::iterator_traits<Iterator2>::const_iterator, Params> >::value)>::type&) const':
1524../../include/core/polymake/internal/iterators.h:2276:10: warning: typedef 'error_if_unimplemented' locally defined but not used [-Wunused-local-typedefs]
1525          error_if_unimplemented;
1526          ^
1527../../include/core/polymake/internal/iterators.h: In member function 'bool pm::iterator_pair<Iterator1, Iterator2, Params>::at_end() const':
1528../../include/core/polymake/internal/iterators.h:2313:62: warning: typedef 'error_if_unimplemented' locally defined but not used [-Wunused-local-typedefs]
1529       typedef typename enable_if<bool, _enable_at_end>::type error_if_unimplemented;
1530                                                              ^
1531../../include/core/polymake/internal/iterators.h: In member function 'int pm::iterator_pair<Iterator1, Iterator2, Params>::index() const':
1532../../include/core/polymake/internal/iterators.h:2332:60: warning: typedef 'error_if_unimplemented' locally defined but not used [-Wunused-local-typedefs]
1533       typedef typename enable_if<int, _enable_index>::type error_if_unimplemented;
1534                                                            ^
1535../../include/core/polymake/internal/iterators.h: In member function 'void pm::iterator_pair<Iterator1, Iterator2, Params>::rewind()':
1536../../include/core/polymake/internal/iterators.h:2344:61: warning: typedef 'error_if_unimplemented' locally defined but not used [-Wunused-local-typedefs]
1537       typedef typename enable_if<void,_enable_rewind>::type error_if_unimplemented;
1538                                                             ^
1539In file included from ../../include/core/polymake/internal/sparse.h:23:0,
1540                 from ../../include/core/polymake/TransformedContainer.h:21,
1541                 from ../../include/core/polymake/internal/comparators.h:22,
1542                 from ../../include/core/polymake/Integer.h:26,
1543                 from ../../include/core-wrappers/polymake/Integer.h:21,
1544                 from ../../include/core/polymake/Rational.h:26,
1545                 from ../../include/core-wrappers/polymake/Rational.h:21,
1546                 from ../../include/core/polymake/AccurateFloat.h:21,
1547                 from ../../lib/core/src/AccurateFloat.cc:18:
1548../../include/core/polymake/SelectedSubset.h: In member function 'void pm::unary_predicate_selector<Iterator, Predicate>::rewind()':
1549../../include/core/polymake/SelectedSubset.h:79:97: warning: typedef 'error_if_unimplemented' locally defined but not used [-Wunused-local-typedefs]
1550       typedef typename enable_if<super, check_iterator_feature<super, rewindable>::value>::type error_if_unimplemented;
1551                                                                                                 ^
1552In file included from ../../include/core/polymake/internal/sparse.h:23:0,
1553                 from ../../include/core/polymake/TransformedContainer.h:21,
1554                 from ../../include/core/polymake/internal/comparators.h:22,
1555                 from ../../include/core/polymake/Integer.h:26,
1556                 from ../../include/core-wrappers/polymake/Integer.h:21,
1557                 from ../../include/core/polymake/Rational.h:26,
1558                 from ../../include/core-wrappers/polymake/Rational.h:21,
1559                 from ../../include/core/polymake/AccurateFloat.h:21,
1560                 from ../../lib/core/src/AccurateFloat.cc:18:
1561../../include/core/polymake/SelectedSubset.h: In member function 'pm::binary_predicate_selector<IteratorPair, Predicate>& pm::binary_predicate_selector<IteratorPair, Predicate>::operator--()':
1562../../include/core/polymake/SelectedSubset.h:436:89: warning: typedef 'error_if_unimplemented' locally defined but not used [-Wunused-local-typedefs]
1563       typedef typename enable_if<super, iterator_traits<super>::is_bidirectional>::type error_if_unimplemented;
1564                                                                                         ^
1565../../include/core/polymake/SelectedSubset.h: In member function 'void pm::binary_predicate_selector<IteratorPair, Predicate>::rewind()':
1566../../include/core/polymake/SelectedSubset.h:449:97: warning: typedef 'error_if_unimplemented' locally defined but not used [-Wunused-local-typedefs]
1567       typedef typename enable_if<super, check_iterator_feature<super, rewindable>::value>::type error_if_unimplemented;
1568                                                                                                 ^
1569In file included from ../../include/core/polymake/internal/iterator_zipper.h:22:0,
1570                 from ../../include/core/polymake/internal/sparse.h:24,
1571                 from ../../include/core/polymake/TransformedContainer.h:21,
1572                 from ../../include/core/polymake/internal/comparators.h:22,
1573                 from ../../include/core/polymake/Integer.h:26,
1574                 from ../../include/core-wrappers/polymake/Integer.h:21,
1575                 from ../../include/core/polymake/Rational.h:26,
1576                 from ../../include/core-wrappers/polymake/Rational.h:21,
1577                 from ../../include/core/polymake/AccurateFloat.h:21,
1578                 from ../../lib/core/src/AccurateFloat.cc:18:
1579../../include/core/polymake/ContainerUnion.h: In member function 'bool pm::iterator_union<IteratorList, Category>::at_end() const':
1580../../include/core/polymake/ContainerUnion.h:449:10: warning: typedef 'error_if_unimplemented' locally defined but not used [-Wunused-local-typedefs]
1581          error_if_unimplemented;
1582          ^
1583../../include/core/polymake/ContainerUnion.h: In member function 'int pm::iterator_union<IteratorList, Category>::index() const':
1584../../include/core/polymake/ContainerUnion.h:456:10: warning: typedef 'error_if_unimplemented' locally defined but not used [-Wunused-local-typedefs]
1585          error_if_unimplemented;
1586          ^
1587../../include/core/polymake/ContainerUnion.h: In member function 'void pm::iterator_union<IteratorList, Category>::rewind()':
1588../../include/core/polymake/ContainerUnion.h:463:10: warning: typedef 'error_if_unimplemented' locally defined but not used [-Wunused-local-typedefs]
1589          error_if_unimplemented;
1590          ^
1591In file included from ../../include/core/polymake/internal/sparse.h:24:0,
1592                 from ../../include/core/polymake/TransformedContainer.h:21,
1593                 from ../../include/core/polymake/internal/comparators.h:22,
1594                 from ../../include/core/polymake/Integer.h:26,
1595                 from ../../include/core-wrappers/polymake/Integer.h:21,
1596                 from ../../include/core/polymake/Rational.h:26,
1597                 from ../../include/core-wrappers/polymake/Rational.h:21,
1598                 from ../../include/core/polymake/AccurateFloat.h:21,
1599                 from ../../lib/core/src/AccurateFloat.cc:18:
1600../../include/core/polymake/internal/iterator_zipper.h: In member function 'pm::iterator_zipper<Iterator1, Iterator2, Comparator, Controller, _use_index1, _use_index2>& pm::iterator_zipper<Iterator1, Iterator2, Comparator, Controller, _use_index1, _use_index2>::operator--()':
1601../../include/core/polymake/internal/iterator_zipper.h:198:10: warning: typedef 'error_if_unimplemented' locally defined but not used [-Wunused-local-typedefs]
1602          error_if_unimplemented;
1603          ^
1604../../include/core/polymake/internal/iterator_zipper.h: In member function 'void pm::iterator_zipper<Iterator1, Iterator2, Comparator, Controller, _use_index1, _use_index2>::rewind()':
1605../../include/core/polymake/internal/iterator_zipper.h:225:10: warning: typedef 'error_if_unimplemented' locally defined but not used [-Wunused-local-typedefs]
1606          error_if_unimplemented;
1607          ^
1608In file included from ../../include/core/polymake/internal/comparators.h:22:0,
1609                 from ../../include/core/polymake/Integer.h:26,
1610                 from ../../include/core-wrappers/polymake/Integer.h:21,
1611                 from ../../include/core/polymake/Rational.h:26,
1612                 from ../../include/core-wrappers/polymake/Rational.h:21,
1613                 from ../../include/core/polymake/AccurateFloat.h:21,
1614                 from ../../lib/core/src/AccurateFloat.cc:18:
1615../../include/core/polymake/TransformedContainer.h: In member function 'void pm::iterator_product<Iterator1, Iterator2, _has_state1, true>::rewind()':
1616../../include/core/polymake/TransformedContainer.h:429:10: warning: typedef 'error_if_unimplemented' locally defined but not used [-Wunused-local-typedefs]
1617          error_if_unimplemented;
1618          ^
1619g++ -c -o lib_init.o -fPIC -I/opt/sage_flatsurf/local/var/tmp/sage/build/polymake-2.12/src/include/core-wrappers -I/opt/sage_flatsurf/local/var/tmp/sage/build/polymake-2.12/src/include/core -march=native -ftemplate-depth-200 -Wall -Wno-strict-aliasing -Wno-parentheses -I/opt/sage_flatsurf/local/include -DNDEBUG -DPOLYMAKE_DEBUG=0 -O3 -MD -MF lib_init.d -MT 'lib_init.o'    /opt/sage_flatsurf/local/var/tmp/sage/build/polymake-2.12/src/lib/core/src/lib_init.cc
1620g++ -c -o pipestream.o -fPIC -I/opt/sage_flatsurf/local/var/tmp/sage/build/polymake-2.12/src/include/core-wrappers -I/opt/sage_flatsurf/local/var/tmp/sage/build/polymake-2.12/src/include/core -march=native -ftemplate-depth-200 -Wall -Wno-strict-aliasing -Wno-parentheses -I/opt/sage_flatsurf/local/include -DNDEBUG -DPOLYMAKE_DEBUG=0 -O3 -MD -MF pipestream.d -MT 'pipestream.o'    /opt/sage_flatsurf/local/var/tmp/sage/build/polymake-2.12/src/lib/core/src/pipestream.cc
1621g++ -c -o standalone_init.o -fPIC -I/opt/sage_flatsurf/local/var/tmp/sage/build/polymake-2.12/src/include/core-wrappers -I/opt/sage_flatsurf/local/var/tmp/sage/build/polymake-2.12/src/include/core -march=native -ftemplate-depth-200 -Wall -Wno-strict-aliasing -Wno-parentheses -I/opt/sage_flatsurf/local/include -DNDEBUG -DPOLYMAKE_DEBUG=0 -O3 -MD -MF standalone_init.d -MT 'standalone_init.o'    /opt/sage_flatsurf/local/var/tmp/sage/build/polymake-2.12/src/lib/core/src/standalone_init.cc
1622g++ -shared -L/usr/local/lib -fstack-protector -o ../lib/core.so linalg_float.o Ring.o RandomGenerators.o Rational.o CharBuffer.o PlainParser.o inlines.o Bitset.o Integer.o socketstream.o color.o FacetList.o SharedMemoryMatrix.o AccurateFloat.o lib_init.o pipestream.o standalone_init.o  -L/opt/sage_flatsurf/local/lib -Wl,-rpath,/opt/sage_flatsurf/local/lib  -lmpfr -lgmp
1623cd ../perlx-5.20.1-x86_64-linux-gnu-thread-multi; \
1624/usr/bin/perl /opt/sage_flatsurf/local/var/tmp/sage/build/polymake-2.12/src/lib/core/src/perl/Makefile.PL \
1625        TOP=/opt/sage_flatsurf/local/var/tmp/sage/build/polymake-2.12/src SourceDir=/opt/sage_flatsurf/local/var/tmp/sage/build/polymake-2.12/src/lib/core/src/perl \
1626        libxml2Cflags="-I/usr/include/libxml2" libxml2Libs="-lxml2"
1627Checking if your kit is complete...
1628Looks good
1629Generating a Unix-style Makefile
1630Writing Makefile for Polymake::Ext
1631Writing MYMETA.yml and MYMETA.json
1632make[2]: Entering directory '/opt/sage_flatsurf/local/var/tmp/sage/build/polymake-2.12/src/build.x86_64/perlx-5.20.1-x86_64-linux-gnu-thread-multi'
1633/usr/bin/perl /usr/share/perl/5.20/ExtUtils/xsubpp  -typemap /usr/share/perl/5.20/ExtUtils/typemap  Customize.xs > Customize.xsc && mv Customize.xsc Customize.c
1634cc -c  -I/opt/sage_flatsurf/local/var/tmp/sage/build/polymake-2.12/src/include/core -D_REENTRANT -D_GNU_SOURCE -DDEBIAN -fwrapv -fno-strict-aliasing -pipe -I/usr/local/include -D_LARGEFILE_SOURCE -D_FILE_OFFSET_BITS=64 -O2 -g   -DVERSION=\"\" -DXS_VERSION=\"\" -fPIC "-I/usr/lib/x86_64-linux-gnu/perl/5.20/CORE"  -DPerlVersion=5201 -Wno-nonnull Customize.c
1635/usr/bin/perl /usr/share/perl/5.20/ExtUtils/xsubpp  -typemap /usr/share/perl/5.20/ExtUtils/typemap  Ext.xs > Ext.xsc && mv Ext.xsc Ext.c
1636cc -c  -I/opt/sage_flatsurf/local/var/tmp/sage/build/polymake-2.12/src/include/core -D_REENTRANT -D_GNU_SOURCE -DDEBIAN -fwrapv -fno-strict-aliasing -pipe -I/usr/local/include -D_LARGEFILE_SOURCE -D_FILE_OFFSET_BITS=64 -O2 -g   -DVERSION=\"\" -DXS_VERSION=\"\" -fPIC "-I/usr/lib/x86_64-linux-gnu/perl/5.20/CORE"  -DPerlVersion=5201 -Wno-nonnull Ext.c
1637Ext.xs: In function 'pm_perl_get_cx_curpad':
1638Ext.xs:45:88: error: 'PADLIST' has no member named 'sv_u'
1639    return (SV**)AvARRAY(((AV**)AvARRAY(CvPADLIST(cv)))[d+1]);
1640                                                                                        ^
1641Makefile:380: recipe for target 'Ext.o' failed
1642make[2]: *** [Ext.o] Error 1
1643make[2]: Leaving directory '/opt/sage_flatsurf/local/var/tmp/sage/build/polymake-2.12/src/build.x86_64/perlx-5.20.1-x86_64-linux-gnu-thread-multi'
1644/opt/sage_flatsurf/local/var/tmp/sage/build/polymake-2.12/src/support/corelib.make:101: recipe for target 'compile-xs' failed
1645make[1]: *** [compile-xs] Error 2
1646make[1]: Leaving directory '/opt/sage_flatsurf/local/var/tmp/sage/build/polymake-2.12/src/build.x86_64/lib'
1647Makefile:89: recipe for target 'compile' failed
1648make: *** [compile] Error 2
1649Failed to build polymake
1650
1651real    0m2.997s
1652user    0m2.572s
1653sys     0m0.224s
1654************************************************************************
1655Error installing package polymake-2.12
1656************************************************************************
1657Please email sage-devel (http://groups.google.com/group/sage-devel)
1658explaining the problem and including the relevant part of the log file
1659  /opt/sage_flatsurf/logs/pkgs/polymake-2.12.log
1660Describe your computer, operating system, etc.
1661If you want to try to fix the problem yourself, *don't* just cd to
1662/opt/sage_flatsurf/local/var/tmp/sage/build/polymake-2.12 and type 'make' or whatever is appropriate.
1663Instead, the following commands setup all environment variables
1664correctly and load a subshell for you to debug the error:
1665  (cd '/opt/sage_flatsurf/local/var/tmp/sage/build/polymake-2.12' && '/opt/sage_flatsurf/sage' --sh)
1666When you are done debugging, you can type "exit" to leave the subshell.
1667************************************************************************