Ticket #10508: atlas-3.10.0.p1.ARMv7.native.log

File atlas-3.10.0.p1.ARMv7.native.log, 11.6 KB (added by Snark, 8 years ago)

Log of compilation of atlas-3.10.0.p1 with SAGE_ATLAS_ARCH=ARMv7 on a native box

Line 
1atlas-3.10.0.p1
2====================================================
3Extracting package /home/jpuydt/sage-5.4/../atlas-3.10.0.p1.spkg
4-rw-r--r-- 1 jpuydt jpuydt 10037519 déc.  22 11:19 /home/jpuydt/sage-5.4/../atlas-3.10.0.p1.spkg
5atlas-3.10.0.p1
6====================================================
7Extracting package /home/jpuydt/sage-5.4/../atlas-3.10.0.p1.spkg
8-rw-r--r-- 1 jpuydt jpuydt 10037519 déc.  22 11:19 /home/jpuydt/sage-5.4/../atlas-3.10.0.p1.spkg
9Finished extraction
10****************************************************
11Host system:
12Linux hecke 3.0.27-1-ac100 #1-Ubuntu SMP PREEMPT Fri Apr 13 04:03:49 UTC 2012 armv7l armv7l armv7l GNU/Linux
13****************************************************
14C compiler: gcc
15C compiler version:
16Utilisation des specs internes.
17COLLECT_GCC=gcc
18COLLECT_LTO_WRAPPER=/usr/lib/gcc/arm-linux-gnueabihf/4.7/lto-wrapper
19Target: arm-linux-gnueabihf
20Configuré avec: ../src/configure -v --with-pkgversion='Ubuntu/Linaro 4.7.2-2ubuntu1' --with-bugurl=file:///usr/share/doc/gcc-4.7/README.Bugs --enable-languages=c,c++,go,fortran,objc,obj-c++ --prefix=/usr --program-suffix=-4.7 --enable-shared --enable-linker-build-id --with-system-zlib --libexecdir=/usr/lib --without-included-gettext --enable-threads=posix --with-gxx-include-dir=/usr/include/c++/4.7 --libdir=/usr/lib --enable-nls --with-sysroot=/ --enable-clocale=gnu --enable-libstdcxx-debug --enable-libstdcxx-time=yes --enable-gnu-unique-object --disable-libitm --enable-plugin --enable-objc-gc --enable-multilib --disable-sjlj-exceptions --with-arch=armv7-a --with-fpu=vfpv3-d16 --with-float=hard --with-mode=thumb --disable-werror --enable-checking=release --build=arm-linux-gnueabihf --host=arm-linux-gnueabihf --target=arm-linux-gnueabihf
21Modèle de thread: posix
22gcc version 4.7.2 (Ubuntu/Linaro 4.7.2-2ubuntu1)
23****************************************************
24Configuration:
25    SAGE_LOCAL: /home/jpuydt/sage-5.4/local
26    linker_Solaris?: False
27    OS_X_Lion?: False
28    PPC?: False
29    linker_Darwin?: False
30    Linux?: True
31    SPKG_DIR: /home/jpuydt/sage-5.4/spkg/build/atlas-3.10.0.p1
32    linker_GNU?: True
33    ld: GNU
34    system: Linux
35    Darwin?: False
36    machine: armv7l
37    fortran: gfortran
38    Solaris?: False
39    fortran_g95?: False
40    bits: 32bit
41    CYGWIN?: False
42    SPARC?: False
43    fortran_GNU?: True
44    FreeBSD?: False
45    32bit?: True
46    IA64?: False
47    generic_binary?: False
48    64bit?: False
49    release: 3.0.27-1-ac100
50    Intel?: False
51    processor: armv7l
52Running patch -p0 --input /home/jpuydt/sage-5.4/spkg/build/atlas-3.10.0.p1/patches/long_filenames.patch
53patching file src/bin/extract.c
54Running patch -p0 --input /home/jpuydt/sage-5.4/spkg/build/atlas-3.10.0.p1/patches/Makefile.patch
55patching file src/CONFIG/src/Makefile
56Running patch -p0 --input /home/jpuydt/sage-5.4/spkg/build/atlas-3.10.0.p1/patches/probe_comp.c.patch
57patching file src/CONFIG/src/probe_comp.c
58Running patch -p0 --input /home/jpuydt/sage-5.4/spkg/build/atlas-3.10.0.p1/patches/solaris_test.patch
59patching file src/configure
60Running patch -p0 --input /home/jpuydt/sage-5.4/spkg/build/atlas-3.10.0.p1/patches/archinfo_linux.c.patch
61patching file src/CONFIG/src/backend/archinfo_linux.c
62Running patch -p0 --input /home/jpuydt/sage-5.4/spkg/build/atlas-3.10.0.p1/patches/fix_missing_return.patch
63patching file src/tune/sysinfo/matime.c
64Building using specific architecture.
65Running configure with arch = ARMv7, isa extensions [], archdef dir None
66Running ../src/configure --prefix=/home/jpuydt/sage-5.4/local --with-netlib-lapack-tarfile=/home/jpuydt/sage-5.4/spkg/build/atlas-3.10.0.p1/lapack-3.4.1.tar --cc="gcc" -Si latune 0 -Fa alg -fPIC -C if "/home/jpuydt/sage-5.4/local/bin/sage_fortran" -C acg "/usr/bin/gcc" -b 32 -O 1 -A 46 -V 0
67gcc -I/home/jpuydt/sage-5.4/spkg/build/atlas-3.10.0.p1/ATLAS-build/../src//CONFIG/include  -g -w -c /home/jpuydt/sage-5.4/spkg/build/atlas-3.10.0.p1/ATLAS-build/../src//CONFIG/src/atlconf_misc.c
68gcc -I/home/jpuydt/sage-5.4/spkg/build/atlas-3.10.0.p1/ATLAS-build/../src//CONFIG/include  -g -w -o xconfig /home/jpuydt/sage-5.4/spkg/build/atlas-3.10.0.p1/ATLAS-build/../src//CONFIG/src/config.c atlconf_misc.o
69./xconfig -d s /home/jpuydt/sage-5.4/spkg/build/atlas-3.10.0.p1/ATLAS-build/../src/ -d b /home/jpuydt/sage-5.4/spkg/build/atlas-3.10.0.p1/ATLAS-build  -Si lapackref 1 -Si latune 0 -Fa alg -fPIC -C if /home/jpuydt/sage-5.4/local/bin/sage_fortran -C acg /usr/bin/gcc -b 32 -O 1 -A 46 -V 0
70It appears you have cpu throttling enabled, which makes timings
71unreliable and an ATLAS install nonsensical.  Aborting.
72See ATLAS/INSTALL.txt for further information
73Ignoring CPU throttling by user override!
74
75gcc -I/home/jpuydt/sage-5.4/spkg/build/atlas-3.10.0.p1/ATLAS-build/../src//CONFIG/include  -g -w -o xisgcc /home/jpuydt/sage-5.4/spkg/build/atlas-3.10.0.p1/ATLAS-build/../src//CONFIG/src/IsGcc.c atlconf_misc.o
76gcc -I/home/jpuydt/sage-5.4/spkg/build/atlas-3.10.0.p1/ATLAS-build/../src//CONFIG/include  -g -w -c /home/jpuydt/sage-5.4/spkg/build/atlas-3.10.0.p1/ATLAS-build/../src//CONFIG/src/probe_comp.c
77gcc -I/home/jpuydt/sage-5.4/spkg/build/atlas-3.10.0.p1/ATLAS-build/../src//CONFIG/include  -g -w -o xprobe_comp probe_comp.o atlconf_misc.o
78rm -f config1.out
79make -j1 atlas_run atldir=/home/jpuydt/sage-5.4/spkg/build/atlas-3.10.0.p1/ATLAS-build exe=xprobe_comp redir=config1.out \
80                args="-v 0 -o atlconf.txt -O 1 -A 46 -Si nof77 0 -V 0  -C ic '/usr/bin/gcc' -Fa ic '-fPIC' -C sm '/usr/bin/gcc' -Fa sm '-fPIC' -C dm '/usr/bin/gcc' -Fa dm '-fPIC' -C sk '/usr/bin/gcc' -Fa sk '-fPIC' -C dk '/usr/bin/gcc' -Fa dk '-fPIC' -C xc '/usr/bin/gcc' -Fa xc '-fPIC' -C gc '/usr/bin/gcc' -Fa gc '-fPIC' -C if '/home/jpuydt/sage-5.4/local/bin/sage_fortran' -Fa if '-fPIC' -b 32 -d b /home/jpuydt/sage-5.4/spkg/build/atlas-3.10.0.p1/ATLAS-build"
81make[1]: entrant dans le répertoire « /home/jpuydt/sage-5.4/spkg/build/atlas-3.10.0.p1/ATLAS-build »
82cd /home/jpuydt/sage-5.4/spkg/build/atlas-3.10.0.p1/ATLAS-build ; ./xprobe_comp -v 0 -o atlconf.txt -O 1 -A 46 -Si nof77 0 -V 0  -C ic '/usr/bin/gcc' -Fa ic '-fPIC' -C sm '/usr/bin/gcc' -Fa sm '-fPIC' -C dm '/usr/bin/gcc' -Fa dm '-fPIC' -C sk '/usr/bin/gcc' -Fa sk '-fPIC' -C dk '/usr/bin/gcc' -Fa dk '-fPIC' -C xc '/usr/bin/gcc' -Fa xc '-fPIC' -C gc '/usr/bin/gcc' -Fa gc '-fPIC' -C if '/home/jpuydt/sage-5.4/local/bin/sage_fortran' -Fa if '-fPIC' -b 32 -d b /home/jpuydt/sage-5.4/spkg/build/atlas-3.10.0.p1/ATLAS-build > config1.out
83/usr/bin/ld: erreur: xctest passe les paramètres dans un registre VFP alors que /tmp/ccIvceSL.o ne le fait pas
84Succès: échec de fusion des données spécifiques cibles du fichier /tmp/ccIvceSL.o
85collect2: erreur: ld a retourné 1 code d'état d'exécution
86make[2]: *** [IRunCComp] Erreur 1
87
88
89Unable to find usable compiler for ICC; abortingMake sure compilers are in your path, and specify good compilers to configure
90(see INSTALL.txt or 'configure --help' for details)make[1]: *** [atlas_run] Erreur 1
91make[1]: quittant le répertoire « /home/jpuydt/sage-5.4/spkg/build/atlas-3.10.0.p1/ATLAS-build »
92make: *** [IRun_comp] Erreur 2
93ERROR 512 IN SYSCMND: 'make IRun_comp args="-v 0 -o atlconf.txt -O 1 -A 46 -Si nof77 0 -V 0  -C ic '/usr/bin/gcc' -Fa ic '-fPIC' -C sm '/usr/bin/gcc' -Fa sm '-fPIC' -C dm '/usr/bin/gcc' -Fa dm '-fPIC' -C sk '/usr/bin/gcc' -Fa sk '-fPIC' -C dk '/usr/bin/gcc' -Fa dk '-fPIC' -C xc '/usr/bin/gcc' -Fa xc '-fPIC' -C gc '/usr/bin/gcc' -Fa gc '-fPIC' -C if '/home/jpuydt/sage-5.4/local/bin/sage_fortran' -Fa if '-fPIC' -b 32"'
94
95Assembly configured as GAS_ARM (7)
96
97Bad VECFLAG value=0, res='VECFLAG=0
98'
99
100Vector ISA Extension configured as   (0,0)
101
102Bad CPU MHZ value=0, res='CPU MHZ=0
103'
104
105Clock rate configured as 0Mhz
106
107Maximum number of threads configured as  2
108Parallel make command configured as '$(MAKE) -j 2'
109CPU Throttling apparently enabled!
110mkdir src bin tune interfaces
111cd src ; mkdir testing auxil blas lapack pthreads threads
112cd src/blas ; \
113           mkdir f77reference reference gemv ger gemm kbmm \
114                 level1 level2 level3 pklevel3
115cd src/blas/reference ; mkdir level1 level2 level3
116cd src/blas/level2 ; mkdir kernel
117cd src/blas/pklevel3 ; mkdir gpmm sprk
118cd src/blas/level3 ; mkdir rblas kernel
119cd src/pthreads ; mkdir blas misc
120cd src/pthreads/blas ; mkdir level1 level2 level3
121cd src/threads ; mkdir blas lapack
122cd src/threads/blas ; mkdir level3 level2
123cd tune ; mkdir blas sysinfo lapack threads
124cd tune/blas ; mkdir gemm gemv ger level1 level3
125cd interfaces ; mkdir blas lapack
126cd interfaces/lapack ; mkdir C F77
127cd interfaces/lapack/C ; mkdir src testing
128cd interfaces/lapack/F77 ; mkdir src testing
129cd interfaces/blas ; mkdir C F77
130cd interfaces/blas/C ; mkdir src testing
131cd interfaces/blas/F77 ; mkdir src testing
132cd interfaces/lapack ; mkdir C2F
133cd interfaces/lapack/C2F ; mkdir src
134mkdir ARCHS
135make -j1 -f Make.top startup
136make[1]: entrant dans le répertoire « /home/jpuydt/sage-5.4/spkg/build/atlas-3.10.0.p1/ATLAS-build »
137Make.top:1: Make.inc: Aucun fichier ou dossier de ce type
138Make.top:325: attention : écrasement des commandes pour la cible « /AtlasTest »
139Make.top:76: attention : anciennes commandes ignorées pour la cible « /AtlasTest »
140make[1]: *** Pas de règle pour fabriquer la cible « Make.inc ». Arrêt.
141make[1]: quittant le répertoire « /home/jpuydt/sage-5.4/spkg/build/atlas-3.10.0.p1/ATLAS-build »
142make: *** [startup] Erreur 2
143mv: impossible d'évaluer «lib/Makefile»: Aucun fichier ou dossier de ce type
144../src/configure: 450: ../src/configure: cannot create lib/Makefile: Directory nonexistent
145../src/configure: 451: ../src/configure: cannot create lib/Makefile: Directory nonexistent
146../src/configure: 452: ../src/configure: cannot create lib/Makefile: Directory nonexistent
147../src/configure: 453: ../src/configure: cannot create lib/Makefile: Directory nonexistent
148../src/configure: 509: ../src/configure: cannot create lib/Makefile: Directory nonexistent
149DONE configure
150Finished configuring ATLAS.
151Running make -j1
152make -j1 -f Make.top build
153make[1]: entrant dans le répertoire « /home/jpuydt/sage-5.4/spkg/build/atlas-3.10.0.p1/ATLAS-build »
154Make.top:1: Make.inc: Aucun fichier ou dossier de ce type
155Make.top:325: attention : écrasement des commandes pour la cible « /AtlasTest »
156Make.top:76: attention : anciennes commandes ignorées pour la cible « /AtlasTest »
157make[1]: *** Pas de règle pour fabriquer la cible « Make.inc ». Arrêt.
158make[1]: quittant le répertoire « /home/jpuydt/sage-5.4/spkg/build/atlas-3.10.0.p1/ATLAS-build »
159make: *** [build] Erreur 2
160------------------------------------------------------------
161  File "./spkg-install", line 508, in <module>
162    assert_success(rc, bad='Failed to build ATLAS.', good='Finished building ATLAS core.')
163  File "./spkg-install", line 76, in assert_success
164    traceback.print_stack(file=sys.stdout)
165------------------------------------------------------------
166Error:  Failed to build ATLAS.
167
168real    1m19.200s
169user    0m12.280s
170sys     0m7.090s
171************************************************************************
172Error installing package atlas-3.10.0.p1
173************************************************************************
174Please email sage-devel (http://groups.google.com/group/sage-devel)
175explaining the problem and including the relevant part of the log file
176  /home/jpuydt/sage-5.4/spkg/logs/atlas-3.10.0.p1.log
177Describe your computer, operating system, etc.
178If you want to try to fix the problem yourself, *don't* just cd to
179/home/jpuydt/sage-5.4/spkg/build/atlas-3.10.0.p1 and type 'make' or whatever is appropriate.
180Instead, the following commands setup all environment variables
181correctly and load a subshell for you to debug the error:
182  (cd '/home/jpuydt/sage-5.4/spkg/build/atlas-3.10.0.p1' && '/home/jpuydt/sage-5.4/sage' -sh)
183When you are done debugging, you can type "exit" to leave the subshell.
184************************************************************************