Ticket #10508: atlas-3.10.0.p1.ARMv7.NEON.native.log

File atlas-3.10.0.p1.ARMv7.NEON.native.log, 11.3 KB (added by Snark, 8 years ago)

Log of compilation of atlas-3.10.0.p1 with SAGE_ATLAS_ARCH=ARMv7,NEON on a real box

Line 
1atlas-3.10.0.p1
2====================================================
3Extracting package /home/jpuydt/sage-5.4/../atlas-3.10.0.p1.spkg
4-rw-r--r-- 1 jpuydt jpuydt 10037519 déc.  22 11:19 /home/jpuydt/sage-5.4/../atlas-3.10.0.p1.spkg
5Finished extraction
6****************************************************
7Host system:
8Linux hecke 3.0.27-1-ac100 #1-Ubuntu SMP PREEMPT Fri Apr 13 04:03:49 UTC 2012 armv7l armv7l armv7l GNU/Linux
9****************************************************
10C compiler: gcc
11C compiler version:
12Utilisation des specs internes.
13COLLECT_GCC=gcc
14COLLECT_LTO_WRAPPER=/usr/lib/gcc/arm-linux-gnueabihf/4.7/lto-wrapper
15Target: arm-linux-gnueabihf
16Configuré avec: ../src/configure -v --with-pkgversion='Ubuntu/Linaro 4.7.2-2ubuntu1' --with-bugurl=file:///usr/share/doc/gcc-4.7/README.Bugs --enable-languages=c,c++,go,fortran,objc,obj-c++ --prefix=/usr --program-suffix=-4.7 --enable-shared --enable-linker-build-id --with-system-zlib --libexecdir=/usr/lib --without-included-gettext --enable-threads=posix --with-gxx-include-dir=/usr/include/c++/4.7 --libdir=/usr/lib --enable-nls --with-sysroot=/ --enable-clocale=gnu --enable-libstdcxx-debug --enable-libstdcxx-time=yes --enable-gnu-unique-object --disable-libitm --enable-plugin --enable-objc-gc --enable-multilib --disable-sjlj-exceptions --with-arch=armv7-a --with-fpu=vfpv3-d16 --with-float=hard --with-mode=thumb --disable-werror --enable-checking=release --build=arm-linux-gnueabihf --host=arm-linux-gnueabihf --target=arm-linux-gnueabihf
17Modèle de thread: posix
18gcc version 4.7.2 (Ubuntu/Linaro 4.7.2-2ubuntu1)
19****************************************************
20Configuration:
21    SAGE_LOCAL: /home/jpuydt/sage-5.4/local
22    linker_Solaris?: False
23    OS_X_Lion?: False
24    PPC?: False
25    linker_Darwin?: False
26    Linux?: True
27    SPKG_DIR: /home/jpuydt/sage-5.4/spkg/build/atlas-3.10.0.p1
28    linker_GNU?: True
29    ld: GNU
30    system: Linux
31    Darwin?: False
32    machine: armv7l
33    fortran: gfortran
34    Solaris?: False
35    fortran_g95?: False
36    bits: 32bit
37    CYGWIN?: False
38    SPARC?: False
39    fortran_GNU?: True
40    FreeBSD?: False
41    32bit?: True
42    IA64?: False
43    generic_binary?: False
44    64bit?: False
45    release: 3.0.27-1-ac100
46    Intel?: False
47    processor: armv7l
48Running patch -p0 --input /home/jpuydt/sage-5.4/spkg/build/atlas-3.10.0.p1/patches/long_filenames.patch
49patching file src/bin/extract.c
50Running patch -p0 --input /home/jpuydt/sage-5.4/spkg/build/atlas-3.10.0.p1/patches/Makefile.patch
51patching file src/CONFIG/src/Makefile
52Running patch -p0 --input /home/jpuydt/sage-5.4/spkg/build/atlas-3.10.0.p1/patches/probe_comp.c.patch
53patching file src/CONFIG/src/probe_comp.c
54Running patch -p0 --input /home/jpuydt/sage-5.4/spkg/build/atlas-3.10.0.p1/patches/solaris_test.patch
55patching file src/configure
56Running patch -p0 --input /home/jpuydt/sage-5.4/spkg/build/atlas-3.10.0.p1/patches/archinfo_linux.c.patch
57patching file src/CONFIG/src/backend/archinfo_linux.c
58Running patch -p0 --input /home/jpuydt/sage-5.4/spkg/build/atlas-3.10.0.p1/patches/fix_missing_return.patch
59patching file src/tune/sysinfo/matime.c
60Building using specific architecture.
61Running configure with arch = ARMv7, isa extensions ['NEON'], archdef dir None
62Running ../src/configure --prefix=/home/jpuydt/sage-5.4/local --with-netlib-lapack-tarfile=/home/jpuydt/sage-5.4/spkg/build/atlas-3.10.0.p1/lapack-3.4.1.tar --cc="gcc" -Si latune 0 -Fa alg -fPIC -C if "/home/jpuydt/sage-5.4/local/bin/sage_fortran" -C acg "/usr/bin/gcc" -b 32 -O 1 -A 46 -V 1024
63gcc -I/home/jpuydt/sage-5.4/spkg/build/atlas-3.10.0.p1/ATLAS-build/../src//CONFIG/include  -g -w -c /home/jpuydt/sage-5.4/spkg/build/atlas-3.10.0.p1/ATLAS-build/../src//CONFIG/src/atlconf_misc.c
64gcc -I/home/jpuydt/sage-5.4/spkg/build/atlas-3.10.0.p1/ATLAS-build/../src//CONFIG/include  -g -w -o xconfig /home/jpuydt/sage-5.4/spkg/build/atlas-3.10.0.p1/ATLAS-build/../src//CONFIG/src/config.c atlconf_misc.o
65./xconfig -d s /home/jpuydt/sage-5.4/spkg/build/atlas-3.10.0.p1/ATLAS-build/../src/ -d b /home/jpuydt/sage-5.4/spkg/build/atlas-3.10.0.p1/ATLAS-build  -Si lapackref 1 -Si latune 0 -Fa alg -fPIC -C if /home/jpuydt/sage-5.4/local/bin/sage_fortran -C acg /usr/bin/gcc -b 32 -O 1 -A 46 -V 1024
66It appears you have cpu throttling enabled, which makes timings
67unreliable and an ATLAS install nonsensical.  Aborting.
68See ATLAS/INSTALL.txt for further information
69Ignoring CPU throttling by user override!
70
71gcc -I/home/jpuydt/sage-5.4/spkg/build/atlas-3.10.0.p1/ATLAS-build/../src//CONFIG/include  -g -w -o xisgcc /home/jpuydt/sage-5.4/spkg/build/atlas-3.10.0.p1/ATLAS-build/../src//CONFIG/src/IsGcc.c atlconf_misc.o
72gcc -I/home/jpuydt/sage-5.4/spkg/build/atlas-3.10.0.p1/ATLAS-build/../src//CONFIG/include  -g -w -c /home/jpuydt/sage-5.4/spkg/build/atlas-3.10.0.p1/ATLAS-build/../src//CONFIG/src/probe_comp.c
73gcc -I/home/jpuydt/sage-5.4/spkg/build/atlas-3.10.0.p1/ATLAS-build/../src//CONFIG/include  -g -w -o xprobe_comp probe_comp.o atlconf_misc.o
74rm -f config1.out
75make -j1 atlas_run atldir=/home/jpuydt/sage-5.4/spkg/build/atlas-3.10.0.p1/ATLAS-build exe=xprobe_comp redir=config1.out \
76                args="-v 0 -o atlconf.txt -O 1 -A 46 -Si nof77 0 -V 1024  -C ic '/usr/bin/gcc' -Fa ic '-fPIC' -C sm '/usr/bin/gcc' -Fa sm '-fPIC' -C dm '/usr/bin/gcc' -Fa dm '-fPIC' -C sk '/usr/bin/gcc' -Fa sk '-fPIC' -C dk '/usr/bin/gcc' -Fa dk '-fPIC' -C xc '/usr/bin/gcc' -Fa xc '-fPIC' -C gc '/usr/bin/gcc' -Fa gc '-fPIC' -C if '/home/jpuydt/sage-5.4/local/bin/sage_fortran' -Fa if '-fPIC' -b 32 -d b /home/jpuydt/sage-5.4/spkg/build/atlas-3.10.0.p1/ATLAS-build"
77make[1]: entrant dans le répertoire « /home/jpuydt/sage-5.4/spkg/build/atlas-3.10.0.p1/ATLAS-build »
78cd /home/jpuydt/sage-5.4/spkg/build/atlas-3.10.0.p1/ATLAS-build ; ./xprobe_comp -v 0 -o atlconf.txt -O 1 -A 46 -Si nof77 0 -V 1024  -C ic '/usr/bin/gcc' -Fa ic '-fPIC' -C sm '/usr/bin/gcc' -Fa sm '-fPIC' -C dm '/usr/bin/gcc' -Fa dm '-fPIC' -C sk '/usr/bin/gcc' -Fa sk '-fPIC' -C dk '/usr/bin/gcc' -Fa dk '-fPIC' -C xc '/usr/bin/gcc' -Fa xc '-fPIC' -C gc '/usr/bin/gcc' -Fa gc '-fPIC' -C if '/home/jpuydt/sage-5.4/local/bin/sage_fortran' -Fa if '-fPIC' -b 32 -d b /home/jpuydt/sage-5.4/spkg/build/atlas-3.10.0.p1/ATLAS-build > config1.out
79/usr/bin/ld: erreur: xctest passe les paramètres dans un registre VFP alors que /tmp/cccugGVu.o ne le fait pas
80Succès: échec de fusion des données spécifiques cibles du fichier /tmp/cccugGVu.o
81collect2: erreur: ld a retourné 1 code d'état d'exécution
82make[2]: *** [IRunCComp] Erreur 1
83
84
85Unable to find usable compiler for ICC; abortingMake sure compilers are in your path, and specify good compilers to configure
86(see INSTALL.txt or 'configure --help' for details)make[1]: *** [atlas_run] Erreur 1
87make[1]: quittant le répertoire « /home/jpuydt/sage-5.4/spkg/build/atlas-3.10.0.p1/ATLAS-build »
88make: *** [IRun_comp] Erreur 2
89ERROR 512 IN SYSCMND: 'make IRun_comp args="-v 0 -o atlconf.txt -O 1 -A 46 -Si nof77 0 -V 1024  -C ic '/usr/bin/gcc' -Fa ic '-fPIC' -C sm '/usr/bin/gcc' -Fa sm '-fPIC' -C dm '/usr/bin/gcc' -Fa dm '-fPIC' -C sk '/usr/bin/gcc' -Fa sk '-fPIC' -C dk '/usr/bin/gcc' -Fa dk '-fPIC' -C xc '/usr/bin/gcc' -Fa xc '-fPIC' -C gc '/usr/bin/gcc' -Fa gc '-fPIC' -C if '/home/jpuydt/sage-5.4/local/bin/sage_fortran' -Fa if '-fPIC' -b 32"'
90
91Assembly configured as GAS_ARM (7)
92
93Bad CPU MHZ value=0, res='CPU MHZ=0
94'
95
96Clock rate configured as 0Mhz
97
98Maximum number of threads configured as  2
99Parallel make command configured as '$(MAKE) -j 2'
100CPU Throttling apparently enabled!
101mkdir src bin tune interfaces
102cd src ; mkdir testing auxil blas lapack pthreads threads
103cd src/blas ; \
104           mkdir f77reference reference gemv ger gemm kbmm \
105                 level1 level2 level3 pklevel3
106cd src/blas/reference ; mkdir level1 level2 level3
107cd src/blas/level2 ; mkdir kernel
108cd src/blas/pklevel3 ; mkdir gpmm sprk
109cd src/blas/level3 ; mkdir rblas kernel
110cd src/pthreads ; mkdir blas misc
111cd src/pthreads/blas ; mkdir level1 level2 level3
112cd src/threads ; mkdir blas lapack
113cd src/threads/blas ; mkdir level3 level2
114cd tune ; mkdir blas sysinfo lapack threads
115cd tune/blas ; mkdir gemm gemv ger level1 level3
116cd interfaces ; mkdir blas lapack
117cd interfaces/lapack ; mkdir C F77
118cd interfaces/lapack/C ; mkdir src testing
119cd interfaces/lapack/F77 ; mkdir src testing
120cd interfaces/blas ; mkdir C F77
121cd interfaces/blas/C ; mkdir src testing
122cd interfaces/blas/F77 ; mkdir src testing
123cd interfaces/lapack ; mkdir C2F
124cd interfaces/lapack/C2F ; mkdir src
125mkdir ARCHS
126make -j1 -f Make.top startup
127make[1]: entrant dans le répertoire « /home/jpuydt/sage-5.4/spkg/build/atlas-3.10.0.p1/ATLAS-build »
128Make.top:1: Make.inc: Aucun fichier ou dossier de ce type
129Make.top:325: attention : écrasement des commandes pour la cible « /AtlasTest »
130Make.top:76: attention : anciennes commandes ignorées pour la cible « /AtlasTest »
131make[1]: *** Pas de règle pour fabriquer la cible « Make.inc ». Arrêt.
132make[1]: quittant le répertoire « /home/jpuydt/sage-5.4/spkg/build/atlas-3.10.0.p1/ATLAS-build »
133make: *** [startup] Erreur 2
134mv: impossible d'évaluer «lib/Makefile»: Aucun fichier ou dossier de ce type
135../src/configure: 450: ../src/configure: cannot create lib/Makefile: Directory nonexistent
136../src/configure: 451: ../src/configure: cannot create lib/Makefile: Directory nonexistent
137../src/configure: 452: ../src/configure: cannot create lib/Makefile: Directory nonexistent
138../src/configure: 453: ../src/configure: cannot create lib/Makefile: Directory nonexistent
139../src/configure: 509: ../src/configure: cannot create lib/Makefile: Directory nonexistent
140DONE configure
141Finished configuring ATLAS.
142Running make -j1
143make -j1 -f Make.top build
144make[1]: entrant dans le répertoire « /home/jpuydt/sage-5.4/spkg/build/atlas-3.10.0.p1/ATLAS-build »
145Make.top:1: Make.inc: Aucun fichier ou dossier de ce type
146Make.top:325: attention : écrasement des commandes pour la cible « /AtlasTest »
147Make.top:76: attention : anciennes commandes ignorées pour la cible « /AtlasTest »
148make[1]: *** Pas de règle pour fabriquer la cible « Make.inc ». Arrêt.
149make[1]: quittant le répertoire « /home/jpuydt/sage-5.4/spkg/build/atlas-3.10.0.p1/ATLAS-build »
150make: *** [build] Erreur 2
151------------------------------------------------------------
152  File "./spkg-install", line 508, in <module>
153    assert_success(rc, bad='Failed to build ATLAS.', good='Finished building ATLAS core.')
154  File "./spkg-install", line 76, in assert_success
155    traceback.print_stack(file=sys.stdout)
156------------------------------------------------------------
157Error:  Failed to build ATLAS.
158
159real    0m58.703s
160user    0m10.120s
161sys     0m4.970s
162************************************************************************
163Error installing package atlas-3.10.0.p1
164************************************************************************
165Please email sage-devel (http://groups.google.com/group/sage-devel)
166explaining the problem and including the relevant part of the log file
167  /home/jpuydt/sage-5.4/spkg/logs/atlas-3.10.0.p1.log
168Describe your computer, operating system, etc.
169If you want to try to fix the problem yourself, *don't* just cd to
170/home/jpuydt/sage-5.4/spkg/build/atlas-3.10.0.p1 and type 'make' or whatever is appropriate.
171Instead, the following commands setup all environment variables
172correctly and load a subshell for you to debug the error:
173  (cd '/home/jpuydt/sage-5.4/spkg/build/atlas-3.10.0.p1' && '/home/jpuydt/sage-5.4/sage' -sh)
174When you are done debugging, you can type "exit" to leave the subshell.
175************************************************************************